You are viewing a plain text version of this content. The canonical link for it is here.
Posted to dev@kafka.apache.org by Apache Jenkins Server <je...@builds.apache.org> on 2016/10/11 01:51:34 UTC
Build failed in Jenkins: kafka-0.10.1-jdk7 #61
See <https://builds.apache.org/job/kafka-0.10.1-jdk7/61/>
------------------------------------------
Started by an SCM change
[EnvInject] - Loading node environment variables.
Building remotely on ubuntu-eu2 (Ubuntu ubuntu ubuntu-eu docker) in workspace <https://builds.apache.org/job/kafka-0.10.1-jdk7/ws/>
java.io.IOException: Failed to mkdirs: <https://builds.apache.org/job/kafka-0.10.1-jdk7/ws/>
at hudson.FilePath.mkdirs(FilePath.java:1191)
at hudson.model.AbstractProject.checkout(AbstractProject.java:1267)
at hudson.model.AbstractBuild$AbstractBuildExecution.defaultCheckout(AbstractBuild.java:604)
at jenkins.scm.SCMCheckoutStrategy.checkout(SCMCheckoutStrategy.java:86)
at hudson.model.AbstractBuild$AbstractBuildExecution.run(AbstractBuild.java:529)
at hudson.model.Run.execute(Run.java:1741)
at hudson.model.FreeStyleBuild.run(FreeStyleBuild.java:43)
at hudson.model.ResourceController.execute(ResourceController.java:98)
at hudson.model.Executor.run(Executor.java:410)
Retrying after 10 seconds
java.io.IOException: Failed to mkdirs: <https://builds.apache.org/job/kafka-0.10.1-jdk7/ws/>
at hudson.FilePath.mkdirs(FilePath.java:1191)
at hudson.model.AbstractProject.checkout(AbstractProject.java:1267)
at hudson.model.AbstractBuild$AbstractBuildExecution.defaultCheckout(AbstractBuild.java:604)
at jenkins.scm.SCMCheckoutStrategy.checkout(SCMCheckoutStrategy.java:86)
at hudson.model.AbstractBuild$AbstractBuildExecution.run(AbstractBuild.java:529)
at hudson.model.Run.execute(Run.java:1741)
at hudson.model.FreeStyleBuild.run(FreeStyleBuild.java:43)
at hudson.model.ResourceController.execute(ResourceController.java:98)
at hudson.model.Executor.run(Executor.java:410)
Retrying after 10 seconds
java.io.IOException: Failed to mkdirs: <https://builds.apache.org/job/kafka-0.10.1-jdk7/ws/>
at hudson.FilePath.mkdirs(FilePath.java:1191)
at hudson.model.AbstractProject.checkout(AbstractProject.java:1267)
at hudson.model.AbstractBuild$AbstractBuildExecution.defaultCheckout(AbstractBuild.java:604)
at jenkins.scm.SCMCheckoutStrategy.checkout(SCMCheckoutStrategy.java:86)
at hudson.model.AbstractBuild$AbstractBuildExecution.run(AbstractBuild.java:529)
at hudson.model.Run.execute(Run.java:1741)
at hudson.model.FreeStyleBuild.run(FreeStyleBuild.java:43)
at hudson.model.ResourceController.execute(ResourceController.java:98)
at hudson.model.Executor.run(Executor.java:410)
Recording test results
ERROR: Build step failed with exception
<https://builds.apache.org/job/kafka-0.10.1-jdk7/ws/> does not exist.
at org.apache.tools.ant.types.AbstractFileSet.getDirectoryScanner(AbstractFileSet.java:483)
at org.apache.tools.ant.types.AbstractFileSet.getDirectoryScanner(AbstractFileSet.java:460)
at hudson.tasks.junit.JUnitParser$ParseResultCallable.invoke(JUnitParser.java:127)
at hudson.tasks.junit.JUnitParser$ParseResultCallable.invoke(JUnitParser.java:107)
at hudson.FilePath$FileCallableWrapper.call(FilePath.java:2772)
at hudson.remoting.UserRequest.perform(UserRequest.java:153)
at hudson.remoting.UserRequest.perform(UserRequest.java:50)
at hudson.remoting.Request$2.run(Request.java:332)
at hudson.remoting.InterceptingExecutorService$1.call(InterceptingExecutorService.java:68)
at java.util.concurrent.FutureTask.run(FutureTask.java:262)
at java.util.concurrent.ThreadPoolExecutor.runWorker(ThreadPoolExecutor.java:1145)
at java.util.concurrent.ThreadPoolExecutor$Worker.run(ThreadPoolExecutor.java:615)
at java.lang.Thread.run(Thread.java:745)
at ......remote call to ubuntu-eu2(Native Method)
at hudson.remoting.Channel.attachCallSiteStackTrace(Channel.java:1416)
at hudson.remoting.UserResponse.retrieve(UserRequest.java:253)
at hudson.remoting.Channel.call(Channel.java:781)
at hudson.FilePath.act(FilePath.java:1007)
at hudson.FilePath.act(FilePath.java:996)
at hudson.tasks.junit.JUnitParser.parseResult(JUnitParser.java:103)
at hudson.tasks.junit.JUnitResultArchiver.parse(JUnitResultArchiver.java:128)
at hudson.tasks.junit.JUnitResultArchiver.perform(JUnitResultArchiver.java:149)
at hudson.tasks.BuildStepCompatibilityLayer.perform(BuildStepCompatibilityLayer.java:78)
at hudson.tasks.BuildStepMonitor$1.perform(BuildStepMonitor.java:20)
at hudson.model.AbstractBuild$AbstractBuildExecution.perform(AbstractBuild.java:779)
at hudson.model.AbstractBuild$AbstractBuildExecution.performAllBuildSteps(AbstractBuild.java:720)
at hudson.model.Build$BuildExecution.post2(Build.java:185)
at hudson.model.AbstractBuild$AbstractBuildExecution.post(AbstractBuild.java:665)
at hudson.model.Run.execute(Run.java:1766)
at hudson.model.FreeStyleBuild.run(FreeStyleBuild.java:43)
at hudson.model.ResourceController.execute(ResourceController.java:98)
at hudson.model.Executor.run(Executor.java:410)
Build step 'Publish JUnit test result report' marked build as failure
Jenkins build is back to normal : kafka-0.10.1-jdk7 #66
Posted by Apache Jenkins Server <je...@builds.apache.org>.
See <https://builds.apache.org/job/kafka-0.10.1-jdk7/66/changes>
Build failed in Jenkins: kafka-0.10.1-jdk7 #65
Posted by Apache Jenkins Server <je...@builds.apache.org>.
See <https://builds.apache.org/job/kafka-0.10.1-jdk7/65/changes>
Changes:
[me] KAFKA-4290: Fix timeout overflow in WorkerCoordinator.poll
------------------------------------------
[...truncated 4984 lines...]
kafka.coordinator.GroupMetadataManagerTest > testCommitOffset STARTED
kafka.coordinator.GroupMetadataManagerTest > testCommitOffset PASSED
kafka.coordinator.GroupMetadataManagerTest > testStoreGroupErrorMapping STARTED
kafka.coordinator.GroupMetadataManagerTest > testStoreGroupErrorMapping PASSED
kafka.coordinator.GroupMetadataManagerTest > testCommitOffsetFailure STARTED
kafka.coordinator.GroupMetadataManagerTest > testCommitOffsetFailure PASSED
kafka.coordinator.GroupMetadataManagerTest > testExpireOffset STARTED
kafka.coordinator.GroupMetadataManagerTest > testExpireOffset PASSED
kafka.coordinator.GroupMetadataManagerTest > testExpireOffsetsWithActiveGroup STARTED
kafka.coordinator.GroupMetadataManagerTest > testExpireOffsetsWithActiveGroup PASSED
kafka.coordinator.GroupMetadataManagerTest > testStoreEmptyGroup STARTED
kafka.coordinator.GroupMetadataManagerTest > testStoreEmptyGroup PASSED
kafka.coordinator.MemberMetadataTest > testMatchesSupportedProtocols STARTED
kafka.coordinator.MemberMetadataTest > testMatchesSupportedProtocols PASSED
kafka.coordinator.MemberMetadataTest > testMetadata STARTED
kafka.coordinator.MemberMetadataTest > testMetadata PASSED
kafka.coordinator.MemberMetadataTest > testMetadataRaisesOnUnsupportedProtocol STARTED
kafka.coordinator.MemberMetadataTest > testMetadataRaisesOnUnsupportedProtocol PASSED
kafka.coordinator.MemberMetadataTest > testVoteForPreferredProtocol STARTED
kafka.coordinator.MemberMetadataTest > testVoteForPreferredProtocol PASSED
kafka.coordinator.MemberMetadataTest > testVoteRaisesOnNoSupportedProtocols STARTED
kafka.coordinator.MemberMetadataTest > testVoteRaisesOnNoSupportedProtocols PASSED
kafka.metrics.KafkaTimerTest > testKafkaTimer STARTED
kafka.metrics.KafkaTimerTest > testKafkaTimer PASSED
kafka.metrics.MetricsTest > testMetricsReporterAfterDeletingTopic STARTED
kafka.metrics.MetricsTest > testMetricsReporterAfterDeletingTopic PASSED
kafka.metrics.MetricsTest > testBrokerTopicMetricsUnregisteredAfterDeletingTopic STARTED
kafka.metrics.MetricsTest > testBrokerTopicMetricsUnregisteredAfterDeletingTopic PASSED
kafka.metrics.MetricsTest > testClusterIdMetric STARTED
kafka.metrics.MetricsTest > testClusterIdMetric PASSED
kafka.metrics.MetricsTest > testMetricsLeak STARTED
kafka.metrics.MetricsTest > testMetricsLeak PASSED
kafka.message.MessageWriterTest > testWithNoCompressionAttribute STARTED
kafka.message.MessageWriterTest > testWithNoCompressionAttribute PASSED
kafka.message.MessageWriterTest > testWithCompressionAttribute STARTED
kafka.message.MessageWriterTest > testWithCompressionAttribute PASSED
kafka.message.MessageWriterTest > testBufferingOutputStream STARTED
kafka.message.MessageWriterTest > testBufferingOutputStream PASSED
kafka.message.MessageWriterTest > testWithKey STARTED
kafka.message.MessageWriterTest > testWithKey PASSED
kafka.message.MessageTest > testChecksum STARTED
kafka.message.MessageTest > testChecksum PASSED
kafka.message.MessageTest > testInvalidTimestamp STARTED
kafka.message.MessageTest > testInvalidTimestamp PASSED
kafka.message.MessageTest > testIsHashable STARTED
kafka.message.MessageTest > testIsHashable PASSED
kafka.message.MessageTest > testInvalidTimestampAndMagicValueCombination STARTED
kafka.message.MessageTest > testInvalidTimestampAndMagicValueCombination PASSED
kafka.message.MessageTest > testExceptionMapping STARTED
kafka.message.MessageTest > testExceptionMapping PASSED
kafka.message.MessageTest > testFieldValues STARTED
kafka.message.MessageTest > testFieldValues PASSED
kafka.message.MessageTest > testInvalidMagicByte STARTED
kafka.message.MessageTest > testInvalidMagicByte PASSED
kafka.message.MessageTest > testEquality STARTED
kafka.message.MessageTest > testEquality PASSED
kafka.message.MessageTest > testMessageFormatConversion STARTED
kafka.message.MessageTest > testMessageFormatConversion PASSED
kafka.message.MessageCompressionTest > testCompressSize STARTED
kafka.message.MessageCompressionTest > testCompressSize PASSED
kafka.message.MessageCompressionTest > testLZ4FramingV0 STARTED
kafka.message.MessageCompressionTest > testLZ4FramingV0 PASSED
kafka.message.MessageCompressionTest > testLZ4FramingV1 STARTED
kafka.message.MessageCompressionTest > testLZ4FramingV1 PASSED
kafka.message.MessageCompressionTest > testSimpleCompressDecompress STARTED
kafka.message.MessageCompressionTest > testSimpleCompressDecompress PASSED
kafka.message.ByteBufferMessageSetTest > testMessageWithProvidedOffsetSeq STARTED
kafka.message.ByteBufferMessageSetTest > testMessageWithProvidedOffsetSeq PASSED
kafka.message.ByteBufferMessageSetTest > testWriteFullyTo STARTED
kafka.message.ByteBufferMessageSetTest > testWriteFullyTo PASSED
kafka.message.ByteBufferMessageSetTest > testValidBytes STARTED
kafka.message.ByteBufferMessageSetTest > testValidBytes PASSED
kafka.message.ByteBufferMessageSetTest > testValidBytesWithCompression STARTED
kafka.message.ByteBufferMessageSetTest > testValidBytesWithCompression PASSED
kafka.message.ByteBufferMessageSetTest > testWriteToChannelThatConsumesPartially STARTED
kafka.message.ByteBufferMessageSetTest > testWriteToChannelThatConsumesPartially PASSED
kafka.message.ByteBufferMessageSetTest > testOffsetAssignmentAfterMessageFormatConversion STARTED
kafka.message.ByteBufferMessageSetTest > testOffsetAssignmentAfterMessageFormatConversion PASSED
kafka.message.ByteBufferMessageSetTest > testIteratorIsConsistent STARTED
kafka.message.ByteBufferMessageSetTest > testIteratorIsConsistent PASSED
kafka.message.ByteBufferMessageSetTest > testAbsoluteOffsetAssignment STARTED
kafka.message.ByteBufferMessageSetTest > testAbsoluteOffsetAssignment PASSED
kafka.message.ByteBufferMessageSetTest > testCreateTime STARTED
kafka.message.ByteBufferMessageSetTest > testCreateTime PASSED
kafka.message.ByteBufferMessageSetTest > testInvalidCreateTime STARTED
kafka.message.ByteBufferMessageSetTest > testInvalidCreateTime PASSED
kafka.message.ByteBufferMessageSetTest > testWrittenEqualsRead STARTED
kafka.message.ByteBufferMessageSetTest > testWrittenEqualsRead PASSED
kafka.message.ByteBufferMessageSetTest > testLogAppendTime STARTED
kafka.message.ByteBufferMessageSetTest > testLogAppendTime PASSED
kafka.message.ByteBufferMessageSetTest > testWriteTo STARTED
kafka.message.ByteBufferMessageSetTest > testWriteTo PASSED
kafka.message.ByteBufferMessageSetTest > testEquals STARTED
kafka.message.ByteBufferMessageSetTest > testEquals PASSED
kafka.message.ByteBufferMessageSetTest > testSizeInBytes STARTED
kafka.message.ByteBufferMessageSetTest > testSizeInBytes PASSED
kafka.message.ByteBufferMessageSetTest > testIterator STARTED
kafka.message.ByteBufferMessageSetTest > testIterator PASSED
kafka.message.ByteBufferMessageSetTest > testRelativeOffsetAssignment STARTED
kafka.message.ByteBufferMessageSetTest > testRelativeOffsetAssignment PASSED
kafka.api.RackAwareAutoTopicCreationTest > testAutoCreateTopic STARTED
kafka.api.RackAwareAutoTopicCreationTest > testAutoCreateTopic PASSED
kafka.api.AdminClientTest > testDescribeGroup STARTED
kafka.api.AdminClientTest > testDescribeGroup PASSED
kafka.api.AdminClientTest > testDescribeConsumerGroup STARTED
kafka.api.AdminClientTest > testDescribeConsumerGroup PASSED
kafka.api.AdminClientTest > testListGroups STARTED
kafka.api.AdminClientTest > testListGroups PASSED
kafka.api.AdminClientTest > testDescribeConsumerGroupForNonExistentGroup STARTED
kafka.api.AdminClientTest > testDescribeConsumerGroupForNonExistentGroup PASSED
kafka.api.SaslPlainPlaintextConsumerTest > testCoordinatorFailover STARTED
kafka.api.SaslPlainPlaintextConsumerTest > testCoordinatorFailover PASSED
kafka.api.SaslPlainPlaintextConsumerTest > testSimpleConsumption STARTED
kafka.api.SaslPlainPlaintextConsumerTest > testSimpleConsumption PASSED
kafka.api.SaslPlaintextConsumerTest > testCoordinatorFailover STARTED
:kafka-0.10.1-jdk7:core:test FAILED
:test_core_2_11 FAILED
FAILURE: Build failed with an exception.
* What went wrong:
Execution failed for task ':core:test'.
> Process 'Gradle Test Executor 2' finished with non-zero exit value 1
* Try:
Run with --stacktrace option to get the stack trace. Run with --info or --debug option to get more log output.
BUILD FAILED
Total time: 2 hrs 3 mins 3.144 secs
Build step 'Execute shell' marked build as failure
Recording test results
Setting GRADLE_2_4_RC_2_HOME=/home/jenkins/jenkins-slave/tools/hudson.plugins.gradle.GradleInstallation/Gradle_2.4-rc-2
Setting GRADLE_2_4_RC_2_HOME=/home/jenkins/jenkins-slave/tools/hudson.plugins.gradle.GradleInstallation/Gradle_2.4-rc-2
Build failed in Jenkins: kafka-0.10.1-jdk7 #64
Posted by Apache Jenkins Server <je...@builds.apache.org>.
See <https://builds.apache.org/job/kafka-0.10.1-jdk7/64/>
------------------------------------------
Started by an SCM change
Started by an SCM change
Started by an SCM change
[EnvInject] - Loading node environment variables.
Building remotely on ubuntu-eu2 (Ubuntu ubuntu ubuntu-eu docker) in workspace <https://builds.apache.org/job/kafka-0.10.1-jdk7/ws/>
java.io.IOException: Failed to mkdirs: <https://builds.apache.org/job/kafka-0.10.1-jdk7/ws/>
at hudson.FilePath.mkdirs(FilePath.java:1191)
at hudson.model.AbstractProject.checkout(AbstractProject.java:1267)
at hudson.model.AbstractBuild$AbstractBuildExecution.defaultCheckout(AbstractBuild.java:604)
at jenkins.scm.SCMCheckoutStrategy.checkout(SCMCheckoutStrategy.java:86)
at hudson.model.AbstractBuild$AbstractBuildExecution.run(AbstractBuild.java:529)
at hudson.model.Run.execute(Run.java:1741)
at hudson.model.FreeStyleBuild.run(FreeStyleBuild.java:43)
at hudson.model.ResourceController.execute(ResourceController.java:98)
at hudson.model.Executor.run(Executor.java:410)
Retrying after 10 seconds
java.io.IOException: Failed to mkdirs: <https://builds.apache.org/job/kafka-0.10.1-jdk7/ws/>
at hudson.FilePath.mkdirs(FilePath.java:1191)
at hudson.model.AbstractProject.checkout(AbstractProject.java:1267)
at hudson.model.AbstractBuild$AbstractBuildExecution.defaultCheckout(AbstractBuild.java:604)
at jenkins.scm.SCMCheckoutStrategy.checkout(SCMCheckoutStrategy.java:86)
at hudson.model.AbstractBuild$AbstractBuildExecution.run(AbstractBuild.java:529)
at hudson.model.Run.execute(Run.java:1741)
at hudson.model.FreeStyleBuild.run(FreeStyleBuild.java:43)
at hudson.model.ResourceController.execute(ResourceController.java:98)
at hudson.model.Executor.run(Executor.java:410)
Retrying after 10 seconds
java.io.IOException: Failed to mkdirs: <https://builds.apache.org/job/kafka-0.10.1-jdk7/ws/>
at hudson.FilePath.mkdirs(FilePath.java:1191)
at hudson.model.AbstractProject.checkout(AbstractProject.java:1267)
at hudson.model.AbstractBuild$AbstractBuildExecution.defaultCheckout(AbstractBuild.java:604)
at jenkins.scm.SCMCheckoutStrategy.checkout(SCMCheckoutStrategy.java:86)
at hudson.model.AbstractBuild$AbstractBuildExecution.run(AbstractBuild.java:529)
at hudson.model.Run.execute(Run.java:1741)
at hudson.model.FreeStyleBuild.run(FreeStyleBuild.java:43)
at hudson.model.ResourceController.execute(ResourceController.java:98)
at hudson.model.Executor.run(Executor.java:410)
Recording test results
ERROR: Build step failed with exception
<https://builds.apache.org/job/kafka-0.10.1-jdk7/ws/> does not exist.
at org.apache.tools.ant.types.AbstractFileSet.getDirectoryScanner(AbstractFileSet.java:483)
at org.apache.tools.ant.types.AbstractFileSet.getDirectoryScanner(AbstractFileSet.java:460)
at hudson.tasks.junit.JUnitParser$ParseResultCallable.invoke(JUnitParser.java:127)
at hudson.tasks.junit.JUnitParser$ParseResultCallable.invoke(JUnitParser.java:107)
at hudson.FilePath$FileCallableWrapper.call(FilePath.java:2772)
at hudson.remoting.UserRequest.perform(UserRequest.java:153)
at hudson.remoting.UserRequest.perform(UserRequest.java:50)
at hudson.remoting.Request$2.run(Request.java:332)
at hudson.remoting.InterceptingExecutorService$1.call(InterceptingExecutorService.java:68)
at java.util.concurrent.FutureTask.run(FutureTask.java:262)
at java.util.concurrent.ThreadPoolExecutor.runWorker(ThreadPoolExecutor.java:1145)
at java.util.concurrent.ThreadPoolExecutor$Worker.run(ThreadPoolExecutor.java:615)
at java.lang.Thread.run(Thread.java:745)
at ......remote call to ubuntu-eu2(Native Method)
at hudson.remoting.Channel.attachCallSiteStackTrace(Channel.java:1416)
at hudson.remoting.UserResponse.retrieve(UserRequest.java:253)
at hudson.remoting.Channel.call(Channel.java:781)
at hudson.FilePath.act(FilePath.java:1007)
at hudson.FilePath.act(FilePath.java:996)
at hudson.tasks.junit.JUnitParser.parseResult(JUnitParser.java:103)
at hudson.tasks.junit.JUnitResultArchiver.parse(JUnitResultArchiver.java:128)
at hudson.tasks.junit.JUnitResultArchiver.perform(JUnitResultArchiver.java:149)
at hudson.tasks.BuildStepCompatibilityLayer.perform(BuildStepCompatibilityLayer.java:78)
at hudson.tasks.BuildStepMonitor$1.perform(BuildStepMonitor.java:20)
at hudson.model.AbstractBuild$AbstractBuildExecution.perform(AbstractBuild.java:779)
at hudson.model.AbstractBuild$AbstractBuildExecution.performAllBuildSteps(AbstractBuild.java:720)
at hudson.model.Build$BuildExecution.post2(Build.java:185)
at hudson.model.AbstractBuild$AbstractBuildExecution.post(AbstractBuild.java:665)
at hudson.model.Run.execute(Run.java:1766)
at hudson.model.FreeStyleBuild.run(FreeStyleBuild.java:43)
at hudson.model.ResourceController.execute(ResourceController.java:98)
at hudson.model.Executor.run(Executor.java:410)
Build step 'Publish JUnit test result report' marked build as failure
Build failed in Jenkins: kafka-0.10.1-jdk7 #63
Posted by Apache Jenkins Server <je...@builds.apache.org>.
See <https://builds.apache.org/job/kafka-0.10.1-jdk7/63/changes>
Changes:
[jason] MINOR: Add images missing from documentation
------------------------------------------
[...truncated 2407 lines...]
kafka.api.AdminClientTest > testListGroups STARTED
kafka.api.AdminClientTest > testListGroups PASSED
kafka.api.AdminClientTest > testDescribeConsumerGroupForNonExistentGroup STARTED
kafka.api.AdminClientTest > testDescribeConsumerGroupForNonExistentGroup PASSED
kafka.api.ProducerBounceTest > testBrokerFailure STARTED
kafka.api.ProducerBounceTest > testBrokerFailure PASSED
kafka.api.ClientIdQuotaTest > testProducerConsumerOverrideUnthrottled STARTED
kafka.api.ClientIdQuotaTest > testProducerConsumerOverrideUnthrottled PASSED
kafka.api.ClientIdQuotaTest > testThrottledProducerConsumer STARTED
kafka.api.ClientIdQuotaTest > testThrottledProducerConsumer PASSED
kafka.api.ClientIdQuotaTest > testQuotaOverrideDelete STARTED
kafka.api.ClientIdQuotaTest > testQuotaOverrideDelete PASSED
kafka.api.test.ProducerCompressionTest > testCompression[0] STARTED
kafka.api.test.ProducerCompressionTest > testCompression[0] PASSED
kafka.api.test.ProducerCompressionTest > testCompression[1] STARTED
kafka.api.test.ProducerCompressionTest > testCompression[1] PASSED
kafka.api.test.ProducerCompressionTest > testCompression[2] STARTED
kafka.api.test.ProducerCompressionTest > testCompression[2] PASSED
kafka.api.test.ProducerCompressionTest > testCompression[3] STARTED
kafka.api.test.ProducerCompressionTest > testCompression[3] PASSED
kafka.api.SaslPlainSslEndToEndAuthorizationTest > testNoConsumeWithoutDescribeAclViaSubscribe STARTED
kafka.api.SaslPlainSslEndToEndAuthorizationTest > testNoConsumeWithoutDescribeAclViaSubscribe PASSED
kafka.api.SaslPlainSslEndToEndAuthorizationTest > testProduceConsumeViaAssign STARTED
kafka.api.SaslPlainSslEndToEndAuthorizationTest > testProduceConsumeViaAssign PASSED
kafka.api.SaslPlainSslEndToEndAuthorizationTest > testNoConsumeWithDescribeAclViaAssign STARTED
kafka.api.SaslPlainSslEndToEndAuthorizationTest > testNoConsumeWithDescribeAclViaAssign PASSED
kafka.api.SaslPlainSslEndToEndAuthorizationTest > testNoConsumeWithDescribeAclViaSubscribe STARTED
kafka.api.SaslPlainSslEndToEndAuthorizationTest > testNoConsumeWithDescribeAclViaSubscribe PASSED
kafka.api.SaslPlainSslEndToEndAuthorizationTest > testNoConsumeWithoutDescribeAclViaAssign STARTED
kafka.api.SaslPlainSslEndToEndAuthorizationTest > testNoConsumeWithoutDescribeAclViaAssign PASSED
kafka.api.SaslPlainSslEndToEndAuthorizationTest > testNoGroupAcl STARTED
kafka.api.SaslPlainSslEndToEndAuthorizationTest > testNoGroupAcl PASSED
kafka.api.SaslPlainSslEndToEndAuthorizationTest > testNoProduceWithDescribeAcl STARTED
kafka.api.SaslPlainSslEndToEndAuthorizationTest > testNoProduceWithDescribeAcl PASSED
kafka.api.SaslPlainSslEndToEndAuthorizationTest > testProduceConsumeViaSubscribe STARTED
kafka.api.SaslPlainSslEndToEndAuthorizationTest > testProduceConsumeViaSubscribe PASSED
kafka.api.SaslPlainSslEndToEndAuthorizationTest > testNoProduceWithoutDescribeAcl STARTED
kafka.api.SaslPlainSslEndToEndAuthorizationTest > testNoProduceWithoutDescribeAcl PASSED
kafka.api.ConsumerBounceTest > testSeekAndCommitWithBrokerFailures STARTED
kafka.api.ConsumerBounceTest > testSeekAndCommitWithBrokerFailures PASSED
kafka.api.ConsumerBounceTest > testConsumptionWithBrokerFailures STARTED
kafka.api.ConsumerBounceTest > testConsumptionWithBrokerFailures PASSED
kafka.api.SaslPlaintextConsumerTest > testCoordinatorFailover STARTED
kafka.api.SaslPlaintextConsumerTest > testCoordinatorFailover PASSED
kafka.api.SaslPlaintextConsumerTest > testSimpleConsumption STARTED
kafka.api.SaslPlaintextConsumerTest > testSimpleConsumption PASSED
kafka.api.SaslMultiMechanismConsumerTest > testMultipleBrokerMechanisms STARTED
ERROR: Could not install GRADLE_2_4_RC_2_HOME
java.lang.NullPointerException
at hudson.plugins.toolenv.ToolEnvBuildWrapper$1.buildEnvVars(ToolEnvBuildWrapper.java:46)
at hudson.model.AbstractBuild.getEnvironment(AbstractBuild.java:931)
at hudson.plugins.git.GitSCM.getParamExpandedRepos(GitSCM.java:404)
at hudson.plugins.git.GitSCM.compareRemoteRevisionWithImpl(GitSCM.java:609)
at hudson.plugins.git.GitSCM.compareRemoteRevisionWith(GitSCM.java:574)
at hudson.scm.SCM.compareRemoteRevisionWith(SCM.java:381)
at hudson.scm.SCM.poll(SCM.java:398)
at hudson.model.AbstractProject._poll(AbstractProject.java:1446)
at hudson.model.AbstractProject.poll(AbstractProject.java:1349)
at hudson.triggers.SCMTrigger$Runner.runPolling(SCMTrigger.java:528)
at hudson.triggers.SCMTrigger$Runner.run(SCMTrigger.java:557)
at hudson.util.SequentialExecutionQueue$QueueEntry.run(SequentialExecutionQueue.java:119)
at java.util.concurrent.Executors$RunnableAdapter.call(Executors.java:511)
at java.util.concurrent.FutureTask.run(FutureTask.java:266)
at java.util.concurrent.ThreadPoolExecutor.runWorker(ThreadPoolExecutor.java:1142)
at java.util.concurrent.ThreadPoolExecutor$Worker.run(ThreadPoolExecutor.java:617)
at java.lang.Thread.run(Thread.java:745)
kafka.api.SaslMultiMechanismConsumerTest > testMultipleBrokerMechanisms PASSED
kafka.api.SaslMultiMechanismConsumerTest > testCoordinatorFailover STARTED
kafka.api.SaslMultiMechanismConsumerTest > testCoordinatorFailover PASSED
kafka.api.SaslMultiMechanismConsumerTest > testSimpleConsumption STARTED
kafka.api.SaslMultiMechanismConsumerTest > testSimpleConsumption PASSED
kafka.api.FetchRequestTest > testShuffleWithSingleTopic STARTED
kafka.api.FetchRequestTest > testShuffleWithSingleTopic PASSED
kafka.api.FetchRequestTest > testShuffle STARTED
kafka.api.FetchRequestTest > testShuffle PASSED
kafka.api.UserClientIdQuotaTest > testProducerConsumerOverrideUnthrottled STARTED
kafka.api.UserClientIdQuotaTest > testProducerConsumerOverrideUnthrottled PASSED
kafka.api.UserClientIdQuotaTest > testThrottledProducerConsumer STARTED
kafka.api.UserClientIdQuotaTest > testThrottledProducerConsumer PASSED
kafka.api.UserClientIdQuotaTest > testQuotaOverrideDelete STARTED
kafka.api.UserClientIdQuotaTest > testQuotaOverrideDelete PASSED
kafka.api.SslProducerSendTest > testSendNonCompressedMessageWithCreateTime STARTED
kafka.api.SslProducerSendTest > testSendNonCompressedMessageWithCreateTime PASSED
kafka.api.SslProducerSendTest > testClose STARTED
kafka.api.SslProducerSendTest > testClose PASSED
kafka.api.SslProducerSendTest > testFlush STARTED
kafka.api.SslProducerSendTest > testFlush PASSED
kafka.api.SslProducerSendTest > testSendToPartition STARTED
kafka.api.SslProducerSendTest > testSendToPartition PASSED
kafka.api.SslProducerSendTest > testSendOffset STARTED
kafka.api.SslProducerSendTest > testSendOffset PASSED
kafka.api.SslProducerSendTest > testSendCompressedMessageWithCreateTime STARTED
kafka.api.SslProducerSendTest > testSendCompressedMessageWithCreateTime PASSED
kafka.api.SslProducerSendTest > testCloseWithZeroTimeoutFromCallerThread STARTED
kafka.api.SslProducerSendTest > testCloseWithZeroTimeoutFromCallerThread PASSED
kafka.api.SslProducerSendTest > testCloseWithZeroTimeoutFromSenderThread STARTED
kafka.api.SslProducerSendTest > testCloseWithZeroTimeoutFromSenderThread PASSED
kafka.api.PlaintextConsumerTest > testEarliestOrLatestOffsets STARTED
kafka.api.PlaintextConsumerTest > testEarliestOrLatestOffsets PASSED
kafka.api.PlaintextConsumerTest > testPartitionsForAutoCreate STARTED
kafka.api.PlaintextConsumerTest > testPartitionsForAutoCreate PASSED
kafka.api.PlaintextConsumerTest > testShrinkingTopicSubscriptions STARTED
kafka.api.PlaintextConsumerTest > testShrinkingTopicSubscriptions PASSED
kafka.api.PlaintextConsumerTest > testMaxPollIntervalMs STARTED
kafka.api.PlaintextConsumerTest > testMaxPollIntervalMs PASSED
kafka.api.PlaintextConsumerTest > testOffsetsForTimes STARTED
kafka.api.PlaintextConsumerTest > testOffsetsForTimes PASSED
kafka.api.PlaintextConsumerTest > testSubsequentPatternSubscription STARTED
kafka.api.PlaintextConsumerTest > testSubsequentPatternSubscription PASSED
kafka.api.PlaintextConsumerTest > testAsyncCommit STARTED
kafka.api.PlaintextConsumerTest > testAsyncCommit PASSED
kafka.api.PlaintextConsumerTest > testLowMaxFetchSizeForRequestAndPartition STARTED
ERROR: Could not install GRADLE_2_4_RC_2_HOME
java.lang.NullPointerException
at hudson.plugins.toolenv.ToolEnvBuildWrapper$1.buildEnvVars(ToolEnvBuildWrapper.java:46)
at hudson.model.AbstractBuild.getEnvironment(AbstractBuild.java:931)
at hudson.plugins.git.GitSCM.getParamExpandedRepos(GitSCM.java:404)
at hudson.plugins.git.GitSCM.compareRemoteRevisionWithImpl(GitSCM.java:609)
at hudson.plugins.git.GitSCM.compareRemoteRevisionWith(GitSCM.java:574)
at hudson.scm.SCM.compareRemoteRevisionWith(SCM.java:381)
at hudson.scm.SCM.poll(SCM.java:398)
at hudson.model.AbstractProject._poll(AbstractProject.java:1446)
at hudson.model.AbstractProject.poll(AbstractProject.java:1349)
at hudson.triggers.SCMTrigger$Runner.runPolling(SCMTrigger.java:528)
at hudson.triggers.SCMTrigger$Runner.run(SCMTrigger.java:557)
at hudson.util.SequentialExecutionQueue$QueueEntry.run(SequentialExecutionQueue.java:119)
at java.util.concurrent.Executors$RunnableAdapter.call(Executors.java:511)
at java.util.concurrent.FutureTask.run(FutureTask.java:266)
at java.util.concurrent.ThreadPoolExecutor.runWorker(ThreadPoolExecutor.java:1142)
at java.util.concurrent.ThreadPoolExecutor$Worker.run(ThreadPoolExecutor.java:617)
at java.lang.Thread.run(Thread.java:745)
ERROR: Could not install GRADLE_2_4_RC_2_HOME
java.lang.NullPointerException
at hudson.plugins.toolenv.ToolEnvBuildWrapper$1.buildEnvVars(ToolEnvBuildWrapper.java:46)
at hudson.model.AbstractBuild.getEnvironment(AbstractBuild.java:931)
at hudson.plugins.git.GitSCM.getParamExpandedRepos(GitSCM.java:404)
at hudson.plugins.git.GitSCM.compareRemoteRevisionWithImpl(GitSCM.java:609)
at hudson.plugins.git.GitSCM.compareRemoteRevisionWith(GitSCM.java:574)
at hudson.scm.SCM.compareRemoteRevisionWith(SCM.java:381)
at hudson.scm.SCM.poll(SCM.java:398)
at hudson.model.AbstractProject._poll(AbstractProject.java:1446)
at hudson.model.AbstractProject.poll(AbstractProject.java:1349)
at hudson.triggers.SCMTrigger$Runner.runPolling(SCMTrigger.java:528)
at hudson.triggers.SCMTrigger$Runner.run(SCMTrigger.java:557)
at hudson.util.SequentialExecutionQueue$QueueEntry.run(SequentialExecutionQueue.java:119)
at java.util.concurrent.Executors$RunnableAdapter.call(Executors.java:511)
at java.util.concurrent.FutureTask.run(FutureTask.java:266)
at java.util.concurrent.ThreadPoolExecutor.runWorker(ThreadPoolExecutor.java:1142)
at java.util.concurrent.ThreadPoolExecutor$Worker.run(ThreadPoolExecutor.java:617)
at java.lang.Thread.run(Thread.java:745)
Build timed out (after 180 minutes). Marking the build as failed.
Build was aborted
Recording test results
Setting GRADLE_2_4_RC_2_HOME=/home/jenkins/jenkins-slave/tools/hudson.plugins.gradle.GradleInstallation/Gradle_2.4-rc-2
ERROR: Step ?Publish JUnit test result report? failed: No test report files were found. Configuration error?
Setting GRADLE_2_4_RC_2_HOME=/home/jenkins/jenkins-slave/tools/hudson.plugins.gradle.GradleInstallation/Gradle_2.4-rc-2
Build failed in Jenkins: kafka-0.10.1-jdk7 #62
Posted by Apache Jenkins Server <je...@builds.apache.org>.
See <https://builds.apache.org/job/kafka-0.10.1-jdk7/62/changes>
Changes:
[jason] KAFKA-4244; Fix formatting issues in documentation
[jason] MINOR: Make documentation follow latest template
[jason] MINOR: Fix typos in documentation
[jason] MINOR: Fix table of contents and section numbers in the documentation
------------------------------------------
[...truncated 6277 lines...]
kafka.api.AuthorizerIntegrationTest > testCreatePermissionNeededToReadFromNonExistentTopic STARTED
kafka.api.AuthorizerIntegrationTest > testCreatePermissionNeededToReadFromNonExistentTopic PASSED
kafka.api.AuthorizerIntegrationTest > testPatternSubscriptionWithTopicDescribeOnlyAndGroupRead STARTED
kafka.api.AuthorizerIntegrationTest > testPatternSubscriptionWithTopicDescribeOnlyAndGroupRead PASSED
kafka.api.AuthorizerIntegrationTest > testDeleteWithWildCardAuth STARTED
kafka.api.AuthorizerIntegrationTest > testDeleteWithWildCardAuth PASSED
kafka.api.AuthorizerIntegrationTest > testOffsetFetchWithNoAccess STARTED
kafka.api.AuthorizerIntegrationTest > testOffsetFetchWithNoAccess PASSED
kafka.api.AuthorizerIntegrationTest > testProduceWithTopicRead STARTED
kafka.api.AuthorizerIntegrationTest > testProduceWithTopicRead PASSED
kafka.api.AuthorizerIntegrationTest > testListOffsetsWithNoTopicAccess STARTED
kafka.api.AuthorizerIntegrationTest > testListOffsetsWithNoTopicAccess PASSED
kafka.api.AuthorizerIntegrationTest > testCreatePermissionNeededForWritingToNonExistentTopic STARTED
kafka.api.AuthorizerIntegrationTest > testCreatePermissionNeededForWritingToNonExistentTopic PASSED
kafka.api.AuthorizerIntegrationTest > testPatternSubscriptionMatchingInternalTopicWithDescribeOnlyPermission STARTED
kafka.api.AuthorizerIntegrationTest > testPatternSubscriptionMatchingInternalTopicWithDescribeOnlyPermission PASSED
kafka.api.AuthorizerIntegrationTest > testSimpleConsumeWithOffsetLookupAndNoGroupAccess STARTED
kafka.api.AuthorizerIntegrationTest > testSimpleConsumeWithOffsetLookupAndNoGroupAccess PASSED
kafka.api.AuthorizerIntegrationTest > testConsumeWithTopicDescribe STARTED
kafka.api.AuthorizerIntegrationTest > testConsumeWithTopicDescribe PASSED
kafka.api.AuthorizerIntegrationTest > testOffsetFetchWithNoTopicAccess STARTED
kafka.api.AuthorizerIntegrationTest > testOffsetFetchWithNoTopicAccess PASSED
kafka.api.AuthorizerIntegrationTest > testCommitWithNoTopicAccess STARTED
kafka.api.AuthorizerIntegrationTest > testCommitWithNoTopicAccess PASSED
kafka.api.AuthorizerIntegrationTest > testProduceWithNoTopicAccess STARTED
kafka.api.AuthorizerIntegrationTest > testProduceWithNoTopicAccess PASSED
kafka.api.AuthorizerIntegrationTest > testProduceWithTopicWrite STARTED
kafka.api.AuthorizerIntegrationTest > testProduceWithTopicWrite PASSED
kafka.api.AuthorizerIntegrationTest > testAuthorizationWithTopicNotExisting STARTED
kafka.api.AuthorizerIntegrationTest > testAuthorizationWithTopicNotExisting PASSED
kafka.api.AuthorizerIntegrationTest > testListOffsetsWithTopicDescribe STARTED
kafka.api.AuthorizerIntegrationTest > testListOffsetsWithTopicDescribe PASSED
kafka.api.AuthorizerIntegrationTest > testUnauthorizedDeleteWithDescribe STARTED
kafka.api.AuthorizerIntegrationTest > testUnauthorizedDeleteWithDescribe PASSED
kafka.api.AuthorizerIntegrationTest > testConsumeWithTopicAndGroupRead STARTED
kafka.api.AuthorizerIntegrationTest > testConsumeWithTopicAndGroupRead PASSED
kafka.api.AuthorizerIntegrationTest > testPatternSubscriptionNotMatchingInternalTopic STARTED
kafka.api.AuthorizerIntegrationTest > testPatternSubscriptionNotMatchingInternalTopic PASSED
kafka.api.AuthorizerIntegrationTest > testUnauthorizedDeleteWithoutDescribe STARTED
kafka.api.AuthorizerIntegrationTest > testUnauthorizedDeleteWithoutDescribe PASSED
kafka.api.AuthorizerIntegrationTest > testConsumeWithTopicWrite STARTED
kafka.api.AuthorizerIntegrationTest > testConsumeWithTopicWrite PASSED
kafka.api.AuthorizerIntegrationTest > testOffsetFetchWithNoGroupAccess STARTED
kafka.api.AuthorizerIntegrationTest > testOffsetFetchWithNoGroupAccess PASSED
kafka.api.AuthorizerIntegrationTest > testCommitWithNoAccess STARTED
kafka.api.AuthorizerIntegrationTest > testCommitWithNoAccess PASSED
kafka.api.AuthorizerIntegrationTest > testConsumeWithoutTopicDescribeAccess STARTED
kafka.api.AuthorizerIntegrationTest > testConsumeWithoutTopicDescribeAccess PASSED
kafka.api.AuthorizerIntegrationTest > testCommitWithNoGroupAccess STARTED
kafka.api.AuthorizerIntegrationTest > testCommitWithNoGroupAccess PASSED
kafka.api.AuthorizerIntegrationTest > testConsumeWithNoAccess STARTED
kafka.api.AuthorizerIntegrationTest > testConsumeWithNoAccess PASSED
kafka.api.AuthorizerIntegrationTest > testOffsetFetchWithTopicAndGroupRead STARTED
kafka.api.AuthorizerIntegrationTest > testOffsetFetchWithTopicAndGroupRead PASSED
kafka.api.AuthorizerIntegrationTest > testCommitWithTopicDescribe STARTED
kafka.api.AuthorizerIntegrationTest > testCommitWithTopicDescribe PASSED
kafka.api.AuthorizerIntegrationTest > testAuthorizationWithTopicExisting STARTED
kafka.api.AuthorizerIntegrationTest > testAuthorizationWithTopicExisting PASSED
kafka.api.AuthorizerIntegrationTest > testProduceWithTopicDescribe STARTED
kafka.api.AuthorizerIntegrationTest > testProduceWithTopicDescribe PASSED
kafka.api.AuthorizerIntegrationTest > testPatternSubscriptionMatchingInternalTopic STARTED
kafka.api.AuthorizerIntegrationTest > testPatternSubscriptionMatchingInternalTopic PASSED
kafka.api.AuthorizerIntegrationTest > testOffsetFetchTopicDescribe STARTED
kafka.api.AuthorizerIntegrationTest > testOffsetFetchTopicDescribe PASSED
kafka.api.AuthorizerIntegrationTest > testCommitWithTopicAndGroupRead STARTED
kafka.api.AuthorizerIntegrationTest > testCommitWithTopicAndGroupRead PASSED
kafka.api.AuthorizerIntegrationTest > testSimpleConsumeWithExplicitSeekAndNoGroupAccess STARTED
kafka.api.AuthorizerIntegrationTest > testSimpleConsumeWithExplicitSeekAndNoGroupAccess PASSED
kafka.api.AdminClientTest > testDescribeGroup STARTED
kafka.api.AdminClientTest > testDescribeGroup PASSED
kafka.api.AdminClientTest > testDescribeConsumerGroup STARTED
kafka.api.AdminClientTest > testDescribeConsumerGroup PASSED
kafka.api.AdminClientTest > testListGroups STARTED
kafka.api.AdminClientTest > testListGroups PASSED
kafka.api.AdminClientTest > testDescribeConsumerGroupForNonExistentGroup STARTED
kafka.api.AdminClientTest > testDescribeConsumerGroupForNonExistentGroup PASSED
kafka.api.ProducerBounceTest > testBrokerFailure STARTED
kafka.api.ProducerBounceTest > testBrokerFailure PASSED
kafka.api.ClientIdQuotaTest > testProducerConsumerOverrideUnthrottled STARTED
kafka.api.ClientIdQuotaTest > testProducerConsumerOverrideUnthrottled PASSED
kafka.api.ClientIdQuotaTest > testThrottledProducerConsumer STARTED
kafka.api.ClientIdQuotaTest > testThrottledProducerConsumer PASSED
kafka.api.ClientIdQuotaTest > testQuotaOverrideDelete STARTED
kafka.api.ClientIdQuotaTest > testQuotaOverrideDelete PASSED
kafka.api.test.ProducerCompressionTest > testCompression[0] STARTED
kafka.api.test.ProducerCompressionTest > testCompression[0] PASSED
kafka.api.test.ProducerCompressionTest > testCompression[1] STARTED
kafka.api.test.ProducerCompressionTest > testCompression[1] PASSED
kafka.api.test.ProducerCompressionTest > testCompression[2] STARTED
kafka.api.test.ProducerCompressionTest > testCompression[2] PASSED
kafka.api.test.ProducerCompressionTest > testCompression[3] STARTED
kafka.api.test.ProducerCompressionTest > testCompression[3] PASSED
kafka.api.SaslPlainSslEndToEndAuthorizationTest > testNoConsumeWithoutDescribeAclViaSubscribe STARTED
kafka.api.SaslPlainSslEndToEndAuthorizationTest > testNoConsumeWithoutDescribeAclViaSubscribe PASSED
kafka.api.SaslPlainSslEndToEndAuthorizationTest > testProduceConsumeViaAssign STARTED
kafka.api.SaslPlainSslEndToEndAuthorizationTest > testProduceConsumeViaAssign PASSED
kafka.api.SaslPlainSslEndToEndAuthorizationTest > testNoConsumeWithDescribeAclViaAssign STARTED
kafka.api.SaslPlainSslEndToEndAuthorizationTest > testNoConsumeWithDescribeAclViaAssign PASSED
kafka.api.SaslPlainSslEndToEndAuthorizationTest > testNoConsumeWithDescribeAclViaSubscribe STARTED
kafka.api.SaslPlainSslEndToEndAuthorizationTest > testNoConsumeWithDescribeAclViaSubscribe PASSED
kafka.api.SaslPlainSslEndToEndAuthorizationTest > testNoConsumeWithoutDescribeAclViaAssign STARTED
kafka.api.SaslPlainSslEndToEndAuthorizationTest > testNoConsumeWithoutDescribeAclViaAssign PASSED
kafka.api.SaslPlainSslEndToEndAuthorizationTest > testNoGroupAcl STARTED
kafka.api.SaslPlainSslEndToEndAuthorizationTest > testNoGroupAcl PASSED
kafka.api.SaslPlainSslEndToEndAuthorizationTest > testNoProduceWithDescribeAcl STARTED
kafka.api.SaslPlainSslEndToEndAuthorizationTest > testNoProduceWithDescribeAcl PASSED
kafka.api.SaslPlainSslEndToEndAuthorizationTest > testProduceConsumeViaSubscribe STARTED
kafka.api.SaslPlainSslEndToEndAuthorizationTest > testProduceConsumeViaSubscribe PASSED
kafka.api.SaslPlainSslEndToEndAuthorizationTest > testNoProduceWithoutDescribeAcl STARTED
kafka.api.SaslPlainSslEndToEndAuthorizationTest > testNoProduceWithoutDescribeAcl PASSED
kafka.api.ConsumerBounceTest > testSeekAndCommitWithBrokerFailures STARTED
kafka.api.ConsumerBounceTest > testSeekAndCommitWithBrokerFailures PASSED
kafka.api.ConsumerBounceTest > testConsumptionWithBrokerFailures STARTED
ERROR: Could not install GRADLE_2_4_RC_2_HOME
java.lang.NullPointerException
at hudson.plugins.toolenv.ToolEnvBuildWrapper$1.buildEnvVars(ToolEnvBuildWrapper.java:46)
at hudson.model.AbstractBuild.getEnvironment(AbstractBuild.java:931)
at hudson.plugins.git.GitSCM.getParamExpandedRepos(GitSCM.java:404)
at hudson.plugins.git.GitSCM.compareRemoteRevisionWithImpl(GitSCM.java:609)
at hudson.plugins.git.GitSCM.compareRemoteRevisionWith(GitSCM.java:574)
at hudson.scm.SCM.compareRemoteRevisionWith(SCM.java:381)
at hudson.scm.SCM.poll(SCM.java:398)
at hudson.model.AbstractProject._poll(AbstractProject.java:1446)
at hudson.model.AbstractProject.poll(AbstractProject.java:1349)
at hudson.triggers.SCMTrigger$Runner.runPolling(SCMTrigger.java:528)
at hudson.triggers.SCMTrigger$Runner.run(SCMTrigger.java:557)
at hudson.util.SequentialExecutionQueue$QueueEntry.run(SequentialExecutionQueue.java:119)
at java.util.concurrent.Executors$RunnableAdapter.call(Executors.java:511)
at java.util.concurrent.FutureTask.run(FutureTask.java:266)
at java.util.concurrent.ThreadPoolExecutor.runWorker(ThreadPoolExecutor.java:1142)
at java.util.concurrent.ThreadPoolExecutor$Worker.run(ThreadPoolExecutor.java:617)
at java.lang.Thread.run(Thread.java:745)
Build timed out (after 180 minutes). Marking the build as failed.
Build was aborted
Recording test results
Setting GRADLE_2_4_RC_2_HOME=/home/jenkins/jenkins-slave/tools/hudson.plugins.gradle.GradleInstallation/Gradle_2.4-rc-2
Setting GRADLE_2_4_RC_2_HOME=/home/jenkins/jenkins-slave/tools/hudson.plugins.gradle.GradleInstallation/Gradle_2.4-rc-2