You are viewing a plain text version of this content. The canonical link for it is here.
Posted to builds@cassandra.apache.org by Apache Jenkins Server <je...@builds.apache.org> on 2023/10/13 00:15:23 UTC
Build complete: Cassandra-intree-5.0 #21 [UNSTABLE] 2e7b000f4ab83516d0599daa412c6a7a23a45566
-------------------------------------------------------------------------------
Build Cassandra-intree-5.0 #21 Still Unstable
URL: https://ci-cassandra.apache.org/job/Cassandra-intree-5.0/21/
-------------------------------------------------------------------------------
Changes:
[Stefan Miklosovic] Make the output of ON/OFF commands in cqlsh consistent
[Brandon Williams] Upgrade slf4j-api to 1.7.36
[Stefan Miklosovic] Upgrade snappy-java to 1.1.10.4
[David Capwell] Add support for repair coordinator to retry messages that timeout
[Jacek Lewandowski] Fix LongCompactionTest
[Stefan Miklosovic] Remove deprecated properties in CompressionParams
[Stefan Miklosovic] Improve performance of compactions when table does not have an index
[Ekaterina Dimitrova] Update hdrhistogram to 2.1.12
[David Capwell] Test failure:
[Ekaterina Dimitrova] Upgrade caffeine cache and fix CIDR permissions cache invalidation
[Stefan Miklosovic] Upgrade Dropwizard Metrics to 4.2.19
[a.penya.garcia] Remove support for empty values on the vector data type
[Jacek Lewandowski] Fix CQLConnectionTest and SimpleClient
[Berenguer Blasi] Test failure:
[Jacek Lewandowski] Fix closing iterator in SecondaryIndexBuilder
[Stefan Miklosovic] Exclude unnecessary dependencies introduced by caffeine update to 3.1.8
[Stefan Miklosovic] Remove unnecessary reporter-config3 dependency
[Stefan Miklosovic] Remove byteman-related files from production sources
[Alex Petrov] Synchronize CQLSSTableWriter#build on the Schema.instance object
[a.penya.garcia] Fix vector type to support DDM's mask_default function
[David Capwell] Gossip NPE due to shutdown event corrupting empty statuses
[Stefan Miklosovic] Update documentation metrics page according to the library upgrade
[Michael Semb Wever] ninja-fix remove all DSE references
[Michael Semb Wever] Fixes for in-tree scripts: offline mode, maybe-build for fqltool-test,
-------------------------------------------------------------------------------
Failed Tests:
60 tests failed.
FAILED: dtest-novnode.cql_tracing_test.TestCqlTracing.test_tracing_simple
FAILED: dtest-novnode.cql_tracing_test.TestCqlTracing.test_tracing_unknown_impl
FAILED: dtest-novnode.cql_tracing_test.TestCqlTracing.test_tracing_default_impl
FAILED: dtest-novnode.configuration_test.TestConfiguration.test_compression_chunk_length
FAILED: dtest-novnode.cqlsh_tests.test_cqlsh.TestCqlsh.test_with_empty_values
FAILED: dtest-novnode.sstable_generation_loading_test.TestSSTableGenerationAndLoading.test_incompressible_data_in_compressed_table
FAILED: dtest-novnode.counter_test.TestCounters.test_upgrade
FAILED: dtest-novnode.cqlsh_tests.test_cqlsh.TestCqlsh.test_tracing
FAILED: dtest-novnode.replace_address_test.TestReplaceAddress.test_fail_without_replace
FAILED: dtest-novnode.cql_tracing_test.TestCqlTracing.test_tracing_simple
FAILED: dtest-novnode.cql_tracing_test.TestCqlTracing.test_tracing_unknown_impl
FAILED: dtest-novnode.cql_tracing_test.TestCqlTracing.test_tracing_default_impl
FAILED: dtest-novnode.configuration_test.TestConfiguration.test_compression_chunk_length
FAILED: dtest-novnode.cqlsh_tests.test_cqlsh.TestCqlsh.test_with_empty_values
FAILED: dtest-novnode.jmx_test.TestJMX.test_netstats
FAILED: dtest-novnode.global_row_key_cache_test.TestGlobalRowKeyCache.test_functional
FAILED: dtest-novnode.sstable_generation_loading_test.TestSSTableGenerationAndLoading.test_incompressible_data_in_compressed_table
FAILED: dtest-novnode.counter_test.TestCounters.test_upgrade
FAILED: dtest-novnode.cqlsh_tests.test_cqlsh.TestCqlsh.test_tracing
FAILED: dtest-offheap.cqlsh_tests.test_cqlsh.TestCqlsh.test_tracing
FAILED: dtest-offheap.nodetool_test.TestNodetool.test_correct_dc_rack_in_nodetool_info
FAILED: dtest-offheap.cql_tracing_test.TestCqlTracing.test_tracing_simple
FAILED: dtest-offheap.cql_tracing_test.TestCqlTracing.test_tracing_unknown_impl
FAILED: dtest-offheap.cql_tracing_test.TestCqlTracing.test_tracing_default_impl
FAILED: dtest-offheap.configuration_test.TestConfiguration.test_compression_chunk_length
FAILED: dtest-offheap.sstable_generation_loading_test.TestSSTableGenerationAndLoading.test_incompressible_data_in_compressed_table
FAILED: dtest-offheap.secondary_indexes_test.TestPreJoinCallback.test_resume
FAILED: dtest-offheap.counter_test.TestCounters.test_upgrade
FAILED: dtest-offheap.cqlsh_tests.test_cqlsh.TestCqlsh.test_with_empty_values
FAILED: dtest-offheap.cqlsh_tests.test_cqlsh.TestCqlsh.test_tracing
FAILED: dtest-offheap.cql_tracing_test.TestCqlTracing.test_tracing_simple
FAILED: dtest-offheap.cql_tracing_test.TestCqlTracing.test_tracing_unknown_impl
FAILED: dtest-offheap.cql_tracing_test.TestCqlTracing.test_tracing_default_impl
FAILED: dtest-offheap.configuration_test.TestConfiguration.test_compression_chunk_length
FAILED: dtest-offheap.sstable_generation_loading_test.TestSSTableGenerationAndLoading.test_incompressible_data_in_compressed_table
FAILED: dtest-offheap.counter_test.TestCounters.test_upgrade
FAILED: dtest-offheap.cqlsh_tests.test_cqlsh.TestCqlsh.test_with_empty_values
FAILED: dtest.replace_address_test.TestReplaceAddress.test_unsafe_replace
FAILED: dtest.cqlsh_tests.test_cqlsh.TestCqlsh.test_tracing
FAILED: dtest.cql_tracing_test.TestCqlTracing.test_tracing_simple
FAILED: dtest.cql_tracing_test.TestCqlTracing.test_tracing_unknown_impl
FAILED: dtest.cql_tracing_test.TestCqlTracing.test_tracing_default_impl
FAILED: dtest.configuration_test.TestConfiguration.test_compression_chunk_length
FAILED: dtest.sstable_generation_loading_test.TestSSTableGenerationAndLoading.test_incompressible_data_in_compressed_table
FAILED: dtest.cqlsh_tests.test_cqlsh_copy.TestCqlshCopy.test_bulk_round_trip_non_prepared_statements
FAILED: dtest.repair_tests.repair_test.TestRepair.test_dc_repair
FAILED: dtest.cqlsh_tests.test_cqlsh_copy.TestCqlshCopy.test_bulk_round_trip_blogposts
FAILED: dtest.repair_tests.repair_test.TestRepair.test_dc_parallel_repair
FAILED: dtest.materialized_views_test.TestMaterializedViews.test_mv_with_default_ttl_with_flush
FAILED: dtest.counter_test.TestCounters.test_upgrade
FAILED: dtest.cqlsh_tests.test_cqlsh.TestCqlsh.test_with_empty_values
FAILED: dtest.cqlsh_tests.test_cqlsh.TestCqlsh.test_tracing
FAILED: dtest.cql_tracing_test.TestCqlTracing.test_tracing_simple
FAILED: dtest.cql_tracing_test.TestCqlTracing.test_tracing_unknown_impl
FAILED: dtest.cql_tracing_test.TestCqlTracing.test_tracing_default_impl
FAILED: dtest.configuration_test.TestConfiguration.test_compression_chunk_length
FAILED: dtest.disk_balance_test.TestDiskBalance.test_disk_balance_after_boundary_change_stcs
FAILED: dtest.sstable_generation_loading_test.TestSSTableGenerationAndLoading.test_incompressible_data_in_compressed_table
FAILED: dtest.counter_test.TestCounters.test_upgrade
FAILED: dtest.cqlsh_tests.test_cqlsh.TestCqlsh.test_with_empty_values
-------------------------------------------------------------------------------
For complete test report and logs see https://nightlies.apache.org/cassandra/Cassandra-intree-5.0/21/