You are viewing a plain text version of this content. The canonical link for it is here.
Posted to builds@cassandra.apache.org by Apache Jenkins Server <je...@builds.apache.org> on 2025/05/02 02:38:28 UTC

Build complete: Cassandra-trunk #2135 [FAILURE] 3bc266ca963c291a68a87be50d98e9ba0a6cab51

-------------------------------------------------------------------------------
  Build Cassandra-trunk #2135 Still Failing
  URL: https://ci-cassandra.apache.org/job/Cassandra-trunk/2135/
  -------------------------------------------------------------------------------
  Changes:
  [Doug Rohrer] CASSANDRA-20609 - CQLSSTableWriter should support setting the format


  -------------------------------------------------------------------------------
  Failed Tests:
  12 tests failed.
FAILED:  dtest-novnode.cqlsh_tests.test_cqlsh_copy.TestCqlshCopy.Tests / dtest-novnode jdk17 49/64 / test_bulk_round_trip_default
FAILED:  dtest.replace_address_test.TestReplaceAddress.Tests / dtest jdk11 20/64 / test_unsafe_replace
FAILED:  org.apache.cassandra.db.compaction.unified.ShardedCompactionWriterTest.Tests / test-cdc jdk11 16/20 / testMultipleInputSSTables-cassandra.testtag_IS_UNDEFINED
FAILED:  org.apache.cassandra.index.accord.RouteIndexTest.Tests / test-system-keyspace-directory jdk17 18/20 / test-cassandra.testtag_IS_UNDEFINED
FAILED:  org.apache.cassandra.io.sstable.indexsummary.IndexSummaryTest.Tests / test-system-keyspace-directory jdk17 7/20 / testLargeIndexSummary-cassandra.testtag_IS_UNDEFINED
FAILED:  org.apache.cassandra.io.sstable.indexsummary.IndexSummaryTest.Tests / test-latest jdk17 7/20 / testLargeIndexSummary-cassandra.testtag_IS_UNDEFINED
FAILED:  org.apache.cassandra.io.sstable.indexsummary.IndexSummaryTest.Tests / test-cdc jdk17 7/20 / testLargeIndexSummary-cassandra.testtag_IS_UNDEFINED
FAILED:  org.apache.cassandra.io.sstable.indexsummary.IndexSummaryTest.Tests / test-oa jdk11 7/20 / testLargeIndexSummary-cassandra.testtag_IS_UNDEFINED
FAILED:  org.apache.cassandra.io.sstable.indexsummary.IndexSummaryTest.Tests / test-oa jdk17 7/20 / testLargeIndexSummary-cassandra.testtag_IS_UNDEFINED
FAILED:  org.apache.cassandra.io.sstable.indexsummary.IndexSummaryTest.Tests / test-compression jdk17 7/20 / testLargeIndexSummary-cassandra.testtag_IS_UNDEFINED
FAILED:  org.apache.cassandra.io.sstable.indexsummary.IndexSummaryTest.Tests / test jdk17 7/20 / testLargeIndexSummary-cassandra.testtag_IS_UNDEFINED
FAILED:  org.apache.cassandra.fuzz.sai.MultiNodeSAITest.Tests / jvm-dtest jdk17 9/16 / indexOnlySaiTest-cassandra.testtag_IS_UNDEFINED

  -------------------------------------------------------------------------------
  For complete test report and logs see https://nightlies.apache.org/cassandra/Cassandra-trunk/2135/