You are viewing a plain text version of this content. The canonical link for it is here.
Posted to dev@lucene.apache.org by Michael McCandless <lu...@mikemccandless.com> on 2023/12/19 20:43:44 UTC

Re: [JENKINS] Lucene-main-Linux (64bit/hotspot/jdk-17.0.9) - Build # 45858 - Still Unstable!

Hmm anyone know why this test suddenly started failing...?

Mike McCandless

http://blog.mikemccandless.com


On Tue, Dec 19, 2023 at 3:35 PM Policeman Jenkins Server <
jenkins@thetaphi.de> wrote:

> Build: https://jenkins.thetaphi.de/job/Lucene-main-Linux/45858/
> Java: 64bit/hotspot/jdk-17.0.9 -XX:-UseCompressedOops -XX:+UseG1GC
>
> 1 tests failed.
> FAILED:  org.apache.lucene.index.TestTerms.testTermMinMaxRandom
>
> Error Message:
> java.lang.AssertionError
>
> Stack Trace:
> java.lang.AssertionError
>         at
> __randomizedtesting.SeedInfo.seed([3D3B000BC0883C14:71488F7FAC14E771]:0)
>         at
> org.apache.lucene.codecs.lucene90.blocktree.IntersectTermsEnum.getState(IntersectTermsEnum.java:245)
>         at
> org.apache.lucene.codecs.lucene90.blocktree.IntersectTermsEnum.seekToStartTerm(IntersectTermsEnum.java:288)
>         at
> org.apache.lucene.codecs.lucene90.blocktree.IntersectTermsEnum.<init>(IntersectTermsEnum.java:126)
>         at
> org.apache.lucene.codecs.lucene90.blocktree.FieldReader.intersect(FieldReader.java:223)
>         at
> org.apache.lucene.tests.index.AssertingLeafReader$AssertingTerms.intersect(AssertingLeafReader.java:191)
>         at
> org.apache.lucene.index.CheckIndex.checkTermsIntersect(CheckIndex.java:2374)
>         at
> org.apache.lucene.index.CheckIndex.checkFields(CheckIndex.java:2327)
>         at
> org.apache.lucene.index.CheckIndex.testPostings(CheckIndex.java:2529)
>         at
> org.apache.lucene.index.CheckIndex.testSegment(CheckIndex.java:1067)
>         at
> org.apache.lucene.index.CheckIndex.checkIndex(CheckIndex.java:783)
>         at
> org.apache.lucene.index.CheckIndex.checkIndex(CheckIndex.java:550)
>         at
> org.apache.lucene.tests.util.TestUtil.checkIndex(TestUtil.java:340)
>         at
> org.apache.lucene.tests.store.MockDirectoryWrapper.close(MockDirectoryWrapper.java:909)
>         at
> org.apache.lucene.index.TestTerms.testTermMinMaxRandom(TestTerms.java:85)
>         at
> java.base/jdk.internal.reflect.NativeMethodAccessorImpl.invoke0(Native
> Method)
>         at
> java.base/jdk.internal.reflect.NativeMethodAccessorImpl.invoke(NativeMethodAccessorImpl.java:77)
>         at
> java.base/jdk.internal.reflect.DelegatingMethodAccessorImpl.invoke(DelegatingMethodAccessorImpl.java:43)
>         at java.base/java.lang.reflect.Method.invoke(Method.java:568)
>         at
> com.carrotsearch.randomizedtesting.RandomizedRunner.invoke(RandomizedRunner.java:1758)
>         at
> com.carrotsearch.randomizedtesting.RandomizedRunner$8.evaluate(RandomizedRunner.java:946)
>         at
> com.carrotsearch.randomizedtesting.RandomizedRunner$9.evaluate(RandomizedRunner.java:982)
>         at
> com.carrotsearch.randomizedtesting.RandomizedRunner$10.evaluate(RandomizedRunner.java:996)
>         at
> org.apache.lucene.tests.util.TestRuleSetupTeardownChained$1.evaluate(TestRuleSetupTeardownChained.java:48)
>         at
> org.apache.lucene.tests.util.AbstractBeforeAfterRule$1.evaluate(AbstractBeforeAfterRule.java:43)
>         at
> org.apache.lucene.tests.util.TestRuleThreadAndTestName$1.evaluate(TestRuleThreadAndTestName.java:45)
>         at
> org.apache.lucene.tests.util.TestRuleIgnoreAfterMaxFailures$1.evaluate(TestRuleIgnoreAfterMaxFailures.java:60)
>         at
> org.apache.lucene.tests.util.TestRuleMarkFailure$1.evaluate(TestRuleMarkFailure.java:44)
>         at org.junit.rules.RunRules.evaluate(RunRules.java:20)
>         at
> com.carrotsearch.randomizedtesting.rules.StatementAdapter.evaluate(StatementAdapter.java:36)
>         at
> com.carrotsearch.randomizedtesting.ThreadLeakControl$StatementRunner.run(ThreadLeakControl.java:390)
>         at
> com.carrotsearch.randomizedtesting.ThreadLeakControl.forkTimeoutingTask(ThreadLeakControl.java:843)
>         at
> com.carrotsearch.randomizedtesting.ThreadLeakControl$3.evaluate(ThreadLeakControl.java:490)
>         at
> com.carrotsearch.randomizedtesting.RandomizedRunner.runSingleTest(RandomizedRunner.java:955)
>         at
> com.carrotsearch.randomizedtesting.RandomizedRunner$5.evaluate(RandomizedRunner.java:840)
>         at
> com.carrotsearch.randomizedtesting.RandomizedRunner$6.evaluate(RandomizedRunner.java:891)
>         at
> com.carrotsearch.randomizedtesting.RandomizedRunner$7.evaluate(RandomizedRunner.java:902)
>         at
> org.apache.lucene.tests.util.AbstractBeforeAfterRule$1.evaluate(AbstractBeforeAfterRule.java:43)
>         at
> com.carrotsearch.randomizedtesting.rules.StatementAdapter.evaluate(StatementAdapter.java:36)
>         at
> org.apache.lucene.tests.util.TestRuleStoreClassName$1.evaluate(TestRuleStoreClassName.java:38)
>         at
> com.carrotsearch.randomizedtesting.rules.NoShadowingOrOverridesOnMethodsRule$1.evaluate(NoShadowingOrOverridesOnMethodsRule.java:40)
>         at
> com.carrotsearch.randomizedtesting.rules.NoShadowingOrOverridesOnMethodsRule$1.evaluate(NoShadowingOrOverridesOnMethodsRule.java:40)
>         at
> com.carrotsearch.randomizedtesting.rules.StatementAdapter.evaluate(StatementAdapter.java:36)
>         at
> com.carrotsearch.randomizedtesting.rules.StatementAdapter.evaluate(StatementAdapter.java:36)
>         at
> org.apache.lucene.tests.util.TestRuleAssertionsRequired$1.evaluate(TestRuleAssertionsRequired.java:53)
>         at
> org.apache.lucene.tests.util.AbstractBeforeAfterRule$1.evaluate(AbstractBeforeAfterRule.java:43)
>         at
> org.apache.lucene.tests.util.TestRuleMarkFailure$1.evaluate(TestRuleMarkFailure.java:44)
>         at
> org.apache.lucene.tests.util.TestRuleIgnoreAfterMaxFailures$1.evaluate(TestRuleIgnoreAfterMaxFailures.java:60)
>         at
> org.apache.lucene.tests.util.TestRuleIgnoreTestSuites$1.evaluate(TestRuleIgnoreTestSuites.java:47)
>         at org.junit.rules.RunRules.evaluate(RunRules.java:20)
>         at
> com.carrotsearch.randomizedtesting.rules.StatementAdapter.evaluate(StatementAdapter.java:36)
>         at
> com.carrotsearch.randomizedtesting.ThreadLeakControl$StatementRunner.run(ThreadLeakControl.java:390)
>         at
> com.carrotsearch.randomizedtesting.ThreadLeakControl.lambda$forkTimeoutingTask$0(ThreadLeakControl.java:850)
>         at java.base/java.lang.Thread.run(Thread.java:840)
>
> ---------------------------------------------------------------------
> To unsubscribe, e-mail: builds-unsubscribe@lucene.apache.org
> For additional commands, e-mail: builds-help@lucene.apache.org

Re: [JENKINS] Lucene-main-Linux (64bit/hotspot/jdk-17.0.9) - Build # 45858 - Still Unstable!

Posted by Michael McCandless <lu...@mikemccandless.com>.
Oh this is the new (awesome) check Adrien recent added to CheckIndex, so
maybe this check is catching some pre-existing bugs in one of our
(hopefully experimental, not default!) codecs?

Mike McCandless

http://blog.mikemccandless.com


On Tue, Dec 19, 2023 at 3:43 PM Michael McCandless <
lucene@mikemccandless.com> wrote:

> Hmm anyone know why this test suddenly started failing...?
>
> Mike McCandless
>
> http://blog.mikemccandless.com
>
>
> On Tue, Dec 19, 2023 at 3:35 PM Policeman Jenkins Server <
> jenkins@thetaphi.de> wrote:
>
>> Build: https://jenkins.thetaphi.de/job/Lucene-main-Linux/45858/
>> Java: 64bit/hotspot/jdk-17.0.9 -XX:-UseCompressedOops -XX:+UseG1GC
>>
>> 1 tests failed.
>> FAILED:  org.apache.lucene.index.TestTerms.testTermMinMaxRandom
>>
>> Error Message:
>> java.lang.AssertionError
>>
>> Stack Trace:
>> java.lang.AssertionError
>>         at
>> __randomizedtesting.SeedInfo.seed([3D3B000BC0883C14:71488F7FAC14E771]:0)
>>         at
>> org.apache.lucene.codecs.lucene90.blocktree.IntersectTermsEnum.getState(IntersectTermsEnum.java:245)
>>         at
>> org.apache.lucene.codecs.lucene90.blocktree.IntersectTermsEnum.seekToStartTerm(IntersectTermsEnum.java:288)
>>         at
>> org.apache.lucene.codecs.lucene90.blocktree.IntersectTermsEnum.<init>(IntersectTermsEnum.java:126)
>>         at
>> org.apache.lucene.codecs.lucene90.blocktree.FieldReader.intersect(FieldReader.java:223)
>>         at
>> org.apache.lucene.tests.index.AssertingLeafReader$AssertingTerms.intersect(AssertingLeafReader.java:191)
>>         at
>> org.apache.lucene.index.CheckIndex.checkTermsIntersect(CheckIndex.java:2374)
>>         at
>> org.apache.lucene.index.CheckIndex.checkFields(CheckIndex.java:2327)
>>         at
>> org.apache.lucene.index.CheckIndex.testPostings(CheckIndex.java:2529)
>>         at
>> org.apache.lucene.index.CheckIndex.testSegment(CheckIndex.java:1067)
>>         at
>> org.apache.lucene.index.CheckIndex.checkIndex(CheckIndex.java:783)
>>         at
>> org.apache.lucene.index.CheckIndex.checkIndex(CheckIndex.java:550)
>>         at
>> org.apache.lucene.tests.util.TestUtil.checkIndex(TestUtil.java:340)
>>         at
>> org.apache.lucene.tests.store.MockDirectoryWrapper.close(MockDirectoryWrapper.java:909)
>>         at
>> org.apache.lucene.index.TestTerms.testTermMinMaxRandom(TestTerms.java:85)
>>         at
>> java.base/jdk.internal.reflect.NativeMethodAccessorImpl.invoke0(Native
>> Method)
>>         at
>> java.base/jdk.internal.reflect.NativeMethodAccessorImpl.invoke(NativeMethodAccessorImpl.java:77)
>>         at
>> java.base/jdk.internal.reflect.DelegatingMethodAccessorImpl.invoke(DelegatingMethodAccessorImpl.java:43)
>>         at java.base/java.lang.reflect.Method.invoke(Method.java:568)
>>         at
>> com.carrotsearch.randomizedtesting.RandomizedRunner.invoke(RandomizedRunner.java:1758)
>>         at
>> com.carrotsearch.randomizedtesting.RandomizedRunner$8.evaluate(RandomizedRunner.java:946)
>>         at
>> com.carrotsearch.randomizedtesting.RandomizedRunner$9.evaluate(RandomizedRunner.java:982)
>>         at
>> com.carrotsearch.randomizedtesting.RandomizedRunner$10.evaluate(RandomizedRunner.java:996)
>>         at
>> org.apache.lucene.tests.util.TestRuleSetupTeardownChained$1.evaluate(TestRuleSetupTeardownChained.java:48)
>>         at
>> org.apache.lucene.tests.util.AbstractBeforeAfterRule$1.evaluate(AbstractBeforeAfterRule.java:43)
>>         at
>> org.apache.lucene.tests.util.TestRuleThreadAndTestName$1.evaluate(TestRuleThreadAndTestName.java:45)
>>         at
>> org.apache.lucene.tests.util.TestRuleIgnoreAfterMaxFailures$1.evaluate(TestRuleIgnoreAfterMaxFailures.java:60)
>>         at
>> org.apache.lucene.tests.util.TestRuleMarkFailure$1.evaluate(TestRuleMarkFailure.java:44)
>>         at org.junit.rules.RunRules.evaluate(RunRules.java:20)
>>         at
>> com.carrotsearch.randomizedtesting.rules.StatementAdapter.evaluate(StatementAdapter.java:36)
>>         at
>> com.carrotsearch.randomizedtesting.ThreadLeakControl$StatementRunner.run(ThreadLeakControl.java:390)
>>         at
>> com.carrotsearch.randomizedtesting.ThreadLeakControl.forkTimeoutingTask(ThreadLeakControl.java:843)
>>         at
>> com.carrotsearch.randomizedtesting.ThreadLeakControl$3.evaluate(ThreadLeakControl.java:490)
>>         at
>> com.carrotsearch.randomizedtesting.RandomizedRunner.runSingleTest(RandomizedRunner.java:955)
>>         at
>> com.carrotsearch.randomizedtesting.RandomizedRunner$5.evaluate(RandomizedRunner.java:840)
>>         at
>> com.carrotsearch.randomizedtesting.RandomizedRunner$6.evaluate(RandomizedRunner.java:891)
>>         at
>> com.carrotsearch.randomizedtesting.RandomizedRunner$7.evaluate(RandomizedRunner.java:902)
>>         at
>> org.apache.lucene.tests.util.AbstractBeforeAfterRule$1.evaluate(AbstractBeforeAfterRule.java:43)
>>         at
>> com.carrotsearch.randomizedtesting.rules.StatementAdapter.evaluate(StatementAdapter.java:36)
>>         at
>> org.apache.lucene.tests.util.TestRuleStoreClassName$1.evaluate(TestRuleStoreClassName.java:38)
>>         at
>> com.carrotsearch.randomizedtesting.rules.NoShadowingOrOverridesOnMethodsRule$1.evaluate(NoShadowingOrOverridesOnMethodsRule.java:40)
>>         at
>> com.carrotsearch.randomizedtesting.rules.NoShadowingOrOverridesOnMethodsRule$1.evaluate(NoShadowingOrOverridesOnMethodsRule.java:40)
>>         at
>> com.carrotsearch.randomizedtesting.rules.StatementAdapter.evaluate(StatementAdapter.java:36)
>>         at
>> com.carrotsearch.randomizedtesting.rules.StatementAdapter.evaluate(StatementAdapter.java:36)
>>         at
>> org.apache.lucene.tests.util.TestRuleAssertionsRequired$1.evaluate(TestRuleAssertionsRequired.java:53)
>>         at
>> org.apache.lucene.tests.util.AbstractBeforeAfterRule$1.evaluate(AbstractBeforeAfterRule.java:43)
>>         at
>> org.apache.lucene.tests.util.TestRuleMarkFailure$1.evaluate(TestRuleMarkFailure.java:44)
>>         at
>> org.apache.lucene.tests.util.TestRuleIgnoreAfterMaxFailures$1.evaluate(TestRuleIgnoreAfterMaxFailures.java:60)
>>         at
>> org.apache.lucene.tests.util.TestRuleIgnoreTestSuites$1.evaluate(TestRuleIgnoreTestSuites.java:47)
>>         at org.junit.rules.RunRules.evaluate(RunRules.java:20)
>>         at
>> com.carrotsearch.randomizedtesting.rules.StatementAdapter.evaluate(StatementAdapter.java:36)
>>         at
>> com.carrotsearch.randomizedtesting.ThreadLeakControl$StatementRunner.run(ThreadLeakControl.java:390)
>>         at
>> com.carrotsearch.randomizedtesting.ThreadLeakControl.lambda$forkTimeoutingTask$0(ThreadLeakControl.java:850)
>>         at java.base/java.lang.Thread.run(Thread.java:840)
>>
>> ---------------------------------------------------------------------
>> To unsubscribe, e-mail: builds-unsubscribe@lucene.apache.org
>> For additional commands, e-mail: builds-help@lucene.apache.org
>
>

Re: [JENKINS] Lucene-main-Linux (64bit/hotspot/jdk-17.0.9) - Build # 45858 - Still Unstable!

Posted by Michael McCandless <lu...@mikemccandless.com>.
Oh this is the new (awesome) check Adrien recent added to CheckIndex, so
maybe this check is catching some pre-existing bugs in one of our
(hopefully experimental, not default!) codecs?

Mike McCandless

http://blog.mikemccandless.com


On Tue, Dec 19, 2023 at 3:43 PM Michael McCandless <
lucene@mikemccandless.com> wrote:

> Hmm anyone know why this test suddenly started failing...?
>
> Mike McCandless
>
> http://blog.mikemccandless.com
>
>
> On Tue, Dec 19, 2023 at 3:35 PM Policeman Jenkins Server <
> jenkins@thetaphi.de> wrote:
>
>> Build: https://jenkins.thetaphi.de/job/Lucene-main-Linux/45858/
>> Java: 64bit/hotspot/jdk-17.0.9 -XX:-UseCompressedOops -XX:+UseG1GC
>>
>> 1 tests failed.
>> FAILED:  org.apache.lucene.index.TestTerms.testTermMinMaxRandom
>>
>> Error Message:
>> java.lang.AssertionError
>>
>> Stack Trace:
>> java.lang.AssertionError
>>         at
>> __randomizedtesting.SeedInfo.seed([3D3B000BC0883C14:71488F7FAC14E771]:0)
>>         at
>> org.apache.lucene.codecs.lucene90.blocktree.IntersectTermsEnum.getState(IntersectTermsEnum.java:245)
>>         at
>> org.apache.lucene.codecs.lucene90.blocktree.IntersectTermsEnum.seekToStartTerm(IntersectTermsEnum.java:288)
>>         at
>> org.apache.lucene.codecs.lucene90.blocktree.IntersectTermsEnum.<init>(IntersectTermsEnum.java:126)
>>         at
>> org.apache.lucene.codecs.lucene90.blocktree.FieldReader.intersect(FieldReader.java:223)
>>         at
>> org.apache.lucene.tests.index.AssertingLeafReader$AssertingTerms.intersect(AssertingLeafReader.java:191)
>>         at
>> org.apache.lucene.index.CheckIndex.checkTermsIntersect(CheckIndex.java:2374)
>>         at
>> org.apache.lucene.index.CheckIndex.checkFields(CheckIndex.java:2327)
>>         at
>> org.apache.lucene.index.CheckIndex.testPostings(CheckIndex.java:2529)
>>         at
>> org.apache.lucene.index.CheckIndex.testSegment(CheckIndex.java:1067)
>>         at
>> org.apache.lucene.index.CheckIndex.checkIndex(CheckIndex.java:783)
>>         at
>> org.apache.lucene.index.CheckIndex.checkIndex(CheckIndex.java:550)
>>         at
>> org.apache.lucene.tests.util.TestUtil.checkIndex(TestUtil.java:340)
>>         at
>> org.apache.lucene.tests.store.MockDirectoryWrapper.close(MockDirectoryWrapper.java:909)
>>         at
>> org.apache.lucene.index.TestTerms.testTermMinMaxRandom(TestTerms.java:85)
>>         at
>> java.base/jdk.internal.reflect.NativeMethodAccessorImpl.invoke0(Native
>> Method)
>>         at
>> java.base/jdk.internal.reflect.NativeMethodAccessorImpl.invoke(NativeMethodAccessorImpl.java:77)
>>         at
>> java.base/jdk.internal.reflect.DelegatingMethodAccessorImpl.invoke(DelegatingMethodAccessorImpl.java:43)
>>         at java.base/java.lang.reflect.Method.invoke(Method.java:568)
>>         at
>> com.carrotsearch.randomizedtesting.RandomizedRunner.invoke(RandomizedRunner.java:1758)
>>         at
>> com.carrotsearch.randomizedtesting.RandomizedRunner$8.evaluate(RandomizedRunner.java:946)
>>         at
>> com.carrotsearch.randomizedtesting.RandomizedRunner$9.evaluate(RandomizedRunner.java:982)
>>         at
>> com.carrotsearch.randomizedtesting.RandomizedRunner$10.evaluate(RandomizedRunner.java:996)
>>         at
>> org.apache.lucene.tests.util.TestRuleSetupTeardownChained$1.evaluate(TestRuleSetupTeardownChained.java:48)
>>         at
>> org.apache.lucene.tests.util.AbstractBeforeAfterRule$1.evaluate(AbstractBeforeAfterRule.java:43)
>>         at
>> org.apache.lucene.tests.util.TestRuleThreadAndTestName$1.evaluate(TestRuleThreadAndTestName.java:45)
>>         at
>> org.apache.lucene.tests.util.TestRuleIgnoreAfterMaxFailures$1.evaluate(TestRuleIgnoreAfterMaxFailures.java:60)
>>         at
>> org.apache.lucene.tests.util.TestRuleMarkFailure$1.evaluate(TestRuleMarkFailure.java:44)
>>         at org.junit.rules.RunRules.evaluate(RunRules.java:20)
>>         at
>> com.carrotsearch.randomizedtesting.rules.StatementAdapter.evaluate(StatementAdapter.java:36)
>>         at
>> com.carrotsearch.randomizedtesting.ThreadLeakControl$StatementRunner.run(ThreadLeakControl.java:390)
>>         at
>> com.carrotsearch.randomizedtesting.ThreadLeakControl.forkTimeoutingTask(ThreadLeakControl.java:843)
>>         at
>> com.carrotsearch.randomizedtesting.ThreadLeakControl$3.evaluate(ThreadLeakControl.java:490)
>>         at
>> com.carrotsearch.randomizedtesting.RandomizedRunner.runSingleTest(RandomizedRunner.java:955)
>>         at
>> com.carrotsearch.randomizedtesting.RandomizedRunner$5.evaluate(RandomizedRunner.java:840)
>>         at
>> com.carrotsearch.randomizedtesting.RandomizedRunner$6.evaluate(RandomizedRunner.java:891)
>>         at
>> com.carrotsearch.randomizedtesting.RandomizedRunner$7.evaluate(RandomizedRunner.java:902)
>>         at
>> org.apache.lucene.tests.util.AbstractBeforeAfterRule$1.evaluate(AbstractBeforeAfterRule.java:43)
>>         at
>> com.carrotsearch.randomizedtesting.rules.StatementAdapter.evaluate(StatementAdapter.java:36)
>>         at
>> org.apache.lucene.tests.util.TestRuleStoreClassName$1.evaluate(TestRuleStoreClassName.java:38)
>>         at
>> com.carrotsearch.randomizedtesting.rules.NoShadowingOrOverridesOnMethodsRule$1.evaluate(NoShadowingOrOverridesOnMethodsRule.java:40)
>>         at
>> com.carrotsearch.randomizedtesting.rules.NoShadowingOrOverridesOnMethodsRule$1.evaluate(NoShadowingOrOverridesOnMethodsRule.java:40)
>>         at
>> com.carrotsearch.randomizedtesting.rules.StatementAdapter.evaluate(StatementAdapter.java:36)
>>         at
>> com.carrotsearch.randomizedtesting.rules.StatementAdapter.evaluate(StatementAdapter.java:36)
>>         at
>> org.apache.lucene.tests.util.TestRuleAssertionsRequired$1.evaluate(TestRuleAssertionsRequired.java:53)
>>         at
>> org.apache.lucene.tests.util.AbstractBeforeAfterRule$1.evaluate(AbstractBeforeAfterRule.java:43)
>>         at
>> org.apache.lucene.tests.util.TestRuleMarkFailure$1.evaluate(TestRuleMarkFailure.java:44)
>>         at
>> org.apache.lucene.tests.util.TestRuleIgnoreAfterMaxFailures$1.evaluate(TestRuleIgnoreAfterMaxFailures.java:60)
>>         at
>> org.apache.lucene.tests.util.TestRuleIgnoreTestSuites$1.evaluate(TestRuleIgnoreTestSuites.java:47)
>>         at org.junit.rules.RunRules.evaluate(RunRules.java:20)
>>         at
>> com.carrotsearch.randomizedtesting.rules.StatementAdapter.evaluate(StatementAdapter.java:36)
>>         at
>> com.carrotsearch.randomizedtesting.ThreadLeakControl$StatementRunner.run(ThreadLeakControl.java:390)
>>         at
>> com.carrotsearch.randomizedtesting.ThreadLeakControl.lambda$forkTimeoutingTask$0(ThreadLeakControl.java:850)
>>         at java.base/java.lang.Thread.run(Thread.java:840)
>>
>> ---------------------------------------------------------------------
>> To unsubscribe, e-mail: builds-unsubscribe@lucene.apache.org
>> For additional commands, e-mail: builds-help@lucene.apache.org
>
>