You are viewing a plain text version of this content. The canonical link for it is here.
Posted to builds@beam.apache.org by Apache Jenkins Server <je...@builds.apache.org> on 2023/03/22 05:34:12 UTC

Build failed in Jenkins: beam_PostCommit_XVR_PythonUsingJava_Dataflow #1668

See <https://ci-beam.apache.org/job/beam_PostCommit_XVR_PythonUsingJava_Dataflow/1668/display/redirect>

Changes:


------------------------------------------
[...truncated 1.12 MB...]
packaging==23.0
pandas==1.5.3
parameterized==0.8.1
pip==23.0.1
pluggy==1.0.0
proto-plus==1.22.2
protobuf==4.22.1
psycopg2-binary==2.9.5
py==1.11.0
pyarrow==9.0.0
pyasn1==0.4.8
pyasn1-modules==0.2.8
pycparser==2.21
pydot==1.4.2
PyHamcrest==1.10.1
pymongo==4.3.3
PyMySQL==1.0.2
pyparsing==3.0.9
pytest==7.2.2
pytest-forked==1.6.0
pytest-timeout==2.1.0
pytest-xdist==2.5.0
python-dateutil==2.8.2
python-snappy==0.6.1
pytz==2022.7.1
PyYAML==6.0
regex==2022.10.31
requests==2.28.2
requests-mock==1.10.0
requests-oauthlib==1.3.1
rsa==4.9
scikit-learn==1.2.2
scipy==1.10.1
setuptools==67.6.0
six==1.16.0
sortedcontainers==2.4.0
soupsieve==2.4
SQLAlchemy==1.4.46
sqlparse==0.4.3
tenacity==5.1.5
tensorboard==2.12.0
tensorboard-data-server==0.7.0
tensorboard-plugin-wit==1.8.1
tensorflow==2.12.0rc1
tensorflow-estimator==2.12.0rc0
tensorflow-io-gcs-filesystem==0.31.0
termcolor==2.2.0
testcontainers==3.7.1
threadpoolctl==3.1.0
tomli==2.0.1
tqdm==4.65.0
typing_extensions==4.5.0
urllib3==1.26.14
websocket-client==1.5.1
Werkzeug==2.2.3
wheel==0.38.4
wrapt==1.14.1
zstandard==0.20.0
Removing intermediate container 5196ef388d6c
 ---> 18af5cc857dc
Step 17/32 : COPY target/LICENSE /opt/apache/beam/
 ---> b8a3b81fd477
Step 18/32 : COPY target/LICENSE.python /opt/apache/beam/
 ---> 46a644ab9a99
Step 19/32 : COPY target/NOTICE /opt/apache/beam/
 ---> f3f6405e714b
Step 20/32 : COPY target/launcher/linux_amd64/boot /opt/apache/beam/
 ---> 42763a038559
Step 21/32 : ENTRYPOINT ["/opt/apache/beam/boot"]
 ---> Running in 8095f2b72e0f
Removing intermediate container 8095f2b72e0f
 ---> b58a22a4f7ec
Step 22/32 : FROM beam as third_party_licenses
 ---> b58a22a4f7ec
Step 23/32 : ARG pull_licenses
 ---> Running in 100d2836b15c
Removing intermediate container 100d2836b15c
 ---> 756c06a0d1b3
Step 24/32 : COPY target/license_scripts /tmp/license_scripts/
 ---> ad9142f17707
Step 25/32 : COPY target/LICENSE target/go-licenses/* /opt/apache/beam/third_party_licenses/golang/
 ---> 40ad9b62e216
Step 26/32 : RUN rm /opt/apache/beam/third_party_licenses/golang/LICENSE
 ---> Running in 2b232000d036
Removing intermediate container 2b232000d036
 ---> a40dc6306178
Step 27/32 : COPY target/license_scripts /tmp/license_scripts/
 ---> 938f0a007e09
Step 28/32 : RUN if [ "$pull_licenses" = "true" ] ; then       pip install 'pip-licenses<4.0.0' pyyaml tenacity &&       python /tmp/license_scripts/pull_licenses_py.py ;     fi
 ---> Running in a6afd1a6a025
Collecting pip-licenses<4.0.0
  Downloading pip_licenses-3.5.5-py3-none-any.whl (17 kB)
Requirement already satisfied: pyyaml in /usr/local/lib/python3.10/site-packages (6.0)
Requirement already satisfied: tenacity in /usr/local/lib/python3.10/site-packages (5.1.5)
Collecting PTable
  Downloading PTable-0.9.2.tar.gz (31 kB)
  Preparing metadata (setup.py): started
  Preparing metadata (setup.py): finished with status 'done'
Requirement already satisfied: six>=1.9.0 in /usr/local/lib/python3.10/site-packages (from tenacity) (1.16.0)
Building wheels for collected packages: PTable
  Building wheel for PTable (setup.py): started
  Building wheel for PTable (setup.py): finished with status 'done'
  Created wheel for PTable: filename=PTable-0.9.2-py3-none-any.whl size=22908 sha256=25f77cd3bb59c5e4a016216deee6ce8108045d0dca6a5913768e20f9b2d22e05
  Stored in directory: /root/.cache/pip/wheels/bc/88/52/f2e9fc70f3a657cf256e9b01a8a42938c4c5ee69118d51ed90
Successfully built PTable
Installing collected packages: PTable, pip-licenses
Successfully installed PTable-0.9.2 pip-licenses-3.5.5
WARNING: Running pip as the 'root' user can result in broken permissions and conflicting behaviour with the system package manager. It is recommended to use a virtual environment instead: https://pip.pypa.io/warnings/venv
Skip pulling license for  bs4
INFO:root:Successfully pulled licenses for 132 dependencies
Removing intermediate container a6afd1a6a025
 ---> e54fbd7318d7
Step 29/32 : FROM beam
 ---> b58a22a4f7ec
Step 30/32 : ARG pull_licenses
 ---> Running in 267b4af33fbd
Removing intermediate container 267b4af33fbd
 ---> ab0c37f65b56
Step 31/32 : COPY --from=third_party_licenses /opt/apache/beam/third_party_licenses /opt/apache/beam/third_party_licenses
 ---> ff9b1e5c8a96
Step 32/32 : RUN if [ "$pull_licenses" != "true" ] ; then       rm -rf /opt/apache/beam/third_party_licenses ;     fi
 ---> Running in fbf026329a2b
Removing intermediate container fbf026329a2b
 ---> 31ce3b6f62bb
Successfully built 31ce3b6f62bb
Successfully tagged apache/beam_python3.10_sdk:2.47.0.dev

> Task :runners:google-cloud-dataflow-java:buildAndPushDockerPythonContainer
WARNING: `gcloud docker` will not be supported for Docker client versions above 18.03.

As an alternative, use `gcloud auth configure-docker` to configure `docker` to
use `gcloud` as a credential helper, then use `docker` as you would for non-GCR
registries, e.g. `docker pull gcr.io/project-id/my-image`. Add
`--verbosity=error` to silence this warning: `gcloud docker
--verbosity=error -- pull gcr.io/project-id/my-image`.

See: https://cloud.google.com/container-registry/docs/support/deprecation-notices#gcloud-docker

The push refers to repository [us.gcr.io/apache-beam-testing/java-postcommit-it/python]
5e4c7da9ab71: Preparing
939196c4056f: Preparing
544dc3acb0e0: Preparing
a16621570777: Preparing
dc53cfc68a3f: Preparing
2f5d6f0fa247: Preparing
54cb1275a741: Preparing
fbf9f15df0ed: Preparing
fbfcfa868783: Preparing
9a26ba3c9c7d: Preparing
dc82933be5bb: Preparing
85d83ea1009f: Preparing
738ca0120487: Preparing
f8029e89576a: Preparing
3be7590470b5: Preparing
f1f01531b1ec: Preparing
9fa2f0005a9e: Preparing
0baa05faf31a: Preparing
2f5d6f0fa247: Waiting
ac504d030134: Preparing
54cb1275a741: Waiting
52ebb9a789db: Preparing
86d774dafc20: Preparing
fbf9f15df0ed: Waiting
da68f13652fc: Preparing
cf2e8433dbf2: Preparing
fbfcfa868783: Waiting
9a26ba3c9c7d: Waiting
dc82933be5bb: Waiting
86d774dafc20: Waiting
85d83ea1009f: Waiting
da68f13652fc: Waiting
cf2e8433dbf2: Waiting
738ca0120487: Waiting
ac504d030134: Waiting
f1f01531b1ec: Waiting
0baa05faf31a: Waiting
f8029e89576a: Waiting
9fa2f0005a9e: Waiting
5e4c7da9ab71: Pushed
a16621570777: Pushed
544dc3acb0e0: Pushed
dc53cfc68a3f: Pushed
939196c4056f: Pushed
fbfcfa868783: Pushed
54cb1275a741: Pushed
fbf9f15df0ed: Pushed
738ca0120487: Pushed
f8029e89576a: Pushed
dc82933be5bb: Pushed
3be7590470b5: Layer already exists
f1f01531b1ec: Layer already exists
9fa2f0005a9e: Layer already exists
0baa05faf31a: Layer already exists
ac504d030134: Layer already exists
52ebb9a789db: Layer already exists
86d774dafc20: Layer already exists
da68f13652fc: Layer already exists
cf2e8433dbf2: Layer already exists
2f5d6f0fa247: Pushed
9a26ba3c9c7d: Pushed
85d83ea1009f: Pushed
errors:
blob unknown: Manifest "sha256:e1d79f4a893fd9f34152838a175b0ec90a5dd3d281c82d7400904a7bf404ed1d" blob "sha256:2e6d3803bd64df253ae1e7e92badd8f409eb379e4d3c82fea059c832da52e346" unknown to registry.
blob unknown: Manifest "sha256:e1d79f4a893fd9f34152838a175b0ec90a5dd3d281c82d7400904a7bf404ed1d" blob "sha256:40c0a880cb17663165cf1d3e71c409c514ab1c5f7cb5272ae49c849594223947" unknown to registry.
blob unknown: Manifest "sha256:e1d79f4a893fd9f34152838a175b0ec90a5dd3d281c82d7400904a7bf404ed1d" blob "sha256:a07eecfb685774ef1b44cabbad67242f6f505e701a9ef71df3b07dc8b2e17f71" unknown to registry.


> Task :runners:google-cloud-dataflow-java:buildAndPushDockerPythonContainer FAILED

> Task :runners:google-cloud-dataflow-java:validatesCrossLanguageRunnerSetup
Launching Java expansion service @ 44345
Launching Python expansion service @ 45499

> Task :runners:google-cloud-dataflow-java:validatesCrossLanguageRunnerCleanup
Stopping expansion service pid: 1839512.
Stopping expansion service pid: 1839513.

FAILURE: Build failed with an exception.

* Where:
Build file '<https://ci-beam.apache.org/job/beam_PostCommit_XVR_PythonUsingJava_Dataflow/ws/src/runners/google-cloud-dataflow-java/build.gradle'> line: 332

* What went wrong:
Execution failed for task ':runners:google-cloud-dataflow-java:buildAndPushDockerPythonContainer'.
> Process 'command 'gcloud'' finished with non-zero exit value 1

* Try:
> Run with --stacktrace option to get the stack trace.
> Run with --info or --debug option to get more log output.

* Get more help at https://help.gradle.org

Deprecated Gradle features were used in this build, making it incompatible with Gradle 8.0.

You can use '--warning-mode all' to show the individual deprecation warnings and determine if they come from your own scripts or plugins.

See https://docs.gradle.org/7.5.1/userguide/command_line_interface.html#sec:command_line_warnings

Execution optimizations have been disabled for 1 invalid unit(s) of work during this build to ensure correctness.
Please consult deprecation warnings for more details.

BUILD FAILED in 11m 49s
143 actionable tasks: 22 executed, 121 up-to-date

Publishing build scan...
https://gradle.com/s/hdd6fcfnvgqyo

Build step 'Invoke Gradle script' changed build result to FAILURE
Build step 'Invoke Gradle script' marked build as failure

---------------------------------------------------------------------
To unsubscribe, e-mail: builds-unsubscribe@beam.apache.org
For additional commands, e-mail: builds-help@beam.apache.org


Jenkins build is back to normal : beam_PostCommit_XVR_PythonUsingJava_Dataflow #1669

Posted by Apache Jenkins Server <je...@builds.apache.org>.
See <https://ci-beam.apache.org/job/beam_PostCommit_XVR_PythonUsingJava_Dataflow/1669/display/redirect>


---------------------------------------------------------------------
To unsubscribe, e-mail: builds-unsubscribe@beam.apache.org
For additional commands, e-mail: builds-help@beam.apache.org