You are viewing a plain text version of this content. The canonical link for it is here.
Posted to builds@cassandra.apache.org by Apache Jenkins Server <je...@builds.apache.org> on 2025/09/11 18:30:00 UTC
Build complete: Cassandra-4.0 #803 [UNSTABLE] 6c29686ea7d1a6ca2d9f9723c7fed7aac940a6ed
-------------------------------------------------------------------------------
Build Cassandra-4.0 #803 Still Unstable
URL: https://ci-cassandra.apache.org/job/Cassandra-4.0/803/
-------------------------------------------------------------------------------
Changes:
[Dmitry Konstantinov] Prevent too long table names not fitting file names
-------------------------------------------------------------------------------
Failed Tests:
44 tests failed.
FAILED: dtest-novnode.cqlsh_tests.test_cqlsh.TestCqlsh.test_unicode_invalid_request_error
FAILED: dtest-novnode.cqlsh_tests.test_cqlsh.TestCqlsh.test_unicode_invalid_request_error
FAILED: dtest-offheap.cqlsh_tests.test_cqlsh.TestCqlsh.test_unicode_invalid_request_error
FAILED: dtest-offheap.cqlsh_tests.test_cqlsh.TestCqlsh.test_unicode_invalid_request_error
FAILED: dtest-upgrade.upgrade_tests.cql_tests.TestCQLNodes2RF1_Upgrade_current_4_0_x_To_indev_4_0_x.test_date
FAILED: dtest-upgrade.upgrade_tests.cql_tests.TestCQLNodes2RF1_Upgrade_current_4_0_x_To_indev_4_0_x.test_static_columns
FAILED: dtest-upgrade.upgrade_tests.upgrade_through_versions_test.TestUpgrade_current_3_11_x_To_indev_4_0_x.test_bootstrap_multidc
FAILED: dtest-upgrade.upgrade_tests.cql_tests.TestCQLNodes3RF3_Upgrade_current_4_0_x_To_indev_4_0_x.test_static_cf
FAILED: dtest-upgrade.upgrade_tests.cql_tests.TestCQLNodes3RF3_Upgrade_current_4_0_x_To_indev_4_0_x.test_collection_function
FAILED: dtest-upgrade.upgrade_tests.cql_tests.TestCQLNodes3RF3_Upgrade_current_4_0_x_To_indev_4_0_x.test_static_with_empty_clustering
FAILED: dtest-upgrade.upgrade_tests.cql_tests.TestCQLNodes2RF1_Upgrade_current_4_0_x_To_indev_4_0_x.test_simple_tuple_query
FAILED: dtest-upgrade.upgrade_tests.cql_tests.TestCQLNodes2RF1_Upgrade_current_4_0_x_To_indev_4_0_x.test_compact_metadata
FAILED: dtest-upgrade.upgrade_tests.cql_tests.TestCQLNodes3RF3_Upgrade_current_4_0_x_To_indev_4_0_x.test_composite_partition_key_validation
FAILED: dtest-upgrade.upgrade_tests.cql_tests.TestCQLNodes3RF3_Upgrade_current_4_0_x_To_indev_4_0_x.test_limit_compact_table
FAILED: dtest-upgrade.upgrade_tests.cql_tests.TestCQLNodes2RF1_Upgrade_current_4_0_x_To_indev_4_0_x.test_limit_sparse
FAILED: dtest-upgrade.upgrade_tests.cql_tests.TestCQLNodes2RF1_Upgrade_current_4_0_x_To_indev_4_0_x.test_query_compact_tables_during_upgrade
FAILED: dtest-upgrade.upgrade_tests.cql_tests.TestCQLNodes2RF1_Upgrade_current_4_0_x_To_indev_4_0_x.test_negative_timestamp
FAILED: dtest-upgrade.upgrade_tests.cql_tests.TestCQLNodes3RF3_Upgrade_current_4_0_x_To_indev_4_0_x.test_counters
FAILED: dtest-upgrade.upgrade_tests.cql_tests.TestCQLNodes3RF3_Upgrade_current_4_0_x_To_indev_4_0_x.test_clustering_indexing
FAILED: dtest-upgrade.upgrade_tests.cql_tests.TestCQLNodes3RF3_Upgrade_current_4_0_x_To_indev_4_0_x.test_exclusive_slice
FAILED: dtest-upgrade.upgrade_tests.cql_tests.TestCQLNodes3RF3_Upgrade_current_4_0_x_To_indev_4_0_x.test_ticket_5230
FAILED: dtest-upgrade.upgrade_tests.cql_tests.TestCQLNodes2RF1_Upgrade_current_4_0_x_To_indev_4_0_x.test_nameless_index
FAILED: dtest-upgrade.upgrade_tests.cql_tests.TestCQLNodes2RF1_Upgrade_current_4_0_x_To_indev_4_0_x.test_conditional_update
FAILED: dtest-upgrade.upgrade_tests.cql_tests.TestCQLNodes3RF3_Upgrade_current_4_0_x_To_indev_4_0_x.test_order_by_validation
FAILED: dtest-upgrade.upgrade_tests.cql_tests.TestCQLNodes3RF3_Upgrade_current_4_0_x_To_indev_4_0_x.test_intersection_logic_returns_empty_result
FAILED: dtest-upgrade.upgrade_tests.cql_tests.TestCQLNodes3RF3_Upgrade_current_4_0_x_To_indev_4_0_x.test_token_range
FAILED: dtest-upgrade.upgrade_tests.cql_tests.TestCQLNodes3RF3_Upgrade_current_4_0_x_To_indev_4_0_x.test_select_with_alias
FAILED: dtest-upgrade.upgrade_tests.cql_tests.TestCQLNodes3RF3_Upgrade_current_4_0_x_To_indev_4_0_x.test_delete_row
FAILED: dtest-upgrade.upgrade_tests.storage_engine_upgrade_test.TestLoadMdThreeOneOneCompactSStables.test_sstableloader_compression_deflate_to_none
FAILED: dtest-upgrade.upgrade_tests.cql_tests.TestCQLNodes2RF1_Upgrade_current_4_0_x_To_indev_4_0_x.test_cas_and_ttl
FAILED: dtest-upgrade.upgrade_tests.cql_tests.TestCQLNodes3RF3_Upgrade_current_4_0_x_To_indev_4_0_x.test_only_pk
FAILED: dtest-upgrade.upgrade_tests.cql_tests.TestCQLNodes3RF3_Upgrade_current_4_0_x_To_indev_4_0_x.test_map_keys_indexing
FAILED: dtest.cqlsh_tests.test_cqlsh.TestCqlsh.test_unicode_invalid_request_error
FAILED: dtest.cqlsh_tests.test_cqlsh.TestCqlsh.test_unicode_invalid_request_error
FAILED: org.apache.cassandra.distributed.upgrade.DropCompactStorageTest.testDropCompactStorage
FAILED: org.apache.cassandra.distributed.upgrade.MixedModeAvailabilityV22Test.testAvailabilityV22ToV30
FAILED: org.apache.cassandra.index.sasi.SASICQLTest.testStringLikePrefix-cdc
FAILED: org.apache.cassandra.db.marshal.AbstractTypeTest.testImplementedCompatibility
FAILED: org.apache.cassandra.dht.tokenallocator.OfflineTokenAllocatorTest.testTokenGenerations
FAILED: dtest-upgrade.upgrade_tests.cql_tests.TestCQLNodes3RF3_Upgrade_current_4_0_x_To_indev_4_0_x.test_multi_collection
FAILED: dtest-upgrade.upgrade_tests.cql_tests.TestCQLNodes3RF3_Upgrade_current_4_0_x_To_indev_4_0_x.test_column_name_validation
FAILED: dtest-upgrade.upgrade_tests.cql_tests.TestCQLNodes3RF3_Upgrade_current_4_0_x_To_indev_4_0_x.test_row_existence
FAILED: dtest-upgrade.upgrade_tests.cql_tests.TestCQLNodes3RF3_Upgrade_current_4_0_x_To_indev_4_0_x.test_collection_indexing
FAILED: dtest-upgrade.upgrade_tests.cql_tests.TestCQLNodes2RF1_Upgrade_current_4_0_x_To_indev_4_0_x.test_order_by_multikey
-------------------------------------------------------------------------------
For complete test report and logs see https://nightlies.apache.org/cassandra/Cassandra-4.0/803/