You are viewing a plain text version of this content. The canonical link for it is here.
Posted to builds@beam.apache.org by Apache Jenkins Server <je...@builds.apache.org> on 2023/05/25 04:29:27 UTC
Build failed in Jenkins: beam_Publish_Beam_SDK_Snapshots #5424
See <https://ci-beam.apache.org/job/beam_Publish_Beam_SDK_Snapshots/5424/display/redirect>
Changes:
------------------------------------------
[...truncated 2.49 MB...]
> Task :sdks:python:container:py311:docker
#27 exporting layers 18.6s done
#27 writing image sha256:696cbc76bff3d153fa1abe8afc4ed963d70459f14cb6acc812a5840b57bd37cc 0.0s done
#27 naming to gcr.io/apache-beam-testing/beam-sdk/beam_python3.11_sdk:2.49.0.dev done
#27 DONE 18.7s
> Task :sdks:python:container:py311:dockerTag2.49.0-SNAPSHOT
> Task :sdks:python:container:py310:docker
#27 exporting layers 18.7s done
#27 writing image sha256:5fec271a26213d6a66c56be399e96386df344538ec36ace430fb2fd1ab34c192 done
#27 naming to gcr.io/apache-beam-testing/beam-sdk/beam_python3.10_sdk:2.49.0.dev done
#27 DONE 18.7s
> Task :sdks:python:container:py310:dockerTag2.49.0-SNAPSHOT
> Task :sdks:python:container:py38:docker
#27 exporting layers 17.7s done
#27 writing image sha256:c05f20fca332de3c7bed978f8ea8bfb452090309d22ea9b85e231ac124214d4a 0.0s done
#27 naming to gcr.io/apache-beam-testing/beam-sdk/beam_python3.8_sdk:2.49.0.dev done
#27 DONE 17.8s
> Task :sdks:python:container:py38:dockerTag2.49.0-SNAPSHOT
> Task :sdks:python:container:py39:docker
#27 exporting layers 17.7s done
#27 writing image sha256:a7808ae48baa8a2590503f6f3938794d15736d735861dc22fa5c2a386cd98f29 done
#27 naming to gcr.io/apache-beam-testing/beam-sdk/beam_python3.9_sdk:2.49.0.dev done
#27 DONE 17.7s
> Task :sdks:python:container:py39:dockerTag2.49.0-SNAPSHOT
> Task :sdks:python:container:py37:dockerPush2.49.0-SNAPSHOT
> Task :sdks:python:container:py311:dockerPush2.49.0-SNAPSHOT
> Task :sdks:python:container:py310:dockerPush2.49.0-SNAPSHOT
> Task :sdks:python:container:py38:dockerPush2.49.0-SNAPSHOT
> Task :sdks:python:container:py39:dockerPush2.49.0-SNAPSHOT
> Task :sdks:python:container:py37:dockerTag43d7ec0a147156f25f9f1d5288c47ca9a56a7adf
> Task :sdks:python:container:py311:dockerPush2.49.0-SNAPSHOT FAILED
unknown blob
> Task :sdks:python:container:py311:dockerTag43d7ec0a147156f25f9f1d5288c47ca9a56a7adf
> Task :sdks:python:container:py37:dockerPush43d7ec0a147156f25f9f1d5288c47ca9a56a7adf
> Task :sdks:python:container:py311:dockerPush43d7ec0a147156f25f9f1d5288c47ca9a56a7adf
> Task :sdks:python:container:py37:dockerTagLatest
> Task :sdks:python:container:py37:dockerPushLatest
> Task :sdks:python:container:py310:dockerTag43d7ec0a147156f25f9f1d5288c47ca9a56a7adf
> Task :sdks:python:container:py37:dockerTagsPush
> Task :sdks:python:container:py310:dockerPush43d7ec0a147156f25f9f1d5288c47ca9a56a7adf
> Task :sdks:python:container:py310:dockerTagLatest
> Task :sdks:python:container:py310:dockerPushLatest
> Task :sdks:python:container:py310:dockerTagsPush
> Task :sdks:python:container:py38:dockerTag43d7ec0a147156f25f9f1d5288c47ca9a56a7adf
> Task :sdks:python:container:py38:dockerPush43d7ec0a147156f25f9f1d5288c47ca9a56a7adf
The push refers to repository [gcr.io/apache-beam-testing/beam-sdk/beam_python3.8_sdk]
241f7f4dc5a0: Preparing
46abe47897b5: Preparing
ecafd7156fd9: Preparing
048588d94f81: Preparing
61368aef4ede: Preparing
e5daa6e9e837: Preparing
3d1e952c2a5a: Preparing
98e84f34c167: Preparing
8c1e2d9a792a: Preparing
0b5ec0a77b51: Preparing
5f56ac89c814: Preparing
14c3c39dc5b1: Preparing
5366cdf39190: Preparing
048588d94f81: Waiting
093fa272411c: Preparing
61368aef4ede: Waiting
994dfb4f02a8: Preparing
e5daa6e9e837: Waiting
1d1498e6e8c5: Preparing
b2b15274d361: Preparing
3d1e952c2a5a: Waiting
98e84f34c167: Waiting
ef9ab794a5c5: Preparing
d9fb275baa3d: Preparing
8c1e2d9a792a: Waiting
af5d571a6550: Preparing
ea9a66bcf3b5: Preparing
0b5ec0a77b51: Waiting
14c3c39dc5b1: Waiting
d140420135e3: Preparing
5366cdf39190: Waiting
5f56ac89c814: Waiting
b4b4f5c5ff9f: Preparing
093fa272411c: Waiting
b0df24a95c80: Preparing
b2b15274d361: Waiting
af5d571a6550: Waiting
974e52a24adf: Preparing
994dfb4f02a8: Waiting
d9fb275baa3d: Waiting
ef9ab794a5c5: Waiting
1d1498e6e8c5: Waiting
b4b4f5c5ff9f: Waiting
974e52a24adf: Waiting
b0df24a95c80: Waiting
ecafd7156fd9: Layer already exists
46abe47897b5: Layer already exists
241f7f4dc5a0: Layer already exists
048588d94f81: Layer already exists
e5daa6e9e837: Layer already exists
61368aef4ede: Layer already exists
3d1e952c2a5a: Layer already exists
8c1e2d9a792a: Layer already exists
98e84f34c167: Layer already exists
5f56ac89c814: Layer already exists
14c3c39dc5b1: Layer already exists
0b5ec0a77b51: Layer already exists
093fa272411c: Layer already exists
994dfb4f02a8: Layer already exists
5366cdf39190: Layer already exists
1d1498e6e8c5: Layer already exists
b2b15274d361: Layer already exists
ef9ab794a5c5: Layer already exists
d9fb275baa3d: Layer already exists
ea9a66bcf3b5: Layer already exists
af5d571a6550: Layer already exists
b4b4f5c5ff9f: Layer already exists
d140420135e3: Layer already exists
b0df24a95c80: Layer already exists
974e52a24adf: Layer already exists
43d7ec0a147156f25f9f1d5288c47ca9a56a7adf: digest: sha256:6e462deef2d7dac8210c2c6f7e9ab74506b195efcf8e0eda9641cec07e7edde4 size: 5563
> Task :sdks:python:container:py38:dockerTagLatest
> Task :sdks:python:container:py38:dockerPushLatest
The push refers to repository [gcr.io/apache-beam-testing/beam-sdk/beam_python3.8_sdk]
241f7f4dc5a0: Preparing
46abe47897b5: Preparing
ecafd7156fd9: Preparing
048588d94f81: Preparing
61368aef4ede: Preparing
e5daa6e9e837: Preparing
3d1e952c2a5a: Preparing
98e84f34c167: Preparing
8c1e2d9a792a: Preparing
0b5ec0a77b51: Preparing
5f56ac89c814: Preparing
14c3c39dc5b1: Preparing
5366cdf39190: Preparing
093fa272411c: Preparing
994dfb4f02a8: Preparing
1d1498e6e8c5: Preparing
b2b15274d361: Preparing
61368aef4ede: Waiting
ef9ab794a5c5: Preparing
d9fb275baa3d: Preparing
98e84f34c167: Waiting
af5d571a6550: Preparing
e5daa6e9e837: Waiting
ea9a66bcf3b5: Preparing
8c1e2d9a792a: Waiting
3d1e952c2a5a: Waiting
d140420135e3: Preparing
b4b4f5c5ff9f: Preparing
b0df24a95c80: Preparing
974e52a24adf: Preparing
14c3c39dc5b1: Waiting
093fa272411c: Waiting
994dfb4f02a8: Waiting
5366cdf39190: Waiting
0b5ec0a77b51: Waiting
5f56ac89c814: Waiting
1d1498e6e8c5: Waiting
ea9a66bcf3b5: Waiting
048588d94f81: Waiting
974e52a24adf: Waiting
b0df24a95c80: Waiting
d140420135e3: Waiting
b2b15274d361: Waiting
af5d571a6550: Waiting
d9fb275baa3d: Waiting
b4b4f5c5ff9f: Waiting
241f7f4dc5a0: Layer already exists
ecafd7156fd9: Layer already exists
46abe47897b5: Layer already exists
e5daa6e9e837: Layer already exists
61368aef4ede: Layer already exists
3d1e952c2a5a: Layer already exists
98e84f34c167: Layer already exists
0b5ec0a77b51: Layer already exists
8c1e2d9a792a: Layer already exists
5f56ac89c814: Layer already exists
14c3c39dc5b1: Layer already exists
5366cdf39190: Layer already exists
093fa272411c: Layer already exists
994dfb4f02a8: Layer already exists
1d1498e6e8c5: Layer already exists
b2b15274d361: Layer already exists
ef9ab794a5c5: Layer already exists
d9fb275baa3d: Layer already exists
af5d571a6550: Layer already exists
ea9a66bcf3b5: Layer already exists
d140420135e3: Layer already exists
b4b4f5c5ff9f: Layer already exists
b0df24a95c80: Layer already exists
974e52a24adf: Layer already exists
048588d94f81: Layer already exists
latest: digest: sha256:6e462deef2d7dac8210c2c6f7e9ab74506b195efcf8e0eda9641cec07e7edde4 size: 5563
> Task :sdks:python:container:py38:dockerTagsPush
> Task :sdks:python:container:py39:dockerPush2.49.0-SNAPSHOT
0c5dc298d7a9: Pushed
2.49.0-SNAPSHOT: digest: sha256:9a7cfc5040170527e39fdb49959e45300b27e2c6042ac6601088528aa7527c0f size: 5563
> Task :sdks:python:container:py39:dockerTag43d7ec0a147156f25f9f1d5288c47ca9a56a7adf
> Task :sdks:python:container:py39:dockerPush43d7ec0a147156f25f9f1d5288c47ca9a56a7adf
> Task :sdks:python:container:py39:dockerTagLatest
> Task :sdks:python:container:py39:dockerPushLatest
> Task :sdks:python:container:py39:dockerTagsPush
> Task :sdks:python:container:py311:dockerTagLatest
> Task :sdks:python:container:py311:dockerPushLatest
FAILURE: Build failed with an exception.
* What went wrong:
Execution failed for task ':sdks:python:container:py311:dockerPush2.49.0-SNAPSHOT'.
> Process 'command 'docker'' finished with non-zero exit value 1
* Try:
> Run with --stacktrace option to get the stack trace.
> Run with --info or --debug option to get more log output.
* Get more help at https://help.gradle.org
Deprecated Gradle features were used in this build, making it incompatible with Gradle 8.0.
You can use '--warning-mode all' to show the individual deprecation warnings and determine if they come from your own scripts or plugins.
See https://docs.gradle.org/7.5.1/userguide/command_line_interface.html#sec:command_line_warnings
Execution optimizations have been disabled for 3 invalid unit(s) of work during this build to ensure correctness.
Please consult deprecation warnings for more details.
BUILD FAILED in 15m 59s
206 actionable tasks: 169 executed, 23 from cache, 14 up-to-date
Publishing build scan...
https://ge.apache.org/s/eew47vpxcfliy
Build step 'Invoke Gradle script' changed build result to FAILURE
Build step 'Invoke Gradle script' marked build as failure
---------------------------------------------------------------------
To unsubscribe, e-mail: builds-unsubscribe@beam.apache.org
For additional commands, e-mail: builds-help@beam.apache.org
Jenkins build is back to normal : beam_Publish_Beam_SDK_Snapshots #5425
Posted by Apache Jenkins Server <je...@builds.apache.org>.
See <https://ci-beam.apache.org/job/beam_Publish_Beam_SDK_Snapshots/5425/display/redirect>
---------------------------------------------------------------------
To unsubscribe, e-mail: builds-unsubscribe@beam.apache.org
For additional commands, e-mail: builds-help@beam.apache.org