You are viewing a plain text version of this content. The canonical link for it is here.
Posted to commits@jena.apache.org by Apache Jenkins Server <je...@builds.apache.org> on 2016/12/22 18:33:13 UTC

Build failed in Jenkins: Jena_Development_Test #2568

See <https://builds.apache.org/job/Jena_Development_Test/2568/changes>

Changes:

[andy] JENA-1267: Module jena-rdfconnection

[andy] Module jena-integration-tests

[andy] JENA-1267: Wire in jena-rdfconnection and jena-integration-tests

[andy] Fix typos and code formatting

[andy] Isolation modes, inc documentation and tests.

[andy] Clean up jena-rdfconenction

[andy] TDB requires COPY isolation (or transactions)

------------------------------------------
[...truncated 3802 lines...]
Tests run: 4, Failures: 0, Errors: 0, Skipped: 0, Time elapsed: 0.15 sec - in org.apache.jena.hadoop.rdf.mapreduce.filter.TripleFilterByNoPredicateMapperTest
Running org.apache.jena.hadoop.rdf.mapreduce.transform.TriplesToQuadsConstantGraphMapperTest
Tests run: 4, Failures: 0, Errors: 0, Skipped: 0, Time elapsed: 0.921 sec - in org.apache.jena.hadoop.rdf.mapreduce.transform.TriplesToQuadsConstantGraphMapperTest
Running org.apache.jena.hadoop.rdf.mapreduce.transform.QuadsToTriplesMapperTest
Tests run: 4, Failures: 0, Errors: 0, Skipped: 0, Time elapsed: 0.707 sec - in org.apache.jena.hadoop.rdf.mapreduce.transform.QuadsToTriplesMapperTest
Running org.apache.jena.hadoop.rdf.mapreduce.transform.TriplesToQuadsBySubjectMapperTest
Tests run: 4, Failures: 0, Errors: 0, Skipped: 0, Time elapsed: 1.02 sec - in org.apache.jena.hadoop.rdf.mapreduce.transform.TriplesToQuadsBySubjectMapperTest
Running org.apache.jena.hadoop.rdf.mapreduce.count.QuadNodeCountMapperTest
Tests run: 4, Failures: 0, Errors: 0, Skipped: 0, Time elapsed: 1.306 sec - in org.apache.jena.hadoop.rdf.mapreduce.count.QuadNodeCountMapperTest
Running org.apache.jena.hadoop.rdf.mapreduce.count.QuadNodeCountMapReduceTest
Tests run: 4, Failures: 0, Errors: 0, Skipped: 0, Time elapsed: 2.748 sec - in org.apache.jena.hadoop.rdf.mapreduce.count.QuadNodeCountMapReduceTest
Running org.apache.jena.hadoop.rdf.mapreduce.count.TripleNodeCountMapReduceTest
Tests run: 4, Failures: 0, Errors: 0, Skipped: 0, Time elapsed: 1.748 sec - in org.apache.jena.hadoop.rdf.mapreduce.count.TripleNodeCountMapReduceTest
Running org.apache.jena.hadoop.rdf.mapreduce.count.TripleNodeCountMapperTest
Tests run: 4, Failures: 0, Errors: 0, Skipped: 0, Time elapsed: 0.47 sec - in org.apache.jena.hadoop.rdf.mapreduce.count.TripleNodeCountMapperTest
Running org.apache.jena.hadoop.rdf.mapreduce.group.QuadGroupByObjectMapperTest
Tests run: 4, Failures: 0, Errors: 0, Skipped: 0, Time elapsed: 0.572 sec - in org.apache.jena.hadoop.rdf.mapreduce.group.QuadGroupByObjectMapperTest
Running org.apache.jena.hadoop.rdf.mapreduce.group.QuadGroupBySubjectMapperTest
Tests run: 4, Failures: 0, Errors: 0, Skipped: 0, Time elapsed: 0.263 sec - in org.apache.jena.hadoop.rdf.mapreduce.group.QuadGroupBySubjectMapperTest
Running org.apache.jena.hadoop.rdf.mapreduce.group.TripleGroupByPredicateMapperTest
Tests run: 4, Failures: 0, Errors: 0, Skipped: 0, Time elapsed: 0.263 sec - in org.apache.jena.hadoop.rdf.mapreduce.group.TripleGroupByPredicateMapperTest
Running org.apache.jena.hadoop.rdf.mapreduce.group.QuadGroupByGraphMapperTest
Tests run: 4, Failures: 0, Errors: 0, Skipped: 0, Time elapsed: 0.263 sec - in org.apache.jena.hadoop.rdf.mapreduce.group.QuadGroupByGraphMapperTest
Running org.apache.jena.hadoop.rdf.mapreduce.group.TripleGroupBySubjectMapperTest
Tests run: 4, Failures: 0, Errors: 0, Skipped: 0, Time elapsed: 0.301 sec - in org.apache.jena.hadoop.rdf.mapreduce.group.TripleGroupBySubjectMapperTest
Running org.apache.jena.hadoop.rdf.mapreduce.group.QuadGroupByPredicateMapperTest
Tests run: 4, Failures: 0, Errors: 0, Skipped: 0, Time elapsed: 0.258 sec - in org.apache.jena.hadoop.rdf.mapreduce.group.QuadGroupByPredicateMapperTest
Running org.apache.jena.hadoop.rdf.mapreduce.group.TripleGroupByObjectMapperTest
Tests run: 4, Failures: 0, Errors: 0, Skipped: 0, Time elapsed: 0.265 sec - in org.apache.jena.hadoop.rdf.mapreduce.group.TripleGroupByObjectMapperTest
Running org.apache.jena.hadoop.rdf.mapreduce.characteristics.TripleCharacteristicSetGeneratingReducerTest
Tests run: 5, Failures: 0, Errors: 0, Skipped: 0, Time elapsed: 0.071 sec - in org.apache.jena.hadoop.rdf.mapreduce.characteristics.TripleCharacteristicSetGeneratingReducerTest
Running org.apache.jena.hadoop.rdf.mapreduce.characteristics.CharacteristicSetReducerTest
Tests run: 6, Failures: 0, Errors: 0, Skipped: 0, Time elapsed: 0.126 sec - in org.apache.jena.hadoop.rdf.mapreduce.characteristics.CharacteristicSetReducerTest

Results :

Tests run: 111, Failures: 0, Errors: 0, Skipped: 0

[JENKINS] Recording test results
[INFO] 
[INFO] --- maven-jar-plugin:3.0.0:jar (default-jar) @ jena-elephas-mapreduce ---
[INFO] Building jar: <https://builds.apache.org/job/Jena_Development_Test/ws/jena-elephas/jena-elephas-mapreduce/target/jena-elephas-mapreduce-3.2.0-SNAPSHOT.jar>
[INFO] 
[INFO] --- maven-site-plugin:3.5.1:attach-descriptor (attach-descriptor) @ jena-elephas-mapreduce ---
[INFO] 
[INFO] --- maven-jar-plugin:3.0.0:test-jar (default) @ jena-elephas-mapreduce ---
[INFO] Building jar: <https://builds.apache.org/job/Jena_Development_Test/ws/jena-elephas/jena-elephas-mapreduce/target/jena-elephas-mapreduce-3.2.0-SNAPSHOT-tests.jar>
[INFO] 
[INFO] --- maven-javadoc-plugin:2.10.3:jar (attach-javadocs) @ jena-elephas-mapreduce ---
[INFO] 
1 warning
[WARNING] Javadoc Warnings
[WARNING] <https://builds.apache.org/job/Jena_Development_Test/ws/jena-elephas/jena-elephas-mapreduce/src/main/java/org/apache/jena/hadoop/rdf/mapreduce/filter/AbstractNodeTupleFilterMapper.java>:43: warning - Tag @link: can't find accepts(TKey, T) in org.apache.jena.hadoop.rdf.mapreduce.filter.AbstractNodeTupleFilterMapper
[INFO] Building jar: <https://builds.apache.org/job/Jena_Development_Test/ws/jena-elephas/jena-elephas-mapreduce/target/jena-elephas-mapreduce-3.2.0-SNAPSHOT-javadoc.jar>
[JENKINS] Archiving disabled
[INFO]                                                                         
[INFO] ------------------------------------------------------------------------
[INFO] Building Apache Jena - Elephas - Statistics Demo App 3.2.0-SNAPSHOT
[INFO] ------------------------------------------------------------------------
[INFO] 
[INFO] --- maven-clean-plugin:3.0.0:clean (default-clean) @ jena-elephas-stats ---
[INFO] Deleting <https://builds.apache.org/job/Jena_Development_Test/ws/jena-elephas/jena-elephas-stats/target>
[INFO] 
[INFO] --- maven-enforcer-plugin:1.4.1:enforce (enforce) @ jena-elephas-stats ---
[INFO] 
[INFO] --- apache-rat-plugin:0.11:check (rat-checks) @ jena-elephas-stats ---
[INFO] 51 implicit excludes (use -debug for more details).
[INFO] Exclude: **/.project
[INFO] Exclude: **/.settings/**
[INFO] Exclude: **/.classpath
[INFO] Exclude: **/README.*
[INFO] Exclude: **/META-INF/services/*
[INFO] Exclude: **/src-examples/data/*
[INFO] Exclude: **/dist/ABOUT
[INFO] Exclude: **/SEE_FUSEKI2
[INFO] Exclude: **/src/main/webapp/css/*
[INFO] Exclude: **/src/main/webapp/fonts/*
[INFO] Exclude: **/src/main/webapp/js/**/*
[INFO] Exclude: **/vocabularies/*
[INFO] Exclude: **/Vocabularies/*
[INFO] Exclude: **/src/main/**/*.html
[INFO] Exclude: **/src/**/package-info.java
[INFO] Exclude: **/DEPENDENCIES
[INFO] Exclude: **/*.txt
[INFO] Exclude: **/*.md
[INFO] Exclude: **/META-INF/services/*
[INFO] Exclude: **/src/test/resources/**/*
[INFO] Exclude: **/testing/**/*
[INFO] Exclude: **/log4j.properties
[INFO] Exclude: **/log4j-testing.properties
[INFO] Exclude: **/derby.log
[INFO] Exclude: **/DB/**/*
[INFO] Exclude: **/tdb*.cfg
[INFO] Exclude: **/run/**/*
[INFO] Exclude: **/*.classpath
[INFO] Exclude: **/target/**/*
[INFO] Exclude: **/dependency-reduced-pom.xml
[INFO] 4 resources included (use -debug for more details)
[INFO] Rat check: Summary of files. Unapproved: 0 unknown: 0 generated: 0 approved: 4 licence.
[INFO] 
[INFO] --- maven-remote-resources-plugin:1.5:process (process-resource-bundles) @ jena-elephas-stats ---
[INFO] 
[INFO] --- maven-resources-plugin:2.7:resources (default-resources) @ jena-elephas-stats ---
[INFO] Using 'UTF-8' encoding to copy filtered resources.
[INFO] skip non existing resourceDirectory <https://builds.apache.org/job/Jena_Development_Test/ws/jena-elephas/jena-elephas-stats/src/main/resources>
[INFO] Copying 3 resources
[INFO] 
[INFO] --- maven-compiler-plugin:3.5.1:compile (default-compile) @ jena-elephas-stats ---
[INFO] Changes detected - recompiling the module!
[INFO] Compiling 2 source files to <https://builds.apache.org/job/Jena_Development_Test/ws/jena-elephas/jena-elephas-stats/target/classes>
[INFO] 
[INFO] --- maven-resources-plugin:2.7:testResources (default-testResources) @ jena-elephas-stats ---
[INFO] Using 'UTF-8' encoding to copy filtered resources.
[INFO] skip non existing resourceDirectory <https://builds.apache.org/job/Jena_Development_Test/ws/jena-elephas/jena-elephas-stats/src/test/resources>
[INFO] Copying 3 resources
[INFO] 
[INFO] --- maven-compiler-plugin:3.5.1:testCompile (default-testCompile) @ jena-elephas-stats ---
[INFO] No sources to compile
[INFO] 
[INFO] --- maven-surefire-plugin:2.19.1:test (default-test) @ jena-elephas-stats ---
[JENKINS] Recording test results
[INFO] 
[INFO] --- maven-jar-plugin:3.0.0:jar (default-jar) @ jena-elephas-stats ---
[INFO] Building jar: <https://builds.apache.org/job/Jena_Development_Test/ws/jena-elephas/jena-elephas-stats/target/jena-elephas-stats-3.2.0-SNAPSHOT.jar>
[INFO] 
[INFO] --- maven-site-plugin:3.5.1:attach-descriptor (attach-descriptor) @ jena-elephas-stats ---
[INFO] 
[INFO] --- maven-javadoc-plugin:2.10.3:jar (attach-javadocs) @ jena-elephas-stats ---
[INFO] 
1 warning
[WARNING] Javadoc Warnings
[WARNING] javadoc: warning - Error fetching URL: http://jena.apache.org/documentation/javadoc/elephas/
[INFO] Building jar: <https://builds.apache.org/job/Jena_Development_Test/ws/jena-elephas/jena-elephas-stats/target/jena-elephas-stats-3.2.0-SNAPSHOT-javadoc.jar>
[INFO] 
[INFO] --- maven-assembly-plugin:2.6:single (make-assembly) @ jena-elephas-stats ---
[INFO] Reading assembly descriptor: hadoop-job.xml
[WARNING] The assembly descriptor contains a filesystem-root relative reference, which is not cross platform compatible /
[INFO] Building jar: <https://builds.apache.org/job/Jena_Development_Test/ws/jena-elephas/jena-elephas-stats/target/jena-elephas-stats-3.2.0-SNAPSHOT-hadoop-job.jar>
[JENKINS] Archiving disabled
[INFO]                                                                         
[INFO] ------------------------------------------------------------------------
[INFO] Building Apache Jena - Distribution 3.2.0-SNAPSHOT
[INFO] ------------------------------------------------------------------------
[INFO] Downloading: http://repository.apache.org/snapshots/org/apache/jena/jena-rdfconnection/3.2.0-SNAPSHOT/jena-rdfconnection-3.2.0-SNAPSHOT-sources.jar
[JENKINS] Archiving disabled
[JENKINS] Archiving disabled
[JENKINS] Archiving disabled
[JENKINS] Archiving disabled
[JENKINS] Archiving disabled
[JENKINS] Archiving disabled
[JENKINS] Archiving disabled
[JENKINS] Archiving disabled
[JENKINS] Archiving disabled
[JENKINS] Archiving disabled
[JENKINS] Archiving disabled
[JENKINS] Archiving disabled
[JENKINS] Archiving disabled
[JENKINS] Archiving disabled
[JENKINS] Archiving disabled
[JENKINS] Archiving disabled
[JENKINS] Archiving disabled
[JENKINS] Archiving disabled
[JENKINS] Archiving disabled
[JENKINS] Archiving disabled
[JENKINS] Archiving disabled
[JENKINS] Archiving disabled
[JENKINS] Archiving disabled
[JENKINS] Archiving disabled
[JENKINS] Archiving disabled
[JENKINS] Archiving disabled
[JENKINS] Archiving disabled
[JENKINS] Archiving disabled
[JENKINS] Archiving disabled
[JENKINS] Archiving disabled
[JENKINS] Archiving disabled
[JENKINS] Archiving disabled
[JENKINS] Archiving disabled
[JENKINS] Archiving disabled
[JENKINS] Archiving disabled
[JENKINS] Archiving disabled
[JENKINS] Archiving disabled
[JENKINS] Archiving disabled
[JENKINS] Archiving disabled
[JENKINS] Archiving disabled
[JENKINS] Archiving disabled
[JENKINS] Archiving disabled[INFO] ------------------------------------------------------------------------
[INFO] Reactor Summary:
[INFO] 
[INFO] Apache Jena - Parent ............................... SUCCESS [  2.843 s]
[INFO] Apache Jena - Shadowed external libraries .......... SUCCESS [  3.451 s]
[INFO] Apache Jena - IRI .................................. SUCCESS [  7.314 s]
[INFO] Apache Jena - Base Common Environment .............. SUCCESS [ 20.185 s]
[INFO] Apache Jena - Core ................................. SUCCESS [01:02 min]
[INFO] Apache Jena - ARQ (SPARQL 1.1 Query Engine) ........ SUCCESS [01:03 min]
[INFO] Apache Jena - RDF Connection ....................... SUCCESS [  7.564 s]
[INFO] Apache Jena - TDB (Native Triple Store) ............ SUCCESS [ 23.134 s]
[INFO] Apache Jena - Libraries POM ........................ SUCCESS [  0.844 s]
[INFO] Apache Jena - Command line tools ................... SUCCESS [ 17.144 s]
[INFO] Apache Jena - SPARQL Text Search ................... SUCCESS [ 15.435 s]
[INFO] Apache Jena - SPARQL Spatial Search ................ SUCCESS [ 10.175 s]
[INFO] Apache Jena - Data Tables for RDF and SPARQL ....... SUCCESS [  7.288 s]
[INFO] Apache Jena - SDB (SQL based triple store) ......... SUCCESS [ 28.934 s]
[INFO] Apache Jena - Fuseki1 .............................. SUCCESS [ 19.652 s]
[INFO] Apache Jena - Fuseki - A SPARQL 1.1 Server ......... SUCCESS [  0.531 s]
[INFO] Apache Jena - Fuseki Server Engine ................. SUCCESS [ 16.467 s]
[INFO] Apache Jena - Fuseki Embedded Server ............... SUCCESS [  8.380 s]
[INFO] Apache Jena - Fuseki WAR File ...................... SUCCESS [  5.764 s]
[INFO] Apache Jena - Fuseki Server Standalone Jar ......... SUCCESS [  5.434 s]
[INFO] Apache Jena - Fuseki Binary Distribution ........... SUCCESS [  5.934 s]
[INFO] Apache Jena - Integration Testing .................. SUCCESS [  9.852 s]
[INFO] Apache Jena - Security Permissions ................. SUCCESS [ 18.295 s]
[INFO] Apache Jena - JDBC Parent .......................... SUCCESS [  0.793 s]
[INFO] Apache Jena - JDBC Core API ........................ SUCCESS [ 42.207 s]
[INFO] Apache Jena - JDBC Remote Endpoint Driver .......... SUCCESS [ 32.748 s]
[INFO] Apache Jena - JDBC In-Memory Driver ................ SUCCESS [ 19.927 s]
[INFO] Apache Jena - JDBC TDB Driver ...................... SUCCESS [ 43.746 s]
[INFO] Apache Jena - JDBC Driver Bundle ................... SUCCESS [ 16.807 s]
[INFO] Apache Jena - Elephas .............................. SUCCESS [  0.517 s]
[INFO] Apache Jena - Elephas - Common API ................. SUCCESS [  8.857 s]
[INFO] Apache Jena - Elephas - I/O ........................ SUCCESS [18:04 min]
[INFO] Apache Jena - Elephas - Map/Reduce ................. SUCCESS [ 28.728 s]
[INFO] Apache Jena - Elephas - Statistics Demo App ........ SUCCESS [  5.741 s]
[INFO] Apache Jena - Distribution ......................... FAILURE [  0.711 s]
[INFO] Apache Jena - OSGi ................................. SKIPPED
[INFO] Apache Jena - OSGi bundle .......................... SKIPPED
[INFO] Apache Jena - OSGi Karaf features .................. SKIPPED
[INFO] Apache Jena - Extras ............................... SKIPPED
[INFO] Apache Jena - Extras - Query Builder ............... SKIPPED
[INFO] Apache Jena ........................................ SKIPPED
[INFO] ------------------------------------------------------------------------
[INFO] BUILD FAILURE
[INFO] ------------------------------------------------------------------------
[INFO] Total time: 28:00 min
[INFO] Finished at: 2016-12-22T17:58:09+00:00

[INFO] Final Memory: 140M/4077M
[INFO] ------------------------------------------------------------------------
Waiting for Jenkins to finish collecting data
[ERROR] Failed to execute goal on project apache-jena: Could not resolve dependencies for project org.apache.jena:apache-jena:pom:3.2.0-SNAPSHOT: Could not find artifact org.apache.jena:jena-rdfconnection:jar:sources:3.2.0-SNAPSHOT in Nexus (http://repository.apache.org/snapshots) -> [Help 1]
[ERROR] 
[ERROR] To see the full stack trace of the errors, re-run Maven with the -e switch.
[ERROR] Re-run Maven using the -X switch to enable full debug logging.
[ERROR] 
[ERROR] For more information about the errors and possible solutions, please read the following articles:
[ERROR] [Help 1] http://cwiki.apache.org/confluence/display/MAVEN/DependencyResolutionException
[ERROR] 
[ERROR] After correcting the problems, you can resume the build with the command
[ERROR]   mvn <goals> -rf :apache-jena
channel stopped

Jenkins build is back to normal : Jena_Development_Test #2569

Posted by Apache Jenkins Server <je...@builds.apache.org>.
See <https://builds.apache.org/job/Jena_Development_Test/2569/changes>