You are viewing a plain text version of this content. The canonical link for it is here.
Posted to builds@cassandra.apache.org by Apache Jenkins Server <je...@builds.apache.org> on 2023/05/28 07:49:01 UTC
Build complete: Cassandra-4.0 #591 [UNSTABLE] 4555b94345aa7183902bf1b5a54ad40fce13d432
-------------------------------------------------------------------------------
Build Cassandra-4.0 #591 Still Unstable
URL: https://ci-cassandra.apache.org/job/Cassandra-4.0/591/
-------------------------------------------------------------------------------
Changes:
[Michael Semb Wever] Prepare debian changelog for 4.0.10
[Brandon Williams] Ninja fix GetFullQueryLogTest
[Michael Semb Wever] ninja-fix FullQueryLoggerTest, requires allow_nodetool_archive_command
-------------------------------------------------------------------------------
Failed Tests:
8 tests failed.
FAILED: dtest-offheap.global_row_key_cache_test.TestGlobalRowKeyCache.test_functional
FAILED: dtest-offheap.materialized_views_test.TestMaterializedViews.test_no_base_column_in_view_pk_complex_timestamp_with_flush
FAILED: dtest.repair_tests.repair_test.TestRepair.test_failure_during_validation
FAILED: org.apache.cassandra.net.ConnectionTest.testMessageDeliveryOnReconnect-compression
FAILED: org.apache.cassandra.cql3.EmptyValuesTest.testEmptyTimeUUID
FAILED: org.apache.cassandra.db.partition.PartitionImplementationTest.testMarkersOnly
FAILED: org.apache.cassandra.distributed.test.FailingRepairTest.testFailingMessage[VALIDATION_REQ/parallel/true]
FAILED: org.apache.cassandra.distributed.test.FailingRepairTest.testFailingMessage[VALIDATION_REQ/parallel/true]
-------------------------------------------------------------------------------
For complete test report and logs see https://nightlies.apache.org/cassandra/Cassandra-4.0/591/