You are viewing a plain text version of this content. The canonical link for it is here.
Posted to dev@zookeeper.apache.org by Apache Jenkins Server <je...@builds.apache.org> on 2016/12/23 17:15:43 UTC

ZooKeeper_branch35_solaris - Build # 368 - Still Failing

See https://builds.apache.org/job/ZooKeeper_branch35_solaris/368/

###################################################################################
########################## LAST 60 LINES OF THE CONSOLE ###########################
[...truncated 468769 lines...]
    [junit] 2016-12-23 17:17:01,074 [myid:] - INFO  [main:ClientBase@386] - CREATING server instance 127.0.0.1:11222
    [junit] 2016-12-23 17:17:01,074 [myid:] - INFO  [main:NIOServerCnxnFactory@673] - Configuring NIO connection handler with 10s sessionless connection timeout, 2 selector thread(s), 16 worker threads, and 64 kB direct buffers.
    [junit] 2016-12-23 17:17:01,075 [myid:] - INFO  [main:NIOServerCnxnFactory@686] - binding to port 0.0.0.0/0.0.0.0:11222
    [junit] 2016-12-23 17:17:01,075 [myid:] - INFO  [main:ClientBase@361] - STARTING server instance 127.0.0.1:11222
    [junit] 2016-12-23 17:17:01,076 [myid:] - INFO  [main:ZooKeeperServer@893] - minSessionTimeout set to 6000
    [junit] 2016-12-23 17:17:01,076 [myid:] - INFO  [main:ZooKeeperServer@902] - maxSessionTimeout set to 60000
    [junit] 2016-12-23 17:17:01,076 [myid:] - INFO  [main:ZooKeeperServer@159] - Created server with tickTime 3000 minSessionTimeout 6000 maxSessionTimeout 60000 datadir /zonestorage/hudson_solaris/home/hudson/hudson-slave/workspace/ZooKeeper_branch35_solaris/build/test/tmp/test8366637069306719575.junit.dir/version-2 snapdir /zonestorage/hudson_solaris/home/hudson/hudson-slave/workspace/ZooKeeper_branch35_solaris/build/test/tmp/test8366637069306719575.junit.dir/version-2
    [junit] 2016-12-23 17:17:01,077 [myid:] - INFO  [main:FileSnap@83] - Reading snapshot /zonestorage/hudson_solaris/home/hudson/hudson-slave/workspace/ZooKeeper_branch35_solaris/build/test/tmp/test8366637069306719575.junit.dir/version-2/snapshot.b
    [junit] 2016-12-23 17:17:01,079 [myid:] - INFO  [main:FileTxnSnapLog@306] - Snapshotting: 0xb to /zonestorage/hudson_solaris/home/hudson/hudson-slave/workspace/ZooKeeper_branch35_solaris/build/test/tmp/test8366637069306719575.junit.dir/version-2/snapshot.b
    [junit] 2016-12-23 17:17:01,080 [myid:] - ERROR [main:ZooKeeperServer@505] - ZKShutdownHandler is not registered, so ZooKeeper server won't take any action on ERROR or SHUTDOWN server state changes
    [junit] 2016-12-23 17:17:01,080 [myid:] - INFO  [main:FourLetterWordMain@85] - connecting to 127.0.0.1 11222
    [junit] 2016-12-23 17:17:01,081 [myid:] - INFO  [NIOServerCxnFactory.AcceptThread:0.0.0.0/0.0.0.0:11222:NIOServerCnxnFactory$AcceptThread@296] - Accepted socket connection from /127.0.0.1:47712
    [junit] 2016-12-23 17:17:01,081 [myid:] - INFO  [NIOWorkerThread-1:NIOServerCnxn@485] - Processing stat command from /127.0.0.1:47712
    [junit] 2016-12-23 17:17:01,082 [myid:] - INFO  [NIOWorkerThread-1:StatCommand@49] - Stat command output
    [junit] 2016-12-23 17:17:01,082 [myid:] - INFO  [NIOWorkerThread-1:NIOServerCnxn@614] - Closed socket connection for client /127.0.0.1:47712 (no session established for client)
    [junit] 2016-12-23 17:17:01,082 [myid:] - INFO  [main:JMXEnv@228] - ensureParent:[InMemoryDataTree, StandaloneServer_port]
    [junit] 2016-12-23 17:17:01,084 [myid:] - INFO  [main:JMXEnv@245] - expect:InMemoryDataTree
    [junit] 2016-12-23 17:17:01,085 [myid:] - INFO  [main:JMXEnv@249] - found:InMemoryDataTree org.apache.ZooKeeperService:name0=StandaloneServer_port11222,name1=InMemoryDataTree
    [junit] 2016-12-23 17:17:01,085 [myid:] - INFO  [main:JMXEnv@245] - expect:StandaloneServer_port
    [junit] 2016-12-23 17:17:01,085 [myid:] - INFO  [main:JMXEnv@249] - found:StandaloneServer_port org.apache.ZooKeeperService:name0=StandaloneServer_port11222
    [junit] 2016-12-23 17:17:01,085 [myid:] - INFO  [main:JUnit4ZKTestRunner$LoggedInvokeMethod@82] - Memory used 17747
    [junit] 2016-12-23 17:17:01,086 [myid:] - INFO  [main:JUnit4ZKTestRunner$LoggedInvokeMethod@87] - Number of threads 24
    [junit] 2016-12-23 17:17:01,086 [myid:] - INFO  [main:JUnit4ZKTestRunner$LoggedInvokeMethod@102] - FINISHED TEST METHOD testQuota
    [junit] 2016-12-23 17:17:01,086 [myid:] - INFO  [main:ClientBase@543] - tearDown starting
    [junit] 2016-12-23 17:17:01,162 [myid:] - INFO  [main:ZooKeeper@1311] - Session: 0x125a9a95c060000 closed
    [junit] 2016-12-23 17:17:01,162 [myid:] - INFO  [main:ClientBase@513] - STOPPING server
    [junit] 2016-12-23 17:17:01,162 [myid:] - INFO  [main-EventThread:ClientCnxn$EventThread@513] - EventThread shut down for session: 0x125a9a95c060000
    [junit] 2016-12-23 17:17:01,162 [myid:] - INFO  [NIOServerCxnFactory.AcceptThread:0.0.0.0/0.0.0.0:11222:NIOServerCnxnFactory$AcceptThread@219] - accept thread exitted run method
    [junit] 2016-12-23 17:17:01,162 [myid:] - INFO  [NIOServerCxnFactory.SelectorThread-1:NIOServerCnxnFactory$SelectorThread@420] - selector thread exitted run method
    [junit] 2016-12-23 17:17:01,162 [myid:] - INFO  [ConnnectionExpirer:NIOServerCnxnFactory$ConnectionExpirerThread@583] - ConnnectionExpirerThread interrupted
    [junit] 2016-12-23 17:17:01,162 [myid:] - INFO  [NIOServerCxnFactory.SelectorThread-0:NIOServerCnxnFactory$SelectorThread@420] - selector thread exitted run method
    [junit] 2016-12-23 17:17:01,163 [myid:] - INFO  [main:ZooKeeperServer@533] - shutting down
    [junit] 2016-12-23 17:17:01,163 [myid:] - ERROR [main:ZooKeeperServer@505] - ZKShutdownHandler is not registered, so ZooKeeper server won't take any action on ERROR or SHUTDOWN server state changes
    [junit] 2016-12-23 17:17:01,163 [myid:] - INFO  [main:SessionTrackerImpl@232] - Shutting down
    [junit] 2016-12-23 17:17:01,163 [myid:] - INFO  [main:PrepRequestProcessor@974] - Shutting down
    [junit] 2016-12-23 17:17:01,164 [myid:] - INFO  [main:SyncRequestProcessor@191] - Shutting down
    [junit] 2016-12-23 17:17:01,164 [myid:] - INFO  [ProcessThread(sid:0 cport:11222)::PrepRequestProcessor@154] - PrepRequestProcessor exited loop!
    [junit] 2016-12-23 17:17:01,164 [myid:] - INFO  [SyncThread:0:SyncRequestProcessor@169] - SyncRequestProcessor exited!
    [junit] 2016-12-23 17:17:01,164 [myid:] - INFO  [main:FinalRequestProcessor@479] - shutdown of request processor complete
    [junit] 2016-12-23 17:17:01,164 [myid:] - INFO  [main:MBeanRegistry@128] - Unregister MBean [org.apache.ZooKeeperService:name0=StandaloneServer_port11222,name1=InMemoryDataTree]
    [junit] 2016-12-23 17:17:01,165 [myid:] - INFO  [main:MBeanRegistry@128] - Unregister MBean [org.apache.ZooKeeperService:name0=StandaloneServer_port11222]
    [junit] 2016-12-23 17:17:01,165 [myid:] - INFO  [main:FourLetterWordMain@85] - connecting to 127.0.0.1 11222
    [junit] 2016-12-23 17:17:01,165 [myid:] - INFO  [main:JMXEnv@146] - ensureOnly:[]
    [junit] 2016-12-23 17:17:01,169 [myid:] - INFO  [main:ClientBase@568] - fdcount after test is: 60 at start it was 43
    [junit] 2016-12-23 17:17:01,169 [myid:] - INFO  [main:ClientBase@570] - sleeping for 20 secs
    [junit] 2016-12-23 17:17:01,171 [myid:] - INFO  [main:ZKTestCase$1@65] - SUCCEEDED testQuota
    [junit] 2016-12-23 17:17:01,171 [myid:] - INFO  [main:ZKTestCase$1@60] - FINISHED testQuota
    [junit] Tests run: 1, Failures: 0, Errors: 0, Time elapsed: 0.986 sec

BUILD FAILED
/zonestorage/hudson_solaris/home/hudson/hudson-slave/workspace/ZooKeeper_branch35_solaris/build.xml:1234: Tests failed!

Total time: 66 minutes 11 seconds
Build step 'Invoke Ant' marked build as failure
[locks-and-latches] Releasing all the locks
[locks-and-latches] All the locks released
Recording test results
Email was triggered for: Failure - Any
Sending email for trigger: Failure - Any



###################################################################################
############################## FAILED TESTS (if any) ##############################
2 tests failed.
FAILED:  org.apache.zookeeper.test.ReconfigTest.testPortChangeToBlockedPortLeader

Error Message:
client could not connect to reestablished quorum: giving up after 30+ seconds.

Stack Trace:
junit.framework.AssertionFailedError: client could not connect to reestablished quorum: giving up after 30+ seconds.
	at org.apache.zookeeper.test.ReconfigTest.testNormalOperation(ReconfigTest.java:183)
	at org.apache.zookeeper.test.ReconfigTest.testPortChangeToBlockedPort(ReconfigTest.java:796)
	at org.apache.zookeeper.test.ReconfigTest.testPortChangeToBlockedPortLeader(ReconfigTest.java:719)
	at org.apache.zookeeper.JUnit4ZKTestRunner$LoggedInvokeMethod.evaluate(JUnit4ZKTestRunner.java:79)


FAILED:  org.apache.zookeeper.test.ReconfigTest.testPortChangeToBlockedPortFollower

Error Message:
client could not connect to reestablished quorum: giving up after 30+ seconds.

Stack Trace:
junit.framework.AssertionFailedError: client could not connect to reestablished quorum: giving up after 30+ seconds.
	at org.apache.zookeeper.test.ReconfigTest.testNormalOperation(ReconfigTest.java:183)
	at org.apache.zookeeper.test.ReconfigTest.testPortChangeToBlockedPort(ReconfigTest.java:796)
	at org.apache.zookeeper.test.ReconfigTest.testPortChangeToBlockedPortFollower(ReconfigTest.java:715)
	at org.apache.zookeeper.JUnit4ZKTestRunner$LoggedInvokeMethod.evaluate(JUnit4ZKTestRunner.java:79)