You are viewing a plain text version of this content. The canonical link for it is here.
Posted to builds@beam.apache.org by Apache Jenkins Server <je...@builds.apache.org> on 2022/09/14 07:04:13 UTC
Build failed in Jenkins: beam_PreCommit_Python_Cron #6120
See <https://ci-beam.apache.org/job/beam_PreCommit_Python_Cron/6120/display/redirect>
Changes:
------------------------------------------
[...truncated 138.53 KB...]
==============================================================================
4: Task failed with an exception.
-----------
* What went wrong:
Execution failed for task ':sdks:python:test-suites:tox:py39:testPy39Cloud'.
> Process 'command 'sh'' finished with non-zero exit value 1
* Try:
> Run with --stacktrace option to get the stack trace.
> Run with --info or --debug option to get more log output.
==============================================================================
5: Task failed with an exception.
-----------
* What went wrong:
Execution failed for task ':sdks:python:test-suites:tox:py37:testPy37Cloud'.
> Process 'command 'sh'' finished with non-zero exit value 1
* Try:
> Run with --stacktrace option to get the stack trace.
> Run with --info or --debug option to get more log output.
==============================================================================
6: Task failed with an exception.
-----------
* What went wrong:
Execution failed for task ':sdks:python:test-suites:tox:py38:testPy38Cython'.
> Process 'command 'sh'' finished with non-zero exit value 1
* Try:
> Run with --stacktrace option to get the stack trace.
> Run with --info or --debug option to get more log output.
==============================================================================
7: Task failed with an exception.
-----------
* What went wrong:
Execution failed for task ':sdks:python:test-suites:tox:py39:testPy39Cython'.
> Process 'command 'sh'' finished with non-zero exit value 1
* Try:
> Run with --stacktrace option to get the stack trace.
> Run with --info or --debug option to get more log output.
==============================================================================
8: Task failed with an exception.
-----------
* What went wrong:
Execution failed for task ':sdks:python:test-suites:tox:py37:testPy37Cython'.
> Process 'command 'sh'' finished with non-zero exit value 1
* Try:
> Run with --stacktrace option to get the stack trace.
> Run with --info or --debug option to get more log output.
==============================================================================
9: Task failed with an exception.
-----------
* What went wrong:
Execution failed for task ':sdks:python:test-suites:tox:py38:testPy38pandas-11'.
> Process 'command 'sh'' finished with non-zero exit value 1
* Try:
> Run with --stacktrace option to get the stack trace.
> Run with --info or --debug option to get more log output.
==============================================================================
10: Task failed with an exception.
-----------
* What went wrong:
Execution failed for task ':sdks:python:test-suites:tox:py38:testPy38pandas-12'.
> Process 'command 'sh'' finished with non-zero exit value 1
* Try:
> Run with --stacktrace option to get the stack trace.
> Run with --info or --debug option to get more log output.
==============================================================================
11: Task failed with an exception.
-----------
* What went wrong:
Execution failed for task ':sdks:python:test-suites:tox:py38:testPy38pandas-13'.
> Process 'command 'sh'' finished with non-zero exit value 1
* Try:
> Run with --stacktrace option to get the stack trace.
> Run with --info or --debug option to get more log output.
==============================================================================
12: Task failed with an exception.
-----------
* What went wrong:
Execution failed for task ':sdks:python:test-suites:tox:py38:testPy38pandas-14'.
> Process 'command 'sh'' finished with non-zero exit value 1
* Try:
> Run with --stacktrace option to get the stack trace.
> Run with --info or --debug option to get more log output.
==============================================================================
13: Task failed with an exception.
-----------
* What went wrong:
Execution failed for task ':sdks:python:test-suites:tox:py38:testPy38pyarrow-0'.
> Process 'command 'sh'' finished with non-zero exit value 1
* Try:
> Run with --stacktrace option to get the stack trace.
> Run with --info or --debug option to get more log output.
==============================================================================
14: Task failed with an exception.
-----------
* What went wrong:
Execution failed for task ':sdks:python:test-suites:tox:py38:testPy38pyarrow-1'.
> Process 'command 'sh'' finished with non-zero exit value 1
* Try:
> Run with --stacktrace option to get the stack trace.
> Run with --info or --debug option to get more log output.
==============================================================================
15: Task failed with an exception.
-----------
* What went wrong:
Execution failed for task ':sdks:python:test-suites:tox:py38:testPy38pyarrow-2'.
> Process 'command 'sh'' finished with non-zero exit value 1
* Try:
> Run with --stacktrace option to get the stack trace.
> Run with --info or --debug option to get more log output.
==============================================================================
16: Task failed with an exception.
-----------
* What went wrong:
Execution failed for task ':sdks:python:test-suites:tox:py38:testPy38pyarrow-3'.
> Process 'command 'sh'' finished with non-zero exit value 1
* Try:
> Run with --stacktrace option to get the stack trace.
> Run with --info or --debug option to get more log output.
==============================================================================
17: Task failed with an exception.
-----------
* What went wrong:
Execution failed for task ':sdks:python:test-suites:tox:py38:testPy38pyarrow-4'.
> Process 'command 'sh'' finished with non-zero exit value 1
* Try:
> Run with --stacktrace option to get the stack trace.
> Run with --info or --debug option to get more log output.
==============================================================================
18: Task failed with an exception.
-----------
* What went wrong:
Execution failed for task ':sdks:python:test-suites:tox:py38:testPy38pyarrow-5'.
> Process 'command 'sh'' finished with non-zero exit value 1
* Try:
> Run with --stacktrace option to get the stack trace.
> Run with --info or --debug option to get more log output.
==============================================================================
19: Task failed with an exception.
-----------
* What went wrong:
Execution failed for task ':sdks:python:test-suites:tox:py38:testPy38pyarrow-6'.
> Process 'command 'sh'' finished with non-zero exit value 1
* Try:
> Run with --stacktrace option to get the stack trace.
> Run with --info or --debug option to get more log output.
==============================================================================
20: Task failed with an exception.
-----------
* What went wrong:
Execution failed for task ':sdks:python:test-suites:tox:py38:testPy38pyarrow-7'.
> Process 'command 'sh'' finished with non-zero exit value 1
* Try:
> Run with --stacktrace option to get the stack trace.
> Run with --info or --debug option to get more log output.
==============================================================================
21: Task failed with an exception.
-----------
* What went wrong:
Execution failed for task ':sdks:python:test-suites:tox:py38:testPy38pyarrow-8'.
> Process 'command 'sh'' finished with non-zero exit value 1
* Try:
> Run with --stacktrace option to get the stack trace.
> Run with --info or --debug option to get more log output.
==============================================================================
22: Task failed with an exception.
-----------
* What went wrong:
Execution failed for task ':sdks:python:test-suites:tox:py38:testPy38pyarrow-9'.
> Process 'command 'sh'' finished with non-zero exit value 1
* Try:
> Run with --stacktrace option to get the stack trace.
> Run with --info or --debug option to get more log output.
==============================================================================
23: Task failed with an exception.
-----------
* What went wrong:
Execution failed for task ':sdks:python:test-suites:tox:py38:testPy38pytorch-110'.
> Process 'command 'sh'' finished with non-zero exit value 1
* Try:
> Run with --stacktrace option to get the stack trace.
> Run with --info or --debug option to get more log output.
==============================================================================
24: Task failed with an exception.
-----------
* What went wrong:
Execution failed for task ':sdks:python:test-suites:tox:py38:testPy38pytorch-19'.
> Process 'command 'sh'' finished with non-zero exit value 1
* Try:
> Run with --stacktrace option to get the stack trace.
> Run with --info or --debug option to get more log output.
==============================================================================
* Get more help at https://help.gradle.org
Deprecated Gradle features were used in this build, making it incompatible with Gradle 8.0.
You can use '--warning-mode all' to show the individual deprecation warnings and determine if they come from your own scripts or plugins.
See https://docs.gradle.org/7.5.1/userguide/command_line_interface.html#sec:command_line_warnings
BUILD FAILED in 4m 41s
118 actionable tasks: 83 executed, 33 from cache, 2 up-to-date
Publishing build scan...
https://gradle.com/s/oyb322clcxyb2
Build step 'Invoke Gradle script' changed build result to FAILURE
Build step 'Invoke Gradle script' marked build as failure
---------------------------------------------------------------------
To unsubscribe, e-mail: builds-unsubscribe@beam.apache.org
For additional commands, e-mail: builds-help@beam.apache.org
Jenkins build is back to normal : beam_PreCommit_Python_Cron #6122
Posted by Apache Jenkins Server <je...@builds.apache.org>.
See <https://ci-beam.apache.org/job/beam_PreCommit_Python_Cron/6122/display/redirect?page=changes>
---------------------------------------------------------------------
To unsubscribe, e-mail: builds-unsubscribe@beam.apache.org
For additional commands, e-mail: builds-help@beam.apache.org
Build failed in Jenkins: beam_PreCommit_Python_Cron #6121
Posted by Apache Jenkins Server <je...@builds.apache.org>.
See <https://ci-beam.apache.org/job/beam_PreCommit_Python_Cron/6121/display/redirect?page=changes>
Changes:
[noreply] Publish results of JMH benchmark runs (Java SDK) to InfluxDB (part of
------------------------------------------
[...truncated 139.53 KB...]
==============================================================================
4: Task failed with an exception.
-----------
* What went wrong:
Execution failed for task ':sdks:python:test-suites:tox:py39:testPy39Cloud'.
> Process 'command 'sh'' finished with non-zero exit value 1
* Try:
> Run with --stacktrace option to get the stack trace.
> Run with --info or --debug option to get more log output.
==============================================================================
5: Task failed with an exception.
-----------
* What went wrong:
Execution failed for task ':sdks:python:test-suites:tox:py37:testPy37Cloud'.
> Process 'command 'sh'' finished with non-zero exit value 1
* Try:
> Run with --stacktrace option to get the stack trace.
> Run with --info or --debug option to get more log output.
==============================================================================
6: Task failed with an exception.
-----------
* What went wrong:
Execution failed for task ':sdks:python:test-suites:tox:py38:testPy38Cython'.
> Process 'command 'sh'' finished with non-zero exit value 1
* Try:
> Run with --stacktrace option to get the stack trace.
> Run with --info or --debug option to get more log output.
==============================================================================
7: Task failed with an exception.
-----------
* What went wrong:
Execution failed for task ':sdks:python:test-suites:tox:py39:testPy39Cython'.
> Process 'command 'sh'' finished with non-zero exit value 1
* Try:
> Run with --stacktrace option to get the stack trace.
> Run with --info or --debug option to get more log output.
==============================================================================
8: Task failed with an exception.
-----------
* What went wrong:
Execution failed for task ':sdks:python:test-suites:tox:py37:testPy37Cython'.
> Process 'command 'sh'' finished with non-zero exit value 1
* Try:
> Run with --stacktrace option to get the stack trace.
> Run with --info or --debug option to get more log output.
==============================================================================
9: Task failed with an exception.
-----------
* What went wrong:
Execution failed for task ':sdks:python:test-suites:tox:py38:testPy38pandas-11'.
> Process 'command 'sh'' finished with non-zero exit value 1
* Try:
> Run with --stacktrace option to get the stack trace.
> Run with --info or --debug option to get more log output.
==============================================================================
10: Task failed with an exception.
-----------
* What went wrong:
Execution failed for task ':sdks:python:test-suites:tox:py38:testPy38pandas-12'.
> Process 'command 'sh'' finished with non-zero exit value 1
* Try:
> Run with --stacktrace option to get the stack trace.
> Run with --info or --debug option to get more log output.
==============================================================================
11: Task failed with an exception.
-----------
* What went wrong:
Execution failed for task ':sdks:python:test-suites:tox:py38:testPy38pandas-13'.
> Process 'command 'sh'' finished with non-zero exit value 1
* Try:
> Run with --stacktrace option to get the stack trace.
> Run with --info or --debug option to get more log output.
==============================================================================
12: Task failed with an exception.
-----------
* What went wrong:
Execution failed for task ':sdks:python:test-suites:tox:py38:testPy38pandas-14'.
> Process 'command 'sh'' finished with non-zero exit value 1
* Try:
> Run with --stacktrace option to get the stack trace.
> Run with --info or --debug option to get more log output.
==============================================================================
13: Task failed with an exception.
-----------
* What went wrong:
Execution failed for task ':sdks:python:test-suites:tox:py38:testPy38pyarrow-0'.
> Process 'command 'sh'' finished with non-zero exit value 1
* Try:
> Run with --stacktrace option to get the stack trace.
> Run with --info or --debug option to get more log output.
==============================================================================
14: Task failed with an exception.
-----------
* What went wrong:
Execution failed for task ':sdks:python:test-suites:tox:py38:testPy38pyarrow-1'.
> Process 'command 'sh'' finished with non-zero exit value 1
* Try:
> Run with --stacktrace option to get the stack trace.
> Run with --info or --debug option to get more log output.
==============================================================================
15: Task failed with an exception.
-----------
* What went wrong:
Execution failed for task ':sdks:python:test-suites:tox:py38:testPy38pyarrow-2'.
> Process 'command 'sh'' finished with non-zero exit value 1
* Try:
> Run with --stacktrace option to get the stack trace.
> Run with --info or --debug option to get more log output.
==============================================================================
16: Task failed with an exception.
-----------
* What went wrong:
Execution failed for task ':sdks:python:test-suites:tox:py38:testPy38pyarrow-3'.
> Process 'command 'sh'' finished with non-zero exit value 1
* Try:
> Run with --stacktrace option to get the stack trace.
> Run with --info or --debug option to get more log output.
==============================================================================
17: Task failed with an exception.
-----------
* What went wrong:
Execution failed for task ':sdks:python:test-suites:tox:py38:testPy38pyarrow-4'.
> Process 'command 'sh'' finished with non-zero exit value 1
* Try:
> Run with --stacktrace option to get the stack trace.
> Run with --info or --debug option to get more log output.
==============================================================================
18: Task failed with an exception.
-----------
* What went wrong:
Execution failed for task ':sdks:python:test-suites:tox:py38:testPy38pyarrow-5'.
> Process 'command 'sh'' finished with non-zero exit value 1
* Try:
> Run with --stacktrace option to get the stack trace.
> Run with --info or --debug option to get more log output.
==============================================================================
19: Task failed with an exception.
-----------
* What went wrong:
Execution failed for task ':sdks:python:test-suites:tox:py38:testPy38pyarrow-6'.
> Process 'command 'sh'' finished with non-zero exit value 1
* Try:
> Run with --stacktrace option to get the stack trace.
> Run with --info or --debug option to get more log output.
==============================================================================
20: Task failed with an exception.
-----------
* What went wrong:
Execution failed for task ':sdks:python:test-suites:tox:py38:testPy38pyarrow-7'.
> Process 'command 'sh'' finished with non-zero exit value 1
* Try:
> Run with --stacktrace option to get the stack trace.
> Run with --info or --debug option to get more log output.
==============================================================================
21: Task failed with an exception.
-----------
* What went wrong:
Execution failed for task ':sdks:python:test-suites:tox:py38:testPy38pyarrow-8'.
> Process 'command 'sh'' finished with non-zero exit value 1
* Try:
> Run with --stacktrace option to get the stack trace.
> Run with --info or --debug option to get more log output.
==============================================================================
22: Task failed with an exception.
-----------
* What went wrong:
Execution failed for task ':sdks:python:test-suites:tox:py38:testPy38pyarrow-9'.
> Process 'command 'sh'' finished with non-zero exit value 1
* Try:
> Run with --stacktrace option to get the stack trace.
> Run with --info or --debug option to get more log output.
==============================================================================
23: Task failed with an exception.
-----------
* What went wrong:
Execution failed for task ':sdks:python:test-suites:tox:py38:testPy38pytorch-110'.
> Process 'command 'sh'' finished with non-zero exit value 1
* Try:
> Run with --stacktrace option to get the stack trace.
> Run with --info or --debug option to get more log output.
==============================================================================
24: Task failed with an exception.
-----------
* What went wrong:
Execution failed for task ':sdks:python:test-suites:tox:py38:testPy38pytorch-19'.
> Process 'command 'sh'' finished with non-zero exit value 1
* Try:
> Run with --stacktrace option to get the stack trace.
> Run with --info or --debug option to get more log output.
==============================================================================
* Get more help at https://help.gradle.org
Deprecated Gradle features were used in this build, making it incompatible with Gradle 8.0.
You can use '--warning-mode all' to show the individual deprecation warnings and determine if they come from your own scripts or plugins.
See https://docs.gradle.org/7.5.1/userguide/command_line_interface.html#sec:command_line_warnings
BUILD FAILED in 4m 55s
118 actionable tasks: 85 executed, 31 from cache, 2 up-to-date
Publishing build scan...
https://gradle.com/s/or7z62u6cdwcm
Build step 'Invoke Gradle script' changed build result to FAILURE
Build step 'Invoke Gradle script' marked build as failure
---------------------------------------------------------------------
To unsubscribe, e-mail: builds-unsubscribe@beam.apache.org
For additional commands, e-mail: builds-help@beam.apache.org