You are viewing a plain text version of this content. The canonical link for it is here.
Posted to yarn-dev@hadoop.apache.org by Apache Jenkins Server <je...@builds.apache.org> on 2016/05/10 07:34:10 UTC

Build failed in Jenkins: Hadoop-Yarn-trunk #2123

See <https://builds.apache.org/job/Hadoop-Yarn-trunk/2123/changes>

Changes:

[vinodkv] YARN-4842. Fixed "yarn logs" command to guess (and thus not require) the

------------------------------------------
[...truncated 9292 lines...]
Running org.apache.hadoop.yarn.server.resourcemanager.scheduler.policy.TestFifoOrderingPolicy
Tests run: 3, Failures: 0, Errors: 0, Skipped: 0, Time elapsed: 0.572 sec - in org.apache.hadoop.yarn.server.resourcemanager.scheduler.policy.TestFifoOrderingPolicy
Running org.apache.hadoop.yarn.server.resourcemanager.scheduler.distributed.TestTopKNodeSelector
Tests run: 2, Failures: 0, Errors: 0, Skipped: 0, Time elapsed: 0.406 sec - in org.apache.hadoop.yarn.server.resourcemanager.scheduler.distributed.TestTopKNodeSelector
Running org.apache.hadoop.yarn.server.resourcemanager.scheduler.capacity.TestReservationQueue
Tests run: 1, Failures: 0, Errors: 0, Skipped: 0, Time elapsed: 1.899 sec - in org.apache.hadoop.yarn.server.resourcemanager.scheduler.capacity.TestReservationQueue
Running org.apache.hadoop.yarn.server.resourcemanager.scheduler.capacity.TestCapacityScheduler
Tests run: 46, Failures: 0, Errors: 0, Skipped: 0, Time elapsed: 37.996 sec - in org.apache.hadoop.yarn.server.resourcemanager.scheduler.capacity.TestCapacityScheduler
Running org.apache.hadoop.yarn.server.resourcemanager.scheduler.capacity.TestParentQueue
Tests run: 9, Failures: 0, Errors: 0, Skipped: 0, Time elapsed: 4.297 sec - in org.apache.hadoop.yarn.server.resourcemanager.scheduler.capacity.TestParentQueue
Running org.apache.hadoop.yarn.server.resourcemanager.scheduler.capacity.TestApplicationPriority
Tests run: 9, Failures: 0, Errors: 0, Skipped: 0, Time elapsed: 12.101 sec - in org.apache.hadoop.yarn.server.resourcemanager.scheduler.capacity.TestApplicationPriority
Running org.apache.hadoop.yarn.server.resourcemanager.scheduler.capacity.TestContainerAllocation
Tests run: 8, Failures: 0, Errors: 0, Skipped: 0, Time elapsed: 19.619 sec - in org.apache.hadoop.yarn.server.resourcemanager.scheduler.capacity.TestContainerAllocation
Running org.apache.hadoop.yarn.server.resourcemanager.scheduler.capacity.TestContainerResizing
Tests run: 11, Failures: 0, Errors: 0, Skipped: 0, Time elapsed: 10.861 sec - in org.apache.hadoop.yarn.server.resourcemanager.scheduler.capacity.TestContainerResizing
Running org.apache.hadoop.yarn.server.resourcemanager.scheduler.capacity.TestQueueParsing
Tests run: 17, Failures: 0, Errors: 0, Skipped: 0, Time elapsed: 4.034 sec - in org.apache.hadoop.yarn.server.resourcemanager.scheduler.capacity.TestQueueParsing
Running org.apache.hadoop.yarn.server.resourcemanager.scheduler.capacity.TestQueueCapacities
Tests run: 9, Failures: 0, Errors: 0, Skipped: 0, Time elapsed: 0.222 sec - in org.apache.hadoop.yarn.server.resourcemanager.scheduler.capacity.TestQueueCapacities
Running org.apache.hadoop.yarn.server.resourcemanager.scheduler.capacity.TestLeafQueue
Tests run: 30, Failures: 0, Errors: 0, Skipped: 0, Time elapsed: 23.515 sec - in org.apache.hadoop.yarn.server.resourcemanager.scheduler.capacity.TestLeafQueue
Running org.apache.hadoop.yarn.server.resourcemanager.scheduler.capacity.TestIncreaseAllocationExpirer
Tests run: 4, Failures: 0, Errors: 0, Skipped: 0, Time elapsed: 48.61 sec - in org.apache.hadoop.yarn.server.resourcemanager.scheduler.capacity.TestIncreaseAllocationExpirer
Running org.apache.hadoop.yarn.server.resourcemanager.scheduler.capacity.TestQueueMappings
Tests run: 3, Failures: 0, Errors: 0, Skipped: 0, Time elapsed: 2.486 sec - in org.apache.hadoop.yarn.server.resourcemanager.scheduler.capacity.TestQueueMappings
Running org.apache.hadoop.yarn.server.resourcemanager.scheduler.capacity.TestNodeLabelContainerAllocation
Tests run: 17, Failures: 0, Errors: 0, Skipped: 0, Time elapsed: 119.384 sec - in org.apache.hadoop.yarn.server.resourcemanager.scheduler.capacity.TestNodeLabelContainerAllocation
Running org.apache.hadoop.yarn.server.resourcemanager.scheduler.capacity.TestApplicationLimitsByPartition
Tests run: 6, Failures: 0, Errors: 0, Skipped: 0, Time elapsed: 7.521 sec - in org.apache.hadoop.yarn.server.resourcemanager.scheduler.capacity.TestApplicationLimitsByPartition
Running org.apache.hadoop.yarn.server.resourcemanager.scheduler.capacity.TestCapacitySchedulerSurgicalPreemption
Tests run: 2, Failures: 0, Errors: 0, Skipped: 0, Time elapsed: 4.521 sec - in org.apache.hadoop.yarn.server.resourcemanager.scheduler.capacity.TestCapacitySchedulerSurgicalPreemption
Running org.apache.hadoop.yarn.server.resourcemanager.scheduler.capacity.TestReservations
Tests run: 10, Failures: 0, Errors: 0, Skipped: 0, Time elapsed: 6.032 sec - in org.apache.hadoop.yarn.server.resourcemanager.scheduler.capacity.TestReservations
Running org.apache.hadoop.yarn.server.resourcemanager.scheduler.capacity.TestWorkPreservingRMRestartForNodeLabel
Tests run: 1, Failures: 0, Errors: 0, Skipped: 0, Time elapsed: 4.028 sec - in org.apache.hadoop.yarn.server.resourcemanager.scheduler.capacity.TestWorkPreservingRMRestartForNodeLabel
Running org.apache.hadoop.yarn.server.resourcemanager.scheduler.capacity.TestCapacitySchedulerNodeLabelUpdate
Tests run: 4, Failures: 0, Errors: 0, Skipped: 0, Time elapsed: 4.199 sec - in org.apache.hadoop.yarn.server.resourcemanager.scheduler.capacity.TestCapacitySchedulerNodeLabelUpdate
Running org.apache.hadoop.yarn.server.resourcemanager.scheduler.capacity.TestCapacitySchedulerQueueACLs
Tests run: 1, Failures: 0, Errors: 0, Skipped: 0, Time elapsed: 4.576 sec - in org.apache.hadoop.yarn.server.resourcemanager.scheduler.capacity.TestCapacitySchedulerQueueACLs
Running org.apache.hadoop.yarn.server.resourcemanager.scheduler.capacity.TestApplicationLimits
Tests run: 5, Failures: 0, Errors: 0, Skipped: 0, Time elapsed: 3.287 sec - in org.apache.hadoop.yarn.server.resourcemanager.scheduler.capacity.TestApplicationLimits
Running org.apache.hadoop.yarn.server.resourcemanager.scheduler.capacity.TestCapacitySchedulerLazyPreemption
Tests run: 6, Failures: 0, Errors: 0, Skipped: 1, Time elapsed: 4.95 sec - in org.apache.hadoop.yarn.server.resourcemanager.scheduler.capacity.TestCapacitySchedulerLazyPreemption
Running org.apache.hadoop.yarn.server.resourcemanager.scheduler.capacity.TestCapacitySchedulerDynamicBehavior
Tests run: 4, Failures: 0, Errors: 0, Skipped: 0, Time elapsed: 3.148 sec - in org.apache.hadoop.yarn.server.resourcemanager.scheduler.capacity.TestCapacitySchedulerDynamicBehavior
Running org.apache.hadoop.yarn.server.resourcemanager.scheduler.capacity.TestChildQueueOrder
Tests run: 1, Failures: 0, Errors: 0, Skipped: 0, Time elapsed: 3.036 sec - in org.apache.hadoop.yarn.server.resourcemanager.scheduler.capacity.TestChildQueueOrder
Running org.apache.hadoop.yarn.server.resourcemanager.scheduler.TestResourceUsage
Tests run: 7, Failures: 0, Errors: 0, Skipped: 0, Time elapsed: 0.564 sec - in org.apache.hadoop.yarn.server.resourcemanager.scheduler.TestResourceUsage
Running org.apache.hadoop.yarn.server.resourcemanager.scheduler.fair.TestFSLeafQueue
Tests run: 5, Failures: 0, Errors: 0, Skipped: 0, Time elapsed: 3.389 sec - in org.apache.hadoop.yarn.server.resourcemanager.scheduler.fair.TestFSLeafQueue
Running org.apache.hadoop.yarn.server.resourcemanager.scheduler.fair.TestQueueManager
Tests run: 3, Failures: 0, Errors: 0, Skipped: 0, Time elapsed: 1.357 sec - in org.apache.hadoop.yarn.server.resourcemanager.scheduler.fair.TestQueueManager
Running org.apache.hadoop.yarn.server.resourcemanager.scheduler.fair.TestContinuousScheduling
Tests run: 2, Failures: 0, Errors: 0, Skipped: 0, Time elapsed: 2.703 sec - in org.apache.hadoop.yarn.server.resourcemanager.scheduler.fair.TestContinuousScheduling
Running org.apache.hadoop.yarn.server.resourcemanager.scheduler.fair.TestAppRunnability
Tests run: 8, Failures: 0, Errors: 0, Skipped: 0, Time elapsed: 3.91 sec - in org.apache.hadoop.yarn.server.resourcemanager.scheduler.fair.TestAppRunnability
Running org.apache.hadoop.yarn.server.resourcemanager.scheduler.fair.TestComputeFairShares
Tests run: 9, Failures: 0, Errors: 0, Skipped: 0, Time elapsed: 0.56 sec - in org.apache.hadoop.yarn.server.resourcemanager.scheduler.fair.TestComputeFairShares
Running org.apache.hadoop.yarn.server.resourcemanager.scheduler.fair.TestFSAppAttempt
Tests run: 5, Failures: 0, Errors: 0, Skipped: 0, Time elapsed: 2.911 sec - in org.apache.hadoop.yarn.server.resourcemanager.scheduler.fair.TestFSAppAttempt
Running org.apache.hadoop.yarn.server.resourcemanager.scheduler.fair.TestFairSchedulerQueueACLs
Tests run: 1, Failures: 0, Errors: 0, Skipped: 0, Time elapsed: 4.669 sec - in org.apache.hadoop.yarn.server.resourcemanager.scheduler.fair.TestFairSchedulerQueueACLs
Running org.apache.hadoop.yarn.server.resourcemanager.scheduler.fair.TestFSParentQueue
Tests run: 1, Failures: 0, Errors: 0, Skipped: 0, Time elapsed: 1.159 sec - in org.apache.hadoop.yarn.server.resourcemanager.scheduler.fair.TestFSParentQueue
Running org.apache.hadoop.yarn.server.resourcemanager.scheduler.fair.TestMaxRunningAppsEnforcer
Tests run: 6, Failures: 0, Errors: 0, Skipped: 0, Time elapsed: 1.635 sec - in org.apache.hadoop.yarn.server.resourcemanager.scheduler.fair.TestMaxRunningAppsEnforcer
Running org.apache.hadoop.yarn.server.resourcemanager.scheduler.fair.TestFairSchedulerConfiguration
Tests run: 5, Failures: 0, Errors: 0, Skipped: 0, Time elapsed: 0.557 sec - in org.apache.hadoop.yarn.server.resourcemanager.scheduler.fair.TestFairSchedulerConfiguration
Running org.apache.hadoop.yarn.server.resourcemanager.scheduler.fair.TestAllocationFileLoaderService
Tests run: 11, Failures: 0, Errors: 0, Skipped: 0, Time elapsed: 1.112 sec - in org.apache.hadoop.yarn.server.resourcemanager.scheduler.fair.TestAllocationFileLoaderService
Running org.apache.hadoop.yarn.server.resourcemanager.scheduler.fair.TestFairSchedulerEventLog
Tests run: 1, Failures: 0, Errors: 0, Skipped: 0, Time elapsed: 1.839 sec - in org.apache.hadoop.yarn.server.resourcemanager.scheduler.fair.TestFairSchedulerEventLog
Running org.apache.hadoop.yarn.server.resourcemanager.scheduler.fair.TestQueuePlacementPolicy
Tests run: 17, Failures: 0, Errors: 0, Skipped: 0, Time elapsed: 0.769 sec - in org.apache.hadoop.yarn.server.resourcemanager.scheduler.fair.TestQueuePlacementPolicy
Running org.apache.hadoop.yarn.server.resourcemanager.scheduler.fair.TestSchedulingPolicy
Tests run: 2, Failures: 0, Errors: 0, Skipped: 0, Time elapsed: 0.711 sec - in org.apache.hadoop.yarn.server.resourcemanager.scheduler.fair.TestSchedulingPolicy
Running org.apache.hadoop.yarn.server.resourcemanager.scheduler.fair.policies.TestEmptyQueues
Tests run: 3, Failures: 0, Errors: 0, Skipped: 0, Time elapsed: 0.523 sec - in org.apache.hadoop.yarn.server.resourcemanager.scheduler.fair.policies.TestEmptyQueues
Running org.apache.hadoop.yarn.server.resourcemanager.scheduler.fair.policies.TestDominantResourceFairnessPolicy
Tests run: 9, Failures: 0, Errors: 0, Skipped: 0, Time elapsed: 0.516 sec - in org.apache.hadoop.yarn.server.resourcemanager.scheduler.fair.policies.TestDominantResourceFairnessPolicy
Running org.apache.hadoop.yarn.server.resourcemanager.scheduler.fair.TestFairScheduler
Tests run: 83, Failures: 0, Errors: 0, Skipped: 0, Time elapsed: 13.771 sec - in org.apache.hadoop.yarn.server.resourcemanager.scheduler.fair.TestFairScheduler
Running org.apache.hadoop.yarn.server.resourcemanager.scheduler.fair.TestFairSchedulerPreemption
Tests run: 10, Failures: 0, Errors: 0, Skipped: 0, Time elapsed: 5.531 sec - in org.apache.hadoop.yarn.server.resourcemanager.scheduler.fair.TestFairSchedulerPreemption
Running org.apache.hadoop.yarn.server.resourcemanager.scheduler.fair.TestSchedulingUpdate
Tests run: 1, Failures: 0, Errors: 0, Skipped: 0, Time elapsed: 1.93 sec - in org.apache.hadoop.yarn.server.resourcemanager.scheduler.fair.TestSchedulingUpdate
Running org.apache.hadoop.yarn.server.resourcemanager.scheduler.fair.TestFairSchedulerFairShare
Tests run: 6, Failures: 0, Errors: 0, Skipped: 0, Time elapsed: 4.027 sec - in org.apache.hadoop.yarn.server.resourcemanager.scheduler.fair.TestFairSchedulerFairShare
Running org.apache.hadoop.yarn.server.resourcemanager.TestClientRMService
Tests run: 20, Failures: 0, Errors: 0, Skipped: 0, Time elapsed: 8.39 sec - in org.apache.hadoop.yarn.server.resourcemanager.TestClientRMService
Running org.apache.hadoop.yarn.server.resourcemanager.TestRMHAMetrics
Tests run: 1, Failures: 0, Errors: 0, Skipped: 0, Time elapsed: 1.916 sec - in org.apache.hadoop.yarn.server.resourcemanager.TestRMHAMetrics
Running org.apache.hadoop.yarn.server.resourcemanager.TestClientRMTokens
Tests run: 6, Failures: 0, Errors: 0, Skipped: 0, Time elapsed: 18.079 sec - in org.apache.hadoop.yarn.server.resourcemanager.TestClientRMTokens
Running org.apache.hadoop.yarn.server.resourcemanager.TestRMAuditLogger
Tests run: 3, Failures: 0, Errors: 0, Skipped: 0, Time elapsed: 1.453 sec - in org.apache.hadoop.yarn.server.resourcemanager.TestRMAuditLogger
Running org.apache.hadoop.yarn.server.resourcemanager.security.TestDelegationTokenRenewerLifecycle
Tests run: 1, Failures: 0, Errors: 0, Skipped: 0, Time elapsed: 0.766 sec - in org.apache.hadoop.yarn.server.resourcemanager.security.TestDelegationTokenRenewerLifecycle
Running org.apache.hadoop.yarn.server.resourcemanager.security.TestAMRMTokens
Tests run: 6, Failures: 0, Errors: 0, Skipped: 0, Time elapsed: 44.531 sec - in org.apache.hadoop.yarn.server.resourcemanager.security.TestAMRMTokens
Running org.apache.hadoop.yarn.server.resourcemanager.security.TestClientToAMTokens
Tests run: 2, Failures: 0, Errors: 0, Skipped: 0, Time elapsed: 3.565 sec - in org.apache.hadoop.yarn.server.resourcemanager.security.TestClientToAMTokens
Running org.apache.hadoop.yarn.server.resourcemanager.security.TestDelegationTokenRenewer
Tests run: 14, Failures: 0, Errors: 0, Skipped: 0, Time elapsed: 42.555 sec - in org.apache.hadoop.yarn.server.resourcemanager.security.TestDelegationTokenRenewer
Running org.apache.hadoop.yarn.server.resourcemanager.security.TestRMDelegationTokens
Tests run: 2, Failures: 0, Errors: 0, Skipped: 0, Time elapsed: 6.246 sec - in org.apache.hadoop.yarn.server.resourcemanager.security.TestRMDelegationTokens
Running org.apache.hadoop.yarn.server.resourcemanager.TestWorkPreservingRMRestart
Tests run: 18, Failures: 0, Errors: 0, Skipped: 0, Time elapsed: 35.765 sec - in org.apache.hadoop.yarn.server.resourcemanager.TestWorkPreservingRMRestart
Running org.apache.hadoop.yarn.server.resourcemanager.resource.TestResourceWeights
Tests run: 1, Failures: 0, Errors: 0, Skipped: 0, Time elapsed: 0.079 sec - in org.apache.hadoop.yarn.server.resourcemanager.resource.TestResourceWeights
Running org.apache.hadoop.yarn.server.resourcemanager.resource.TestResources
Tests run: 2, Failures: 0, Errors: 0, Skipped: 0, Time elapsed: 0.547 sec - in org.apache.hadoop.yarn.server.resourcemanager.resource.TestResources
Running org.apache.hadoop.yarn.server.resourcemanager.monitor.TestSchedulingMonitor
Tests run: 1, Failures: 0, Errors: 0, Skipped: 0, Time elapsed: 1.853 sec - in org.apache.hadoop.yarn.server.resourcemanager.monitor.TestSchedulingMonitor
Running org.apache.hadoop.yarn.server.resourcemanager.monitor.capacity.TestProportionalCapacityPreemptionPolicyForReservedContainers
Tests run: 7, Failures: 0, Errors: 0, Skipped: 0, Time elapsed: 2.875 sec - in org.apache.hadoop.yarn.server.resourcemanager.monitor.capacity.TestProportionalCapacityPreemptionPolicyForReservedContainers
Running org.apache.hadoop.yarn.server.resourcemanager.monitor.capacity.TestProportionalCapacityPreemptionPolicy
Tests run: 29, Failures: 0, Errors: 0, Skipped: 0, Time elapsed: 16.544 sec - in org.apache.hadoop.yarn.server.resourcemanager.monitor.capacity.TestProportionalCapacityPreemptionPolicy
Running org.apache.hadoop.yarn.server.resourcemanager.monitor.capacity.TestProportionalCapacityPreemptionPolicyForNodePartitions
Tests run: 10, Failures: 0, Errors: 0, Skipped: 0, Time elapsed: 5.799 sec - in org.apache.hadoop.yarn.server.resourcemanager.monitor.capacity.TestProportionalCapacityPreemptionPolicyForNodePartitions
Running org.apache.hadoop.yarn.server.resourcemanager.monitor.capacity.TestProportionalCapacityPreemptionPolicyMockFramework
Tests run: 3, Failures: 0, Errors: 0, Skipped: 0, Time elapsed: 4.336 sec - in org.apache.hadoop.yarn.server.resourcemanager.monitor.capacity.TestProportionalCapacityPreemptionPolicyMockFramework
Running org.apache.hadoop.yarn.server.resourcemanager.TestLeaderElectorService
Tests run: 6, Failures: 0, Errors: 0, Skipped: 0, Time elapsed: 35.773 sec - in org.apache.hadoop.yarn.server.resourcemanager.TestLeaderElectorService
Running org.apache.hadoop.yarn.server.resourcemanager.placement.TestUserGroupMappingPlacementRule
Tests run: 1, Failures: 0, Errors: 0, Skipped: 0, Time elapsed: 0.911 sec - in org.apache.hadoop.yarn.server.resourcemanager.placement.TestUserGroupMappingPlacementRule
Running org.apache.hadoop.yarn.server.resourcemanager.resourcetracker.TestRMNMRPCResponseId
Tests run: 1, Failures: 0, Errors: 0, Skipped: 0, Time elapsed: 1.569 sec - in org.apache.hadoop.yarn.server.resourcemanager.resourcetracker.TestRMNMRPCResponseId
Running org.apache.hadoop.yarn.server.resourcemanager.resourcetracker.TestNMExpiry
Tests run: 1, Failures: 0, Errors: 0, Skipped: 0, Time elapsed: 3.373 sec - in org.apache.hadoop.yarn.server.resourcemanager.resourcetracker.TestNMExpiry
Running org.apache.hadoop.yarn.server.resourcemanager.resourcetracker.TestNMReconnect
Tests run: 3, Failures: 0, Errors: 0, Skipped: 0, Time elapsed: 2.541 sec - in org.apache.hadoop.yarn.server.resourcemanager.resourcetracker.TestNMReconnect
Running org.apache.hadoop.yarn.server.resourcemanager.applicationsmanager.TestAMRestart
Tests run: 10, Failures: 0, Errors: 0, Skipped: 0, Time elapsed: 61.502 sec - in org.apache.hadoop.yarn.server.resourcemanager.applicationsmanager.TestAMRestart
Running org.apache.hadoop.yarn.server.resourcemanager.applicationsmanager.TestAMRMRPCNodeUpdates
Tests run: 1, Failures: 0, Errors: 0, Skipped: 0, Time elapsed: 2.706 sec - in org.apache.hadoop.yarn.server.resourcemanager.applicationsmanager.TestAMRMRPCNodeUpdates
Running org.apache.hadoop.yarn.server.resourcemanager.applicationsmanager.TestAMRMRPCResponseId
Tests run: 1, Failures: 0, Errors: 0, Skipped: 0, Time elapsed: 2.653 sec - in org.apache.hadoop.yarn.server.resourcemanager.applicationsmanager.TestAMRMRPCResponseId
Running org.apache.hadoop.yarn.server.resourcemanager.TestRMAdminService
Tests run: 23, Failures: 0, Errors: 0, Skipped: 0, Time elapsed: 16.743 sec - in org.apache.hadoop.yarn.server.resourcemanager.TestRMAdminService
Running org.apache.hadoop.yarn.server.resourcemanager.TestRM
Tests run: 11, Failures: 0, Errors: 0, Skipped: 0, Time elapsed: 7.374 sec - in org.apache.hadoop.yarn.server.resourcemanager.TestRM
Running org.apache.hadoop.yarn.server.resourcemanager.rmapp.TestNodesListManager
Tests run: 4, Failures: 0, Errors: 0, Skipped: 0, Time elapsed: 3.908 sec - in org.apache.hadoop.yarn.server.resourcemanager.rmapp.TestNodesListManager
Running org.apache.hadoop.yarn.server.resourcemanager.rmapp.attempt.TestAMLivelinessMonitor
Tests run: 1, Failures: 0, Errors: 0, Skipped: 0, Time elapsed: 2.024 sec - in org.apache.hadoop.yarn.server.resourcemanager.rmapp.attempt.TestAMLivelinessMonitor
Running org.apache.hadoop.yarn.server.resourcemanager.rmapp.attempt.TestRMAppAttemptTransitions
Tests run: 86, Failures: 0, Errors: 0, Skipped: 1, Time elapsed: 6.935 sec - in org.apache.hadoop.yarn.server.resourcemanager.rmapp.attempt.TestRMAppAttemptTransitions
Running org.apache.hadoop.yarn.server.resourcemanager.rmapp.TestRMAppTransitions
Tests run: 46, Failures: 0, Errors: 0, Skipped: 0, Time elapsed: 3.579 sec - in org.apache.hadoop.yarn.server.resourcemanager.rmapp.TestRMAppTransitions
Running org.apache.hadoop.yarn.server.resourcemanager.TestResourceManager
Tests run: 5, Failures: 0, Errors: 0, Skipped: 0, Time elapsed: 4.779 sec - in org.apache.hadoop.yarn.server.resourcemanager.TestResourceManager
Running org.apache.hadoop.yarn.server.resourcemanager.TestApplicationCleanup
Tests run: 7, Failures: 0, Errors: 0, Skipped: 0, Time elapsed: 10.021 sec - in org.apache.hadoop.yarn.server.resourcemanager.TestApplicationCleanup
Running org.apache.hadoop.yarn.server.resourcemanager.TestApplicationMasterLauncher
Tests run: 4, Failures: 0, Errors: 0, Skipped: 0, Time elapsed: 5.534 sec - in org.apache.hadoop.yarn.server.resourcemanager.TestApplicationMasterLauncher
Running org.apache.hadoop.yarn.server.resourcemanager.TestRMDispatcher
Tests run: 1, Failures: 0, Errors: 0, Skipped: 0, Time elapsed: 2.019 sec - in org.apache.hadoop.yarn.server.resourcemanager.TestRMDispatcher
Running org.apache.hadoop.yarn.server.resourcemanager.TestRMHAForNodeLabels
Tests run: 1, Failures: 0, Errors: 0, Skipped: 0, Time elapsed: 3.424 sec - in org.apache.hadoop.yarn.server.resourcemanager.TestRMHAForNodeLabels
Running org.apache.hadoop.yarn.server.resourcemanager.recovery.TestMemoryRMStateStore
Tests run: 1, Failures: 0, Errors: 0, Skipped: 0, Time elapsed: 0.791 sec - in org.apache.hadoop.yarn.server.resourcemanager.recovery.TestMemoryRMStateStore
Running org.apache.hadoop.yarn.server.resourcemanager.recovery.TestZKRMStateStore
Tests run: 6, Failures: 0, Errors: 0, Skipped: 0, Time elapsed: 16.286 sec - in org.apache.hadoop.yarn.server.resourcemanager.recovery.TestZKRMStateStore
Running org.apache.hadoop.yarn.server.resourcemanager.recovery.TestProtos
Tests run: 1, Failures: 0, Errors: 0, Skipped: 0, Time elapsed: 0.238 sec - in org.apache.hadoop.yarn.server.resourcemanager.recovery.TestProtos
Running org.apache.hadoop.yarn.server.resourcemanager.recovery.TestLeveldbRMStateStore
Tests run: 11, Failures: 0, Errors: 0, Skipped: 0, Time elapsed: 7.568 sec - in org.apache.hadoop.yarn.server.resourcemanager.recovery.TestLeveldbRMStateStore
Running org.apache.hadoop.yarn.server.resourcemanager.recovery.TestFSRMStateStore
Tests run: 4, Failures: 0, Errors: 0, Skipped: 0, Time elapsed: 34.033 sec - in org.apache.hadoop.yarn.server.resourcemanager.recovery.TestFSRMStateStore
Running org.apache.hadoop.yarn.server.resourcemanager.recovery.TestZKRMStateStoreZKClientConnections
Tests run: 4, Failures: 0, Errors: 0, Skipped: 0, Time elapsed: 8.674 sec - in org.apache.hadoop.yarn.server.resourcemanager.recovery.TestZKRMStateStoreZKClientConnections
Running org.apache.hadoop.yarn.server.resourcemanager.recovery.TestZKRMStateStorePerf
Tests run: 1, Failures: 0, Errors: 0, Skipped: 0, Time elapsed: 55.153 sec - in org.apache.hadoop.yarn.server.resourcemanager.recovery.TestZKRMStateStorePerf
Running org.apache.hadoop.yarn.server.resourcemanager.TestRMRestart
Tests run: 28, Failures: 0, Errors: 0, Skipped: 0, Time elapsed: 67.271 sec - in org.apache.hadoop.yarn.server.resourcemanager.TestRMRestart
Running org.apache.hadoop.yarn.server.resourcemanager.TestMoveApplication
Tests run: 4, Failures: 0, Errors: 0, Skipped: 0, Time elapsed: 2.604 sec - in org.apache.hadoop.yarn.server.resourcemanager.TestMoveApplication
Running org.apache.hadoop.yarn.server.resourcemanager.TestRMHA
Tests run: 9, Failures: 0, Errors: 0, Skipped: 0, Time elapsed: 22.68 sec - in org.apache.hadoop.yarn.server.resourcemanager.TestRMHA
Running org.apache.hadoop.yarn.server.resourcemanager.TestRMProxyUsersConf
Tests run: 3, Failures: 0, Errors: 0, Skipped: 0, Time elapsed: 32.282 sec - in org.apache.hadoop.yarn.server.resourcemanager.TestRMProxyUsersConf
Running org.apache.hadoop.yarn.server.resourcemanager.nodelabels.TestRMDelegatedNodeLabelsUpdater
Tests run: 3, Failures: 0, Errors: 0, Skipped: 0, Time elapsed: 14.581 sec - in org.apache.hadoop.yarn.server.resourcemanager.nodelabels.TestRMDelegatedNodeLabelsUpdater
Running org.apache.hadoop.yarn.server.resourcemanager.nodelabels.TestRMNodeLabelsManager
Tests run: 11, Failures: 0, Errors: 0, Skipped: 0, Time elapsed: 2.873 sec - in org.apache.hadoop.yarn.server.resourcemanager.nodelabels.TestRMNodeLabelsManager
Running org.apache.hadoop.yarn.server.resourcemanager.logaggregationstatus.TestRMAppLogAggregationStatus
Tests run: 2, Failures: 0, Errors: 0, Skipped: 0, Time elapsed: 3.036 sec - in org.apache.hadoop.yarn.server.resourcemanager.logaggregationstatus.TestRMAppLogAggregationStatus
Running org.apache.hadoop.yarn.server.resourcemanager.TestApplicationACLs
Tests run: 1, Failures: 0, Errors: 0, Skipped: 0, Time elapsed: 4.394 sec - in org.apache.hadoop.yarn.server.resourcemanager.TestApplicationACLs
Running org.apache.hadoop.yarn.server.resourcemanager.metrics.TestSystemMetricsPublisher
Tests run: 5, Failures: 0, Errors: 0, Skipped: 0, Time elapsed: 6.58 sec - in org.apache.hadoop.yarn.server.resourcemanager.metrics.TestSystemMetricsPublisher
Running org.apache.hadoop.yarn.server.resourcemanager.TestKillApplicationWithRMHA
Tests run: 4, Failures: 0, Errors: 0, Skipped: 0, Time elapsed: 5.347 sec - in org.apache.hadoop.yarn.server.resourcemanager.TestKillApplicationWithRMHA

Results :

Failed tests: 
  TestContainerResourceUsage.testUsageAfterAMRestartWithMultipleContainers:252->amRestartTests:395 Unexcpected MemorySeconds value expected:<-1497972697468> but was:<1713>

Tests run: 1399, Failures: 1, Errors: 0, Skipped: 3

[INFO] ------------------------------------------------------------------------
[INFO] Reactor Summary:
[INFO] 
[INFO] Apache Hadoop YARN ................................ SUCCESS [  4.167 s]
[INFO] Apache Hadoop YARN API ............................ SUCCESS [04:36 min]
[INFO] Apache Hadoop YARN Common ......................... SUCCESS [03:27 min]
[INFO] Apache Hadoop YARN Server ......................... SUCCESS [  0.095 s]
[INFO] Apache Hadoop YARN Server Common .................. SUCCESS [ 51.246 s]
[INFO] Apache Hadoop YARN NodeManager .................... SUCCESS [12:27 min]
[INFO] Apache Hadoop YARN Web Proxy ...................... SUCCESS [ 26.542 s]
[INFO] Apache Hadoop YARN ApplicationHistoryService ...... SUCCESS [03:39 min]
[INFO] Apache Hadoop YARN ResourceManager ................ FAILURE [31:33 min]
[INFO] Apache Hadoop YARN Server Tests ................... SKIPPED
[INFO] Apache Hadoop YARN Client ......................... SKIPPED
[INFO] Apache Hadoop YARN SharedCacheManager ............. SKIPPED
[INFO] Apache Hadoop YARN Timeline Plugin Storage ........ SKIPPED
[INFO] Apache Hadoop YARN Applications ................... SKIPPED
[INFO] Apache Hadoop YARN DistributedShell ............... SKIPPED
[INFO] Apache Hadoop YARN Unmanaged Am Launcher .......... SKIPPED
[INFO] Apache Hadoop YARN Site ........................... SKIPPED
[INFO] Apache Hadoop YARN Registry ....................... SKIPPED
[INFO] Apache Hadoop YARN Project ........................ SKIPPED
[INFO] ------------------------------------------------------------------------
[INFO] BUILD FAILURE
[INFO] ------------------------------------------------------------------------
[INFO] Total time: 57:08 min
[INFO] Finished at: 2016-05-10T07:34:15+00:00
[INFO] Final Memory: 69M/502M
[INFO] ------------------------------------------------------------------------
[ERROR] Failed to execute goal org.apache.maven.plugins:maven-surefire-plugin:2.17:test (default-test) on project hadoop-yarn-server-resourcemanager: There are test failures.
[ERROR] 
[ERROR] Please refer to <https://builds.apache.org/job/Hadoop-Yarn-trunk/ws/hadoop-yarn-project/hadoop-yarn/hadoop-yarn-server/hadoop-yarn-server-resourcemanager/target/surefire-reports> for the individual test results.
[ERROR] -> [Help 1]
[ERROR] 
[ERROR] To see the full stack trace of the errors, re-run Maven with the -e switch.
[ERROR] Re-run Maven using the -X switch to enable full debug logging.
[ERROR] 
[ERROR] For more information about the errors and possible solutions, please read the following articles:
[ERROR] [Help 1] http://cwiki.apache.org/confluence/display/MAVEN/MojoFailureException
[ERROR] 
[ERROR] After correcting the problems, you can resume the build with the command
[ERROR]   mvn <goals> -rf :hadoop-yarn-server-resourcemanager
Build step 'Execute shell' marked build as failure
Archiving artifacts
Recording test results

---------------------------------------------------------------------
To unsubscribe, e-mail: yarn-dev-unsubscribe@hadoop.apache.org
For additional commands, e-mail: yarn-dev-help@hadoop.apache.org


Hadoop-Yarn-trunk - Build # 2124 - Still Failing

Posted by Apache Jenkins Server <je...@builds.apache.org>.
See https://builds.apache.org/job/Hadoop-Yarn-trunk/2124/

###################################################################################
########################## LAST 60 LINES OF THE CONSOLE ###########################
[...truncated 10446 lines...]
  TestCapacityScheduler.testMoveAppSuccess:1636 » NoClassDefFound org/apache/had...
  TestCapacityScheduler.testResourceUpdateDecommissioningNode:3351 » NoClassDefFound
  TestCapacityScheduler.testMoveAppForMoveToQueueWithFreeCap:1512 » NoClassDefFound
  TestCapacityScheduler.testAllocateReorder:729 » NoClassDefFound org/apache/had...
  TestCapacityScheduler.testMoveAppQueueMetricsCheck:1876 » NoClassDefFound org/...
  TestCapacityScheduler.testQueueHierarchyPendingResourceUpdate:2727 » NoClassDefFound
  TestCapacityScheduler.testHeadRoomCalculationWithDRC:3000 » NoClassDefFound or...
  TestCapacityScheduler.testApplicationHeadRoom:2918 » NoClassDefFound org/apach...

Tests run: 1399, Failures: 7, Errors: 14, Skipped: 3

[INFO] ------------------------------------------------------------------------
[INFO] Reactor Summary:
[INFO] 
[INFO] Apache Hadoop YARN ................................ SUCCESS [  3.804 s]
[INFO] Apache Hadoop YARN API ............................ SUCCESS [04:40 min]
[INFO] Apache Hadoop YARN Common ......................... SUCCESS [03:26 min]
[INFO] Apache Hadoop YARN Server ......................... SUCCESS [  0.097 s]
[INFO] Apache Hadoop YARN Server Common .................. SUCCESS [ 57.380 s]
[INFO] Apache Hadoop YARN NodeManager .................... SUCCESS [12:24 min]
[INFO] Apache Hadoop YARN Web Proxy ...................... SUCCESS [ 25.205 s]
[INFO] Apache Hadoop YARN ApplicationHistoryService ...... SUCCESS [03:29 min]
[INFO] Apache Hadoop YARN ResourceManager ................ FAILURE [36:55 min]
[INFO] Apache Hadoop YARN Server Tests ................... SKIPPED
[INFO] Apache Hadoop YARN Client ......................... SKIPPED
[INFO] Apache Hadoop YARN SharedCacheManager ............. SKIPPED
[INFO] Apache Hadoop YARN Timeline Plugin Storage ........ SKIPPED
[INFO] Apache Hadoop YARN Applications ................... SKIPPED
[INFO] Apache Hadoop YARN DistributedShell ............... SKIPPED
[INFO] Apache Hadoop YARN Unmanaged Am Launcher .......... SKIPPED
[INFO] Apache Hadoop YARN Site ........................... SKIPPED
[INFO] Apache Hadoop YARN Registry ....................... SKIPPED
[INFO] Apache Hadoop YARN Project ........................ SKIPPED
[INFO] ------------------------------------------------------------------------
[INFO] BUILD FAILURE
[INFO] ------------------------------------------------------------------------
[INFO] Total time: 01:02 h
[INFO] Finished at: 2016-05-10T18:05:19+00:00
[INFO] Final Memory: 60M/483M
[INFO] ------------------------------------------------------------------------
[ERROR] Failed to execute goal org.apache.maven.plugins:maven-surefire-plugin:2.17:test (default-test) on project hadoop-yarn-server-resourcemanager: There are test failures.
[ERROR] 
[ERROR] Please refer to /home/jenkins/jenkins-slave/workspace/Hadoop-Yarn-trunk/hadoop-yarn-project/hadoop-yarn/hadoop-yarn-server/hadoop-yarn-server-resourcemanager/target/surefire-reports for the individual test results.
[ERROR] -> [Help 1]
[ERROR] 
[ERROR] To see the full stack trace of the errors, re-run Maven with the -e switch.
[ERROR] Re-run Maven using the -X switch to enable full debug logging.
[ERROR] 
[ERROR] For more information about the errors and possible solutions, please read the following articles:
[ERROR] [Help 1] http://cwiki.apache.org/confluence/display/MAVEN/MojoFailureException
[ERROR] 
[ERROR] After correcting the problems, you can resume the build with the command
[ERROR]   mvn <goals> -rf :hadoop-yarn-server-resourcemanager
Build step 'Execute shell' marked build as failure
Archiving artifacts
Recording test results
Sending e-mails to: yarn-dev@hadoop.apache.org
Email was triggered for: Failure - Any
Sending email for trigger: Failure - Any



###################################################################################
############################## FAILED TESTS (if any) ##############################
21 tests failed.
FAILED:  org.apache.hadoop.yarn.server.resourcemanager.scheduler.capacity.TestCapacityScheduler.testRecoverRequestAfterPreemption

Error Message:
test timed out after 30000 milliseconds

Stack Trace:
java.lang.Exception: test timed out after 30000 milliseconds
	at java.lang.Thread.sleep(Native Method)
	at org.apache.hadoop.yarn.server.resourcemanager.MockRM.waitForState(MockRM.java:261)
	at org.apache.hadoop.yarn.server.resourcemanager.MockRM.waitForState(MockRM.java:225)
	at org.apache.hadoop.yarn.server.resourcemanager.MockRM.waitForState(MockRM.java:207)
	at org.apache.hadoop.yarn.server.resourcemanager.MockRM.sendAMLaunched(MockRM.java:746)
	at org.apache.hadoop.yarn.server.resourcemanager.MockRM.launchAM(MockRM.java:945)
	at org.apache.hadoop.yarn.server.resourcemanager.MockRM.launchAndRegisterAM(MockRM.java:961)
	at org.apache.hadoop.yarn.server.resourcemanager.scheduler.capacity.TestCapacityScheduler.testRecoverRequestAfterPreemption(TestCapacityScheduler.java:1253)


FAILED:  org.apache.hadoop.yarn.server.resourcemanager.scheduler.capacity.TestCapacityScheduler.testAppReservationWithDominantResourceCalculator

Error Message:
test timed out after 30000 milliseconds

Stack Trace:
java.lang.Exception: test timed out after 30000 milliseconds
	at java.lang.Thread.sleep(Native Method)
	at org.apache.hadoop.yarn.server.resourcemanager.MockRM.waitForState(MockRM.java:261)
	at org.apache.hadoop.yarn.server.resourcemanager.MockRM.waitForState(MockRM.java:225)
	at org.apache.hadoop.yarn.server.resourcemanager.MockRM.waitForState(MockRM.java:207)
	at org.apache.hadoop.yarn.server.resourcemanager.MockRM.sendAMLaunched(MockRM.java:746)
	at org.apache.hadoop.yarn.server.resourcemanager.scheduler.capacity.TestCapacityScheduler.testAppReservationWithDominantResourceCalculator(TestCapacityScheduler.java:2212)


FAILED:  org.apache.hadoop.yarn.server.resourcemanager.scheduler.capacity.TestCapacityScheduler.testBlackListNodes

Error Message:
org/apache/hadoop/security/token/Token

Stack Trace:
java.lang.NoClassDefFoundError: org/apache/hadoop/security/token/Token
	at java.net.URLClassLoader$1.run(URLClassLoader.java:366)
	at java.net.URLClassLoader$1.run(URLClassLoader.java:355)
	at java.security.AccessController.doPrivileged(Native Method)
	at java.net.URLClassLoader.findClass(URLClassLoader.java:354)
	at java.lang.ClassLoader.loadClass(ClassLoader.java:425)
	at sun.misc.Launcher$AppClassLoader.loadClass(Launcher.java:308)
	at java.lang.ClassLoader.loadClass(ClassLoader.java:358)
	at java.lang.Class.getDeclaredMethods0(Native Method)
	at java.lang.Class.privateGetDeclaredMethods(Class.java:2531)
	at java.lang.Class.getDeclaredMethods(Class.java:1855)
	at org.mockito.cglib.core.ReflectUtils.addAllMethods(ReflectUtils.java:349)
	at org.mockito.cglib.proxy.Enhancer.getMethods(Enhancer.java:422)
	at org.mockito.cglib.proxy.Enhancer.generateClass(Enhancer.java:457)
	at org.mockito.cglib.core.DefaultGeneratorStrategy.generate(DefaultGeneratorStrategy.java:25)
	at org.mockito.cglib.core.AbstractClassGenerator.create(AbstractClassGenerator.java:217)
	at org.mockito.cglib.proxy.Enhancer.createHelper(Enhancer.java:378)
	at org.mockito.cglib.proxy.Enhancer.createClass(Enhancer.java:318)
	at org.mockito.internal.creation.jmock.ClassImposterizer.createProxyClass(ClassImposterizer.java:93)
	at org.mockito.internal.creation.jmock.ClassImposterizer.imposterise(ClassImposterizer.java:50)
	at org.mockito.internal.util.MockUtil.createMock(MockUtil.java:54)
	at org.mockito.internal.MockitoCore.mock(MockitoCore.java:45)
	at org.mockito.Mockito.mock(Mockito.java:921)
	at org.mockito.Mockito.mock(Mockito.java:816)
	at org.apache.hadoop.yarn.server.resourcemanager.scheduler.capacity.TestCapacityScheduler.testBlackListNodes(TestCapacityScheduler.java:664)


FAILED:  org.apache.hadoop.yarn.server.resourcemanager.scheduler.capacity.TestCapacityScheduler.testMoveAppViolateQueueState

Error Message:
Unexpected exception, expected<org.apache.hadoop.yarn.exceptions.YarnException> but was<java.lang.NoClassDefFoundError>

Stack Trace:
java.lang.Exception: Unexpected exception, expected<org.apache.hadoop.yarn.exceptions.YarnException> but was<java.lang.NoClassDefFoundError>
	at java.net.URLClassLoader$1.run(URLClassLoader.java:366)
	at java.net.URLClassLoader$1.run(URLClassLoader.java:355)
	at java.security.AccessController.doPrivileged(Native Method)
	at java.net.URLClassLoader.findClass(URLClassLoader.java:354)
	at java.lang.ClassLoader.loadClass(ClassLoader.java:425)
	at sun.misc.Launcher$AppClassLoader.loadClass(Launcher.java:308)
	at java.lang.ClassLoader.loadClass(ClassLoader.java:358)
	at org.apache.hadoop.security.token.TokenIdentifier.getBytes(TokenIdentifier.java:61)
	at org.apache.hadoop.yarn.server.security.BaseContainerTokenSecretManager.createPassword(BaseContainerTokenSecretManager.java:96)
	at org.apache.hadoop.yarn.server.resourcemanager.security.RMContainerTokenSecretManager.createContainerToken(RMContainerTokenSecretManager.java:218)
	at org.apache.hadoop.yarn.server.resourcemanager.scheduler.SchedulerApplicationAttempt.updateContainerAndNMToken(SchedulerApplicationAttempt.java:508)
	at org.apache.hadoop.yarn.server.resourcemanager.scheduler.SchedulerApplicationAttempt.pullNewlyAllocatedContainers(SchedulerApplicationAttempt.java:545)
	at org.apache.hadoop.yarn.server.resourcemanager.scheduler.common.fica.FiCaSchedulerApp.getAllocation(FiCaSchedulerApp.java:346)
	at org.apache.hadoop.yarn.server.resourcemanager.scheduler.capacity.CapacityScheduler.allocate(CapacityScheduler.java:1009)
	at org.apache.hadoop.yarn.server.resourcemanager.Application.getResources(Application.java:324)
	at org.apache.hadoop.yarn.server.resourcemanager.Application.schedule(Application.java:368)
	at org.apache.hadoop.yarn.server.resourcemanager.scheduler.capacity.TestCapacityScheduler.testMoveAppViolateQueueState(TestCapacityScheduler.java:1729)


FAILED:  org.apache.hadoop.yarn.server.resourcemanager.scheduler.capacity.TestCapacityScheduler.testAllocateDoesNotBlockOnSchedulerLock

Error Message:
org/apache/hadoop/ipc/RPC$Server

Stack Trace:
java.lang.NoClassDefFoundError: org/apache/hadoop/ipc/RPC$Server
	at java.net.URLClassLoader$1.run(URLClassLoader.java:366)
	at java.net.URLClassLoader$1.run(URLClassLoader.java:355)
	at java.security.AccessController.doPrivileged(Native Method)
	at java.net.URLClassLoader.findClass(URLClassLoader.java:354)
	at java.lang.ClassLoader.loadClass(ClassLoader.java:425)
	at sun.misc.Launcher$AppClassLoader.loadClass(Launcher.java:308)
	at java.lang.ClassLoader.loadClass(ClassLoader.java:358)
	at java.lang.Class.forName0(Native Method)
	at java.lang.Class.forName(Class.java:190)
	at org.apache.hadoop.yarn.factory.providers.RpcFactoryProvider.getFactoryClassInstance(RpcFactoryProvider.java:61)
	at org.apache.hadoop.yarn.factory.providers.RpcFactoryProvider.getServerFactory(RpcFactoryProvider.java:49)
	at org.apache.hadoop.yarn.ipc.HadoopYarnProtoRPC.getServer(HadoopYarnProtoRPC.java:65)
	at org.apache.hadoop.yarn.ipc.YarnRPC.getServer(YarnRPC.java:54)
	at org.apache.hadoop.yarn.server.resourcemanager.ApplicationMasterService.getServer(ApplicationMasterService.java:180)
	at org.apache.hadoop.yarn.server.resourcemanager.ApplicationMasterService.serviceStart(ApplicationMasterService.java:152)
	at org.apache.hadoop.service.AbstractService.start(AbstractService.java:193)
	at org.apache.hadoop.service.CompositeService.serviceStart(CompositeService.java:120)
	at org.apache.hadoop.yarn.server.resourcemanager.ResourceManager$RMActiveServices.serviceStart(ResourceManager.java:686)
	at org.apache.hadoop.service.AbstractService.start(AbstractService.java:193)
	at org.apache.hadoop.yarn.server.resourcemanager.ResourceManager.startActiveServices(ResourceManager.java:1010)
	at org.apache.hadoop.yarn.server.resourcemanager.ResourceManager$1.run(ResourceManager.java:1050)
	at org.apache.hadoop.yarn.server.resourcemanager.ResourceManager$1.run(ResourceManager.java:1046)
	at java.security.AccessController.doPrivileged(Native Method)
	at javax.security.auth.Subject.doAs(Subject.java:415)
	at org.apache.hadoop.security.UserGroupInformation.doAs(UserGroupInformation.java:1755)
	at org.apache.hadoop.yarn.server.resourcemanager.ResourceManager.transitionToActive(ResourceManager.java:1046)
	at org.apache.hadoop.yarn.server.resourcemanager.ResourceManager.serviceStart(ResourceManager.java:1086)
	at org.apache.hadoop.service.AbstractService.start(AbstractService.java:193)
	at org.apache.hadoop.yarn.server.resourcemanager.scheduler.capacity.TestCapacityScheduler.testAllocateDoesNotBlockOnSchedulerLock(TestCapacityScheduler.java:1033)


FAILED:  org.apache.hadoop.yarn.server.resourcemanager.scheduler.capacity.TestCapacityScheduler.testCapacityScheduler

Error Message:
org/apache/hadoop/io/DataOutputBuffer$Buffer

Stack Trace:
java.lang.NoClassDefFoundError: org/apache/hadoop/io/DataOutputBuffer$Buffer
	at java.net.URLClassLoader$1.run(URLClassLoader.java:366)
	at java.net.URLClassLoader$1.run(URLClassLoader.java:355)
	at java.security.AccessController.doPrivileged(Native Method)
	at java.net.URLClassLoader.findClass(URLClassLoader.java:354)
	at java.lang.ClassLoader.loadClass(ClassLoader.java:425)
	at sun.misc.Launcher$AppClassLoader.loadClass(Launcher.java:308)
	at java.lang.ClassLoader.loadClass(ClassLoader.java:358)
	at org.apache.hadoop.security.token.TokenIdentifier.getBytes(TokenIdentifier.java:61)
	at org.apache.hadoop.yarn.server.security.BaseContainerTokenSecretManager.createPassword(BaseContainerTokenSecretManager.java:96)
	at org.apache.hadoop.yarn.server.resourcemanager.security.RMContainerTokenSecretManager.createContainerToken(RMContainerTokenSecretManager.java:218)
	at org.apache.hadoop.yarn.server.resourcemanager.scheduler.SchedulerApplicationAttempt.updateContainerAndNMToken(SchedulerApplicationAttempt.java:508)
	at org.apache.hadoop.yarn.server.resourcemanager.scheduler.SchedulerApplicationAttempt.pullNewlyAllocatedContainers(SchedulerApplicationAttempt.java:545)
	at org.apache.hadoop.yarn.server.resourcemanager.scheduler.common.fica.FiCaSchedulerApp.getAllocation(FiCaSchedulerApp.java:346)
	at org.apache.hadoop.yarn.server.resourcemanager.scheduler.capacity.CapacityScheduler.allocate(CapacityScheduler.java:1009)
	at org.apache.hadoop.yarn.server.resourcemanager.Application.getResources(Application.java:324)
	at org.apache.hadoop.yarn.server.resourcemanager.Application.schedule(Application.java:368)
	at org.apache.hadoop.yarn.server.resourcemanager.scheduler.capacity.TestCapacityScheduler.testCapacityScheduler(TestCapacityScheduler.java:328)


FAILED:  org.apache.hadoop.yarn.server.resourcemanager.scheduler.capacity.TestCapacityScheduler.testMoveAppSuccess

Error Message:
org/apache/hadoop/io/DataOutputBuffer$Buffer

Stack Trace:
java.lang.NoClassDefFoundError: org/apache/hadoop/io/DataOutputBuffer$Buffer
	at java.net.URLClassLoader$1.run(URLClassLoader.java:366)
	at java.net.URLClassLoader$1.run(URLClassLoader.java:355)
	at java.security.AccessController.doPrivileged(Native Method)
	at java.net.URLClassLoader.findClass(URLClassLoader.java:354)
	at java.lang.ClassLoader.loadClass(ClassLoader.java:425)
	at sun.misc.Launcher$AppClassLoader.loadClass(Launcher.java:308)
	at java.lang.ClassLoader.loadClass(ClassLoader.java:358)
	at org.apache.hadoop.security.token.TokenIdentifier.getBytes(TokenIdentifier.java:61)
	at org.apache.hadoop.yarn.server.security.BaseContainerTokenSecretManager.createPassword(BaseContainerTokenSecretManager.java:96)
	at org.apache.hadoop.yarn.server.resourcemanager.security.RMContainerTokenSecretManager.createContainerToken(RMContainerTokenSecretManager.java:218)
	at org.apache.hadoop.yarn.server.resourcemanager.scheduler.SchedulerApplicationAttempt.updateContainerAndNMToken(SchedulerApplicationAttempt.java:508)
	at org.apache.hadoop.yarn.server.resourcemanager.scheduler.SchedulerApplicationAttempt.pullNewlyAllocatedContainers(SchedulerApplicationAttempt.java:545)
	at org.apache.hadoop.yarn.server.resourcemanager.scheduler.common.fica.FiCaSchedulerApp.getAllocation(FiCaSchedulerApp.java:346)
	at org.apache.hadoop.yarn.server.resourcemanager.scheduler.capacity.CapacityScheduler.allocate(CapacityScheduler.java:1009)
	at org.apache.hadoop.yarn.server.resourcemanager.Application.getResources(Application.java:324)
	at org.apache.hadoop.yarn.server.resourcemanager.Application.schedule(Application.java:368)
	at org.apache.hadoop.yarn.server.resourcemanager.scheduler.capacity.TestCapacityScheduler.testMoveAppSuccess(TestCapacityScheduler.java:1636)


FAILED:  org.apache.hadoop.yarn.server.resourcemanager.scheduler.capacity.TestCapacityScheduler.testPreemptionInfo

Error Message:
Attempt state is not correct (timeout). expected:<ALLOCATED> but was:<SCHEDULED>

Stack Trace:
java.lang.AssertionError: Attempt state is not correct (timeout). expected:<ALLOCATED> but was:<SCHEDULED>
	at org.junit.Assert.fail(Assert.java:88)
	at org.junit.Assert.failNotEquals(Assert.java:743)
	at org.junit.Assert.assertEquals(Assert.java:118)
	at org.apache.hadoop.yarn.server.resourcemanager.MockRM.waitForState(MockRM.java:266)
	at org.apache.hadoop.yarn.server.resourcemanager.MockRM.waitForState(MockRM.java:225)
	at org.apache.hadoop.yarn.server.resourcemanager.MockRM.waitForState(MockRM.java:207)
	at org.apache.hadoop.yarn.server.resourcemanager.MockRM.sendAMLaunched(MockRM.java:746)
	at org.apache.hadoop.yarn.server.resourcemanager.MockRM.launchAM(MockRM.java:945)
	at org.apache.hadoop.yarn.server.resourcemanager.scheduler.capacity.TestCapacityScheduler.testPreemptionInfo(TestCapacityScheduler.java:1187)


FAILED:  org.apache.hadoop.yarn.server.resourcemanager.scheduler.capacity.TestCapacityScheduler.testResourceUpdateDecommissioningNode

Error Message:
org/apache/hadoop/io/DataOutputBuffer$Buffer

Stack Trace:
java.lang.NoClassDefFoundError: org/apache/hadoop/io/DataOutputBuffer$Buffer
	at java.net.URLClassLoader$1.run(URLClassLoader.java:366)
	at java.net.URLClassLoader$1.run(URLClassLoader.java:355)
	at java.security.AccessController.doPrivileged(Native Method)
	at java.net.URLClassLoader.findClass(URLClassLoader.java:354)
	at java.lang.ClassLoader.loadClass(ClassLoader.java:425)
	at sun.misc.Launcher$AppClassLoader.loadClass(Launcher.java:308)
	at java.lang.ClassLoader.loadClass(ClassLoader.java:358)
	at org.apache.hadoop.security.token.TokenIdentifier.getBytes(TokenIdentifier.java:61)
	at org.apache.hadoop.yarn.server.security.BaseContainerTokenSecretManager.createPassword(BaseContainerTokenSecretManager.java:96)
	at org.apache.hadoop.yarn.server.resourcemanager.security.RMContainerTokenSecretManager.createContainerToken(RMContainerTokenSecretManager.java:218)
	at org.apache.hadoop.yarn.server.resourcemanager.scheduler.SchedulerApplicationAttempt.updateContainerAndNMToken(SchedulerApplicationAttempt.java:508)
	at org.apache.hadoop.yarn.server.resourcemanager.scheduler.SchedulerApplicationAttempt.pullNewlyAllocatedContainers(SchedulerApplicationAttempt.java:545)
	at org.apache.hadoop.yarn.server.resourcemanager.scheduler.common.fica.FiCaSchedulerApp.getAllocation(FiCaSchedulerApp.java:346)
	at org.apache.hadoop.yarn.server.resourcemanager.scheduler.capacity.CapacityScheduler.allocate(CapacityScheduler.java:1009)
	at org.apache.hadoop.yarn.server.resourcemanager.Application.getResources(Application.java:324)
	at org.apache.hadoop.yarn.server.resourcemanager.Application.schedule(Application.java:368)
	at org.apache.hadoop.yarn.server.resourcemanager.scheduler.capacity.TestCapacityScheduler.testResourceUpdateDecommissioningNode(TestCapacityScheduler.java:3351)


FAILED:  org.apache.hadoop.yarn.server.resourcemanager.scheduler.capacity.TestCapacityScheduler.testParentQueueMaxCapsAreRespected

Error Message:
Attempt state is not correct (timeout). expected:<ALLOCATED> but was:<SCHEDULED>

Stack Trace:
java.lang.AssertionError: Attempt state is not correct (timeout). expected:<ALLOCATED> but was:<SCHEDULED>
	at org.junit.Assert.fail(Assert.java:88)
	at org.junit.Assert.failNotEquals(Assert.java:743)
	at org.junit.Assert.assertEquals(Assert.java:118)
	at org.apache.hadoop.yarn.server.resourcemanager.MockRM.waitForState(MockRM.java:266)
	at org.apache.hadoop.yarn.server.resourcemanager.MockRM.waitForState(MockRM.java:225)
	at org.apache.hadoop.yarn.server.resourcemanager.MockRM.waitForState(MockRM.java:207)
	at org.apache.hadoop.yarn.server.resourcemanager.MockRM.sendAMLaunched(MockRM.java:746)
	at org.apache.hadoop.yarn.server.resourcemanager.MockRM.launchAM(MockRM.java:945)
	at org.apache.hadoop.yarn.server.resourcemanager.MockRM.launchAndRegisterAM(MockRM.java:961)
	at org.apache.hadoop.yarn.server.resourcemanager.scheduler.capacity.TestCapacityScheduler.testParentQueueMaxCapsAreRespected(TestCapacityScheduler.java:2693)


FAILED:  org.apache.hadoop.yarn.server.resourcemanager.scheduler.capacity.TestCapacityScheduler.testPendingResourceUpdatedAccordingToIncreaseRequestChanges

Error Message:
Attempt state is not correct (timeout). expected:<ALLOCATED> but was:<SCHEDULED>

Stack Trace:
java.lang.AssertionError: Attempt state is not correct (timeout). expected:<ALLOCATED> but was:<SCHEDULED>
	at org.junit.Assert.fail(Assert.java:88)
	at org.junit.Assert.failNotEquals(Assert.java:743)
	at org.junit.Assert.assertEquals(Assert.java:118)
	at org.apache.hadoop.yarn.server.resourcemanager.MockRM.waitForState(MockRM.java:266)
	at org.apache.hadoop.yarn.server.resourcemanager.MockRM.waitForState(MockRM.java:225)
	at org.apache.hadoop.yarn.server.resourcemanager.MockRM.waitForState(MockRM.java:207)
	at org.apache.hadoop.yarn.server.resourcemanager.MockRM.sendAMLaunched(MockRM.java:746)
	at org.apache.hadoop.yarn.server.resourcemanager.MockRM.launchAM(MockRM.java:945)
	at org.apache.hadoop.yarn.server.resourcemanager.MockRM.launchAndRegisterAM(MockRM.java:961)
	at org.apache.hadoop.yarn.server.resourcemanager.scheduler.capacity.TestCapacityScheduler.testPendingResourceUpdatedAccordingToIncreaseRequestChanges(TestCapacityScheduler.java:3150)


FAILED:  org.apache.hadoop.yarn.server.resourcemanager.scheduler.capacity.TestCapacityScheduler.testResourceOverCommit

Error Message:
Attempt state is not correct (timeout). expected:<ALLOCATED> but was:<SCHEDULED>

Stack Trace:
java.lang.AssertionError: Attempt state is not correct (timeout). expected:<ALLOCATED> but was:<SCHEDULED>
	at org.junit.Assert.fail(Assert.java:88)
	at org.junit.Assert.failNotEquals(Assert.java:743)
	at org.junit.Assert.assertEquals(Assert.java:118)
	at org.apache.hadoop.yarn.server.resourcemanager.MockRM.waitForState(MockRM.java:266)
	at org.apache.hadoop.yarn.server.resourcemanager.MockRM.waitForState(MockRM.java:225)
	at org.apache.hadoop.yarn.server.resourcemanager.MockRM.waitForState(MockRM.java:207)
	at org.apache.hadoop.yarn.server.resourcemanager.MockRM.sendAMLaunched(MockRM.java:746)
	at org.apache.hadoop.yarn.server.resourcemanager.scheduler.capacity.TestCapacityScheduler.testResourceOverCommit(TestCapacityScheduler.java:828)


FAILED:  org.apache.hadoop.yarn.server.resourcemanager.scheduler.capacity.TestCapacityScheduler.testKillAllAppsInQueue

Error Message:
App State is not correct (timeout). expected:<KILLED> but was:<KILLING>

Stack Trace:
java.lang.AssertionError: App State is not correct (timeout). expected:<KILLED> but was:<KILLING>
	at org.junit.Assert.fail(Assert.java:88)
	at org.junit.Assert.failNotEquals(Assert.java:743)
	at org.junit.Assert.assertEquals(Assert.java:118)
	at org.apache.hadoop.yarn.server.resourcemanager.MockRM.waitForState(MockRM.java:193)
	at org.apache.hadoop.yarn.server.resourcemanager.scheduler.capacity.TestCapacityScheduler.testKillAllAppsInQueue(TestCapacityScheduler.java:2128)


FAILED:  org.apache.hadoop.yarn.server.resourcemanager.scheduler.capacity.TestCapacityScheduler.testMoveAppForMoveToQueueWithFreeCap

Error Message:
org/apache/hadoop/io/DataOutputBuffer$Buffer

Stack Trace:
java.lang.NoClassDefFoundError: org/apache/hadoop/io/DataOutputBuffer$Buffer
	at java.net.URLClassLoader$1.run(URLClassLoader.java:366)
	at java.net.URLClassLoader$1.run(URLClassLoader.java:355)
	at java.security.AccessController.doPrivileged(Native Method)
	at java.net.URLClassLoader.findClass(URLClassLoader.java:354)
	at java.lang.ClassLoader.loadClass(ClassLoader.java:425)
	at sun.misc.Launcher$AppClassLoader.loadClass(Launcher.java:308)
	at java.lang.ClassLoader.loadClass(ClassLoader.java:358)
	at org.apache.hadoop.security.token.TokenIdentifier.getBytes(TokenIdentifier.java:61)
	at org.apache.hadoop.yarn.server.security.BaseContainerTokenSecretManager.createPassword(BaseContainerTokenSecretManager.java:96)
	at org.apache.hadoop.yarn.server.resourcemanager.security.RMContainerTokenSecretManager.createContainerToken(RMContainerTokenSecretManager.java:218)
	at org.apache.hadoop.yarn.server.resourcemanager.scheduler.SchedulerApplicationAttempt.updateContainerAndNMToken(SchedulerApplicationAttempt.java:508)
	at org.apache.hadoop.yarn.server.resourcemanager.scheduler.SchedulerApplicationAttempt.pullNewlyAllocatedContainers(SchedulerApplicationAttempt.java:545)
	at org.apache.hadoop.yarn.server.resourcemanager.scheduler.common.fica.FiCaSchedulerApp.getAllocation(FiCaSchedulerApp.java:346)
	at org.apache.hadoop.yarn.server.resourcemanager.scheduler.capacity.CapacityScheduler.allocate(CapacityScheduler.java:1009)
	at org.apache.hadoop.yarn.server.resourcemanager.Application.getResources(Application.java:324)
	at org.apache.hadoop.yarn.server.resourcemanager.Application.schedule(Application.java:368)
	at org.apache.hadoop.yarn.server.resourcemanager.scheduler.capacity.TestCapacityScheduler.testMoveAppForMoveToQueueWithFreeCap(TestCapacityScheduler.java:1512)


FAILED:  org.apache.hadoop.yarn.server.resourcemanager.scheduler.capacity.TestCapacityScheduler.testAllocateReorder

Error Message:
org/apache/hadoop/security/token/Token

Stack Trace:
java.lang.NoClassDefFoundError: org/apache/hadoop/security/token/Token
	at java.net.URLClassLoader$1.run(URLClassLoader.java:366)
	at java.net.URLClassLoader$1.run(URLClassLoader.java:355)
	at java.security.AccessController.doPrivileged(Native Method)
	at java.net.URLClassLoader.findClass(URLClassLoader.java:354)
	at java.lang.ClassLoader.loadClass(ClassLoader.java:425)
	at sun.misc.Launcher$AppClassLoader.loadClass(Launcher.java:308)
	at java.lang.ClassLoader.loadClass(ClassLoader.java:358)
	at java.lang.Class.getDeclaredMethods0(Native Method)
	at java.lang.Class.privateGetDeclaredMethods(Class.java:2531)
	at java.lang.Class.getDeclaredMethods(Class.java:1855)
	at org.mockito.cglib.core.ReflectUtils.addAllMethods(ReflectUtils.java:349)
	at org.mockito.cglib.proxy.Enhancer.getMethods(Enhancer.java:422)
	at org.mockito.cglib.proxy.Enhancer.generateClass(Enhancer.java:457)
	at org.mockito.cglib.core.DefaultGeneratorStrategy.generate(DefaultGeneratorStrategy.java:25)
	at org.mockito.cglib.core.AbstractClassGenerator.create(AbstractClassGenerator.java:217)
	at org.mockito.cglib.proxy.Enhancer.createHelper(Enhancer.java:378)
	at org.mockito.cglib.proxy.Enhancer.createClass(Enhancer.java:318)
	at org.mockito.internal.creation.jmock.ClassImposterizer.createProxyClass(ClassImposterizer.java:93)
	at org.mockito.internal.creation.jmock.ClassImposterizer.imposterise(ClassImposterizer.java:50)
	at org.mockito.internal.util.MockUtil.createMock(MockUtil.java:54)
	at org.mockito.internal.MockitoCore.mock(MockitoCore.java:45)
	at org.mockito.Mockito.mock(Mockito.java:921)
	at org.mockito.Mockito.mock(Mockito.java:816)
	at org.apache.hadoop.yarn.server.resourcemanager.scheduler.capacity.TestCapacityScheduler.testAllocateReorder(TestCapacityScheduler.java:729)


FAILED:  org.apache.hadoop.yarn.server.resourcemanager.scheduler.capacity.TestCapacityScheduler.testMoveAppQueueMetricsCheck

Error Message:
org/apache/hadoop/io/DataOutputBuffer$Buffer

Stack Trace:
java.lang.NoClassDefFoundError: org/apache/hadoop/io/DataOutputBuffer$Buffer
	at java.net.URLClassLoader$1.run(URLClassLoader.java:366)
	at java.net.URLClassLoader$1.run(URLClassLoader.java:355)
	at java.security.AccessController.doPrivileged(Native Method)
	at java.net.URLClassLoader.findClass(URLClassLoader.java:354)
	at java.lang.ClassLoader.loadClass(ClassLoader.java:425)
	at sun.misc.Launcher$AppClassLoader.loadClass(Launcher.java:308)
	at java.lang.ClassLoader.loadClass(ClassLoader.java:358)
	at org.apache.hadoop.security.token.TokenIdentifier.getBytes(TokenIdentifier.java:61)
	at org.apache.hadoop.yarn.server.security.BaseContainerTokenSecretManager.createPassword(BaseContainerTokenSecretManager.java:96)
	at org.apache.hadoop.yarn.server.resourcemanager.security.RMContainerTokenSecretManager.createContainerToken(RMContainerTokenSecretManager.java:218)
	at org.apache.hadoop.yarn.server.resourcemanager.scheduler.SchedulerApplicationAttempt.updateContainerAndNMToken(SchedulerApplicationAttempt.java:508)
	at org.apache.hadoop.yarn.server.resourcemanager.scheduler.SchedulerApplicationAttempt.pullNewlyAllocatedContainers(SchedulerApplicationAttempt.java:545)
	at org.apache.hadoop.yarn.server.resourcemanager.scheduler.common.fica.FiCaSchedulerApp.getAllocation(FiCaSchedulerApp.java:346)
	at org.apache.hadoop.yarn.server.resourcemanager.scheduler.capacity.CapacityScheduler.allocate(CapacityScheduler.java:1009)
	at org.apache.hadoop.yarn.server.resourcemanager.Application.getResources(Application.java:324)
	at org.apache.hadoop.yarn.server.resourcemanager.Application.schedule(Application.java:368)
	at org.apache.hadoop.yarn.server.resourcemanager.scheduler.capacity.TestCapacityScheduler.testMoveAppQueueMetricsCheck(TestCapacityScheduler.java:1876)


FAILED:  org.apache.hadoop.yarn.server.resourcemanager.scheduler.capacity.TestCapacityScheduler.testHierarchyQueuesCurrentLimits

Error Message:
Attempt state is not correct (timeout). expected:<ALLOCATED> but was:<SCHEDULED>

Stack Trace:
java.lang.AssertionError: Attempt state is not correct (timeout). expected:<ALLOCATED> but was:<SCHEDULED>
	at org.junit.Assert.fail(Assert.java:88)
	at org.junit.Assert.failNotEquals(Assert.java:743)
	at org.junit.Assert.assertEquals(Assert.java:118)
	at org.apache.hadoop.yarn.server.resourcemanager.MockRM.waitForState(MockRM.java:266)
	at org.apache.hadoop.yarn.server.resourcemanager.MockRM.waitForState(MockRM.java:225)
	at org.apache.hadoop.yarn.server.resourcemanager.MockRM.waitForState(MockRM.java:207)
	at org.apache.hadoop.yarn.server.resourcemanager.MockRM.sendAMLaunched(MockRM.java:746)
	at org.apache.hadoop.yarn.server.resourcemanager.MockRM.launchAM(MockRM.java:945)
	at org.apache.hadoop.yarn.server.resourcemanager.MockRM.launchAndRegisterAM(MockRM.java:961)
	at org.apache.hadoop.yarn.server.resourcemanager.scheduler.capacity.TestCapacityScheduler.testHierarchyQueuesCurrentLimits(TestCapacityScheduler.java:2610)


FAILED:  org.apache.hadoop.yarn.server.resourcemanager.scheduler.capacity.TestCapacityScheduler.testQueueHierarchyPendingResourceUpdate

Error Message:
org/apache/hadoop/security/proto/SecurityProtos

Stack Trace:
java.lang.NoClassDefFoundError: org/apache/hadoop/security/proto/SecurityProtos
	at java.net.URLClassLoader$1.run(URLClassLoader.java:366)
	at java.net.URLClassLoader$1.run(URLClassLoader.java:355)
	at java.security.AccessController.doPrivileged(Native Method)
	at java.net.URLClassLoader.findClass(URLClassLoader.java:354)
	at java.lang.ClassLoader.loadClass(ClassLoader.java:425)
	at sun.misc.Launcher$AppClassLoader.loadClass(Launcher.java:308)
	at java.lang.ClassLoader.loadClass(ClassLoader.java:358)
	at org.apache.hadoop.yarn.proto.YarnProtos.<clinit>(YarnProtos.java:56957)
	at org.apache.hadoop.yarn.proto.YarnProtos$NodeLabelProto.internalGetFieldAccessorTable(YarnProtos.java:25907)
	at com.google.protobuf.GeneratedMessage.getDescriptorForType(GeneratedMessage.java:98)
	at org.apache.hadoop.yarn.proto.YarnProtos$NodeLabelProto.hashCode(YarnProtos.java:26071)
	at org.apache.hadoop.yarn.api.records.impl.pb.NodeLabelPBImpl.hashCode(NodeLabelPBImpl.java:72)
	at java.util.HashMap.hash(HashMap.java:366)
	at java.util.HashMap.put(HashMap.java:496)
	at java.util.HashSet.add(HashSet.java:217)
	at org.apache.hadoop.yarn.nodelabels.CommonNodeLabelsManager.addToCluserNodeLabelsWithDefaultExclusivity(CommonNodeLabelsManager.java:335)
	at org.apache.hadoop.yarn.server.resourcemanager.scheduler.capacity.TestCapacityScheduler.testQueueHierarchyPendingResourceUpdate(TestCapacityScheduler.java:2727)


FAILED:  org.apache.hadoop.yarn.server.resourcemanager.scheduler.capacity.TestCapacityScheduler.testHeadRoomCalculationWithDRC

Error Message:
org/apache/hadoop/security/token/Token

Stack Trace:
java.lang.NoClassDefFoundError: org/apache/hadoop/security/token/Token
	at java.net.URLClassLoader$1.run(URLClassLoader.java:366)
	at java.net.URLClassLoader$1.run(URLClassLoader.java:355)
	at java.security.AccessController.doPrivileged(Native Method)
	at java.net.URLClassLoader.findClass(URLClassLoader.java:354)
	at java.lang.ClassLoader.loadClass(ClassLoader.java:425)
	at sun.misc.Launcher$AppClassLoader.loadClass(Launcher.java:308)
	at java.lang.ClassLoader.loadClass(ClassLoader.java:358)
	at java.lang.Class.getDeclaredMethods0(Native Method)
	at java.lang.Class.privateGetDeclaredMethods(Class.java:2531)
	at java.lang.Class.getDeclaredMethods(Class.java:1855)
	at org.mockito.cglib.core.ReflectUtils.addAllMethods(ReflectUtils.java:349)
	at org.mockito.cglib.proxy.Enhancer.getMethods(Enhancer.java:422)
	at org.mockito.cglib.proxy.Enhancer.generateClass(Enhancer.java:457)
	at org.mockito.cglib.core.DefaultGeneratorStrategy.generate(DefaultGeneratorStrategy.java:25)
	at org.mockito.cglib.core.AbstractClassGenerator.create(AbstractClassGenerator.java:217)
	at org.mockito.cglib.proxy.Enhancer.createHelper(Enhancer.java:378)
	at org.mockito.cglib.proxy.Enhancer.createClass(Enhancer.java:318)
	at org.mockito.internal.creation.jmock.ClassImposterizer.createProxyClass(ClassImposterizer.java:93)
	at org.mockito.internal.creation.jmock.ClassImposterizer.imposterise(ClassImposterizer.java:50)
	at org.mockito.internal.util.MockUtil.createMock(MockUtil.java:54)
	at org.mockito.internal.MockitoCore.mock(MockitoCore.java:45)
	at org.mockito.Mockito.mock(Mockito.java:921)
	at org.mockito.Mockito.mock(Mockito.java:816)
	at org.apache.hadoop.yarn.server.resourcemanager.scheduler.capacity.TestCapacityScheduler.testHeadRoomCalculationWithDRC(TestCapacityScheduler.java:3000)


FAILED:  org.apache.hadoop.yarn.server.resourcemanager.scheduler.capacity.TestCapacityScheduler.testApplicationHeadRoom

Error Message:
org/apache/hadoop/security/token/Token

Stack Trace:
java.lang.NoClassDefFoundError: org/apache/hadoop/security/token/Token
	at java.net.URLClassLoader$1.run(URLClassLoader.java:366)
	at java.net.URLClassLoader$1.run(URLClassLoader.java:355)
	at java.security.AccessController.doPrivileged(Native Method)
	at java.net.URLClassLoader.findClass(URLClassLoader.java:354)
	at java.lang.ClassLoader.loadClass(ClassLoader.java:425)
	at sun.misc.Launcher$AppClassLoader.loadClass(Launcher.java:308)
	at java.lang.ClassLoader.loadClass(ClassLoader.java:358)
	at java.lang.Class.getDeclaredMethods0(Native Method)
	at java.lang.Class.privateGetDeclaredMethods(Class.java:2531)
	at java.lang.Class.getDeclaredMethods(Class.java:1855)
	at org.mockito.cglib.core.ReflectUtils.addAllMethods(ReflectUtils.java:349)
	at org.mockito.cglib.proxy.Enhancer.getMethods(Enhancer.java:422)
	at org.mockito.cglib.proxy.Enhancer.generateClass(Enhancer.java:457)
	at org.mockito.cglib.core.DefaultGeneratorStrategy.generate(DefaultGeneratorStrategy.java:25)
	at org.mockito.cglib.core.AbstractClassGenerator.create(AbstractClassGenerator.java:217)
	at org.mockito.cglib.proxy.Enhancer.createHelper(Enhancer.java:378)
	at org.mockito.cglib.proxy.Enhancer.createClass(Enhancer.java:318)
	at org.mockito.internal.creation.jmock.ClassImposterizer.createProxyClass(ClassImposterizer.java:93)
	at org.mockito.internal.creation.jmock.ClassImposterizer.imposterise(ClassImposterizer.java:50)
	at org.mockito.internal.util.MockUtil.createMock(MockUtil.java:54)
	at org.mockito.internal.MockitoCore.mock(MockitoCore.java:45)
	at org.mockito.Mockito.mock(Mockito.java:921)
	at org.mockito.Mockito.mock(Mockito.java:816)
	at org.apache.hadoop.yarn.server.resourcemanager.scheduler.capacity.TestCapacityScheduler.testApplicationHeadRoom(TestCapacityScheduler.java:2918)


FAILED:  org.apache.hadoop.yarn.server.resourcemanager.TestContainerResourceUsage.testUsageAfterAMRestartWithMultipleContainers

Error Message:
Unexcpected MemorySeconds value expected:<-1498011024470> but was:<2114>

Stack Trace:
java.lang.AssertionError: Unexcpected MemorySeconds value expected:<-1498011024470> but was:<2114>
	at org.junit.Assert.fail(Assert.java:88)
	at org.junit.Assert.failNotEquals(Assert.java:743)
	at org.junit.Assert.assertEquals(Assert.java:118)
	at org.junit.Assert.assertEquals(Assert.java:555)
	at org.apache.hadoop.yarn.server.resourcemanager.TestContainerResourceUsage.amRestartTests(TestContainerResourceUsage.java:395)
	at org.apache.hadoop.yarn.server.resourcemanager.TestContainerResourceUsage.testUsageAfterAMRestartWithMultipleContainers(TestContainerResourceUsage.java:252)




Jenkins build is back to normal : Hadoop-Yarn-trunk #2125

Posted by Apache Jenkins Server <je...@builds.apache.org>.
See <https://builds.apache.org/job/Hadoop-Yarn-trunk/2125/changes>


---------------------------------------------------------------------
To unsubscribe, e-mail: yarn-dev-unsubscribe@hadoop.apache.org
For additional commands, e-mail: yarn-dev-help@hadoop.apache.org


Build failed in Jenkins: Hadoop-Yarn-trunk #2124

Posted by Apache Jenkins Server <je...@builds.apache.org>.
See <https://builds.apache.org/job/Hadoop-Yarn-trunk/2124/changes>

Changes:

[epayne] MAPREDUCE-6678. Allow ShuffleHandler readahead without drop-behind.

[jlowe] MAPREDUCE-6684. High contention on scanning of user directory under

------------------------------------------
[...truncated 10253 lines...]
	at java.lang.ClassLoader.loadClass(ClassLoader.java:358)
	at org.apache.hadoop.security.token.TokenIdentifier.getBytes(TokenIdentifier.java:61)
	at org.apache.hadoop.yarn.server.security.BaseContainerTokenSecretManager.createPassword(BaseContainerTokenSecretManager.java:96)
	at org.apache.hadoop.yarn.server.resourcemanager.security.RMContainerTokenSecretManager.createContainerToken(RMContainerTokenSecretManager.java:218)
	at org.apache.hadoop.yarn.server.resourcemanager.scheduler.SchedulerApplicationAttempt.updateContainerAndNMToken(SchedulerApplicationAttempt.java:508)
	at org.apache.hadoop.yarn.server.resourcemanager.scheduler.SchedulerApplicationAttempt.pullNewlyAllocatedContainers(SchedulerApplicationAttempt.java:545)
	at org.apache.hadoop.yarn.server.resourcemanager.scheduler.common.fica.FiCaSchedulerApp.getAllocation(FiCaSchedulerApp.java:346)
	at org.apache.hadoop.yarn.server.resourcemanager.scheduler.capacity.CapacityScheduler.allocate(CapacityScheduler.java:1009)
	at org.apache.hadoop.yarn.server.resourcemanager.Application.getResources(Application.java:324)
	at org.apache.hadoop.yarn.server.resourcemanager.Application.schedule(Application.java:368)
	at org.apache.hadoop.yarn.server.resourcemanager.scheduler.capacity.TestCapacityScheduler.testMoveAppQueueMetricsCheck(TestCapacityScheduler.java:1876)

testHierarchyQueuesCurrentLimits(org.apache.hadoop.yarn.server.resourcemanager.scheduler.capacity.TestCapacityScheduler)  Time elapsed: 41.297 sec  <<< FAILURE!
java.lang.AssertionError: Attempt state is not correct (timeout). expected:<ALLOCATED> but was:<SCHEDULED>
	at org.junit.Assert.fail(Assert.java:88)
	at org.junit.Assert.failNotEquals(Assert.java:743)
	at org.junit.Assert.assertEquals(Assert.java:118)
	at org.apache.hadoop.yarn.server.resourcemanager.MockRM.waitForState(MockRM.java:266)
	at org.apache.hadoop.yarn.server.resourcemanager.MockRM.waitForState(MockRM.java:225)
	at org.apache.hadoop.yarn.server.resourcemanager.MockRM.waitForState(MockRM.java:207)
	at org.apache.hadoop.yarn.server.resourcemanager.MockRM.sendAMLaunched(MockRM.java:746)
	at org.apache.hadoop.yarn.server.resourcemanager.MockRM.launchAM(MockRM.java:945)
	at org.apache.hadoop.yarn.server.resourcemanager.MockRM.launchAndRegisterAM(MockRM.java:961)
	at org.apache.hadoop.yarn.server.resourcemanager.scheduler.capacity.TestCapacityScheduler.testHierarchyQueuesCurrentLimits(TestCapacityScheduler.java:2610)

testQueueHierarchyPendingResourceUpdate(org.apache.hadoop.yarn.server.resourcemanager.scheduler.capacity.TestCapacityScheduler)  Time elapsed: 0.074 sec  <<< ERROR!
java.lang.NoClassDefFoundError: org/apache/hadoop/security/proto/SecurityProtos
	at java.net.URLClassLoader$1.run(URLClassLoader.java:366)
	at java.net.URLClassLoader$1.run(URLClassLoader.java:355)
	at java.security.AccessController.doPrivileged(Native Method)
	at java.net.URLClassLoader.findClass(URLClassLoader.java:354)
	at java.lang.ClassLoader.loadClass(ClassLoader.java:425)
	at sun.misc.Launcher$AppClassLoader.loadClass(Launcher.java:308)
	at java.lang.ClassLoader.loadClass(ClassLoader.java:358)
	at org.apache.hadoop.yarn.proto.YarnProtos.<clinit>(YarnProtos.java:56957)
	at org.apache.hadoop.yarn.proto.YarnProtos$NodeLabelProto.internalGetFieldAccessorTable(YarnProtos.java:25907)
	at com.google.protobuf.GeneratedMessage.getDescriptorForType(GeneratedMessage.java:98)
	at org.apache.hadoop.yarn.proto.YarnProtos$NodeLabelProto.hashCode(YarnProtos.java:26071)
	at org.apache.hadoop.yarn.api.records.impl.pb.NodeLabelPBImpl.hashCode(NodeLabelPBImpl.java:72)
	at java.util.HashMap.hash(HashMap.java:366)
	at java.util.HashMap.put(HashMap.java:496)
	at java.util.HashSet.add(HashSet.java:217)
	at org.apache.hadoop.yarn.nodelabels.CommonNodeLabelsManager.addToCluserNodeLabelsWithDefaultExclusivity(CommonNodeLabelsManager.java:335)
	at org.apache.hadoop.yarn.server.resourcemanager.scheduler.capacity.TestCapacityScheduler.testQueueHierarchyPendingResourceUpdate(TestCapacityScheduler.java:2727)

testHeadRoomCalculationWithDRC(org.apache.hadoop.yarn.server.resourcemanager.scheduler.capacity.TestCapacityScheduler)  Time elapsed: 0.126 sec  <<< ERROR!
java.lang.NoClassDefFoundError: org/apache/hadoop/security/token/Token
	at java.net.URLClassLoader$1.run(URLClassLoader.java:366)
	at java.net.URLClassLoader$1.run(URLClassLoader.java:355)
	at java.security.AccessController.doPrivileged(Native Method)
	at java.net.URLClassLoader.findClass(URLClassLoader.java:354)
	at java.lang.ClassLoader.loadClass(ClassLoader.java:425)
	at sun.misc.Launcher$AppClassLoader.loadClass(Launcher.java:308)
	at java.lang.ClassLoader.loadClass(ClassLoader.java:358)
	at java.lang.Class.getDeclaredMethods0(Native Method)
	at java.lang.Class.privateGetDeclaredMethods(Class.java:2531)
	at java.lang.Class.getDeclaredMethods(Class.java:1855)
	at org.mockito.cglib.core.ReflectUtils.addAllMethods(ReflectUtils.java:349)
	at org.mockito.cglib.proxy.Enhancer.getMethods(Enhancer.java:422)
	at org.mockito.cglib.proxy.Enhancer.generateClass(Enhancer.java:457)
	at org.mockito.cglib.core.DefaultGeneratorStrategy.generate(DefaultGeneratorStrategy.java:25)
	at org.mockito.cglib.core.AbstractClassGenerator.create(AbstractClassGenerator.java:217)
	at org.mockito.cglib.proxy.Enhancer.createHelper(Enhancer.java:378)
	at org.mockito.cglib.proxy.Enhancer.createClass(Enhancer.java:318)
	at org.mockito.internal.creation.jmock.ClassImposterizer.createProxyClass(ClassImposterizer.java:93)
	at org.mockito.internal.creation.jmock.ClassImposterizer.imposterise(ClassImposterizer.java:50)
	at org.mockito.internal.util.MockUtil.createMock(MockUtil.java:54)
	at org.mockito.internal.MockitoCore.mock(MockitoCore.java:45)
	at org.mockito.Mockito.mock(Mockito.java:921)
	at org.mockito.Mockito.mock(Mockito.java:816)
	at org.apache.hadoop.yarn.server.resourcemanager.scheduler.capacity.TestCapacityScheduler.testHeadRoomCalculationWithDRC(TestCapacityScheduler.java:3000)

testApplicationHeadRoom(org.apache.hadoop.yarn.server.resourcemanager.scheduler.capacity.TestCapacityScheduler)  Time elapsed: 0.129 sec  <<< ERROR!
java.lang.NoClassDefFoundError: org/apache/hadoop/security/token/Token
	at java.net.URLClassLoader$1.run(URLClassLoader.java:366)
	at java.net.URLClassLoader$1.run(URLClassLoader.java:355)
	at java.security.AccessController.doPrivileged(Native Method)
	at java.net.URLClassLoader.findClass(URLClassLoader.java:354)
	at java.lang.ClassLoader.loadClass(ClassLoader.java:425)
	at sun.misc.Launcher$AppClassLoader.loadClass(Launcher.java:308)
	at java.lang.ClassLoader.loadClass(ClassLoader.java:358)
	at java.lang.Class.getDeclaredMethods0(Native Method)
	at java.lang.Class.privateGetDeclaredMethods(Class.java:2531)
	at java.lang.Class.getDeclaredMethods(Class.java:1855)
	at org.mockito.cglib.core.ReflectUtils.addAllMethods(ReflectUtils.java:349)
	at org.mockito.cglib.proxy.Enhancer.getMethods(Enhancer.java:422)
	at org.mockito.cglib.proxy.Enhancer.generateClass(Enhancer.java:457)
	at org.mockito.cglib.core.DefaultGeneratorStrategy.generate(DefaultGeneratorStrategy.java:25)
	at org.mockito.cglib.core.AbstractClassGenerator.create(AbstractClassGenerator.java:217)
	at org.mockito.cglib.proxy.Enhancer.createHelper(Enhancer.java:378)
	at org.mockito.cglib.proxy.Enhancer.createClass(Enhancer.java:318)
	at org.mockito.internal.creation.jmock.ClassImposterizer.createProxyClass(ClassImposterizer.java:93)
	at org.mockito.internal.creation.jmock.ClassImposterizer.imposterise(ClassImposterizer.java:50)
	at org.mockito.internal.util.MockUtil.createMock(MockUtil.java:54)
	at org.mockito.internal.MockitoCore.mock(MockitoCore.java:45)
	at org.mockito.Mockito.mock(Mockito.java:921)
	at org.mockito.Mockito.mock(Mockito.java:816)
	at org.apache.hadoop.yarn.server.resourcemanager.scheduler.capacity.TestCapacityScheduler.testApplicationHeadRoom(TestCapacityScheduler.java:2918)

        at sun.misc.Unsafe.p
Running org.apache.hadoop.yarn.server.resourcemanager.scheduler.capacity.TestQueueCapacities
Tests run: 9, Failures: 0, Errors: 0, Skipped: 0, Time elapsed: 0.267 sec - in org.apache.hadoop.yarn.server.resourcemanager.scheduler.capacity.TestQueueCapacities
Running org.apache.hadoop.yarn.server.resourcemanager.scheduler.capacity.TestChildQueueOrder
Tests run: 1, Failures: 0, Errors: 0, Skipped: 0, Time elapsed: 3.109 sec - in org.apache.hadoop.yarn.server.resourcemanager.scheduler.capacity.TestChildQueueOrder
Running org.apache.hadoop.yarn.server.resourcemanager.scheduler.capacity.TestQueueParsing
Tests run: 17, Failures: 0, Errors: 0, Skipped: 0, Time elapsed: 4.153 sec - in org.apache.hadoop.yarn.server.resourcemanager.scheduler.capacity.TestQueueParsing
Running org.apache.hadoop.yarn.server.resourcemanager.scheduler.TestSchedulerApplicationAttempt
Tests run: 4, Failures: 0, Errors: 0, Skipped: 0, Time elapsed: 1.268 sec - in org.apache.hadoop.yarn.server.resourcemanager.scheduler.TestSchedulerApplicationAttempt
Running org.apache.hadoop.yarn.server.resourcemanager.scheduler.TestSchedulerHealth
Tests run: 5, Failures: 0, Errors: 0, Skipped: 0, Time elapsed: 3.121 sec - in org.apache.hadoop.yarn.server.resourcemanager.scheduler.TestSchedulerHealth
Running org.apache.hadoop.yarn.server.resourcemanager.TestRMDispatcher
Tests run: 1, Failures: 0, Errors: 0, Skipped: 0, Time elapsed: 1.955 sec - in org.apache.hadoop.yarn.server.resourcemanager.TestRMDispatcher
Running org.apache.hadoop.yarn.server.resourcemanager.TestLeaderElectorService
Tests run: 6, Failures: 0, Errors: 0, Skipped: 0, Time elapsed: 36.28 sec - in org.apache.hadoop.yarn.server.resourcemanager.TestLeaderElectorService
Running org.apache.hadoop.yarn.server.resourcemanager.resource.TestResources
Tests run: 2, Failures: 0, Errors: 0, Skipped: 0, Time elapsed: 0.517 sec - in org.apache.hadoop.yarn.server.resourcemanager.resource.TestResources
Running org.apache.hadoop.yarn.server.resourcemanager.resource.TestResourceWeights
Tests run: 1, Failures: 0, Errors: 0, Skipped: 0, Time elapsed: 0.078 sec - in org.apache.hadoop.yarn.server.resourcemanager.resource.TestResourceWeights
Running org.apache.hadoop.yarn.server.resourcemanager.TestTokenClientRMService
Tests run: 6, Failures: 0, Errors: 0, Skipped: 0, Time elapsed: 1.462 sec - in org.apache.hadoop.yarn.server.resourcemanager.TestTokenClientRMService
Running org.apache.hadoop.yarn.server.resourcemanager.ahs.TestRMApplicationHistoryWriter
Tests run: 7, Failures: 0, Errors: 0, Skipped: 0, Time elapsed: 152.163 sec - in org.apache.hadoop.yarn.server.resourcemanager.ahs.TestRMApplicationHistoryWriter
Running org.apache.hadoop.yarn.server.resourcemanager.webapp.TestAppPage
Tests run: 1, Failures: 0, Errors: 0, Skipped: 0, Time elapsed: 2.476 sec - in org.apache.hadoop.yarn.server.resourcemanager.webapp.TestAppPage
Running org.apache.hadoop.yarn.server.resourcemanager.webapp.TestRMWebApp
Tests run: 3, Failures: 0, Errors: 0, Skipped: 0, Time elapsed: 7.772 sec - in org.apache.hadoop.yarn.server.resourcemanager.webapp.TestRMWebApp
Running org.apache.hadoop.yarn.server.resourcemanager.webapp.TestRMWebServicesCapacitySched
Tests run: 7, Failures: 0, Errors: 0, Skipped: 0, Time elapsed: 8.481 sec - in org.apache.hadoop.yarn.server.resourcemanager.webapp.TestRMWebServicesCapacitySched
Running org.apache.hadoop.yarn.server.resourcemanager.webapp.TestRMWebServicesNodes
Tests run: 23, Failures: 0, Errors: 0, Skipped: 0, Time elapsed: 15.368 sec - in org.apache.hadoop.yarn.server.resourcemanager.webapp.TestRMWebServicesNodes
Running org.apache.hadoop.yarn.server.resourcemanager.webapp.TestRMWebServicesReservation
Tests run: 72, Failures: 0, Errors: 0, Skipped: 0, Time elapsed: 246.152 sec - in org.apache.hadoop.yarn.server.resourcemanager.webapp.TestRMWebServicesReservation
Running org.apache.hadoop.yarn.server.resourcemanager.webapp.TestRMWebServices
Tests run: 20, Failures: 0, Errors: 0, Skipped: 0, Time elapsed: 14.969 sec - in org.apache.hadoop.yarn.server.resourcemanager.webapp.TestRMWebServices
Running org.apache.hadoop.yarn.server.resourcemanager.webapp.TestRMWebServicesForCSWithPartitions
Tests run: 4, Failures: 0, Errors: 0, Skipped: 0, Time elapsed: 6.706 sec - in org.apache.hadoop.yarn.server.resourcemanager.webapp.TestRMWebServicesForCSWithPartitions
Running org.apache.hadoop.yarn.server.resourcemanager.webapp.TestRMWebServicesApps
Tests run: 40, Failures: 0, Errors: 0, Skipped: 0, Time elapsed: 25.101 sec - in org.apache.hadoop.yarn.server.resourcemanager.webapp.TestRMWebServicesApps
Running org.apache.hadoop.yarn.server.resourcemanager.webapp.TestRMWebServicesHttpStaticUserPermissions
Tests run: 1, Failures: 0, Errors: 0, Skipped: 0, Time elapsed: 8.988 sec - in org.apache.hadoop.yarn.server.resourcemanager.webapp.TestRMWebServicesHttpStaticUserPermissions
Running org.apache.hadoop.yarn.server.resourcemanager.webapp.TestRMWebServicesAppsModification
Tests run: 44, Failures: 0, Errors: 0, Skipped: 0, Time elapsed: 35.884 sec - in org.apache.hadoop.yarn.server.resourcemanager.webapp.TestRMWebServicesAppsModification
Running org.apache.hadoop.yarn.server.resourcemanager.webapp.TestRMWebServicesDelegationTokenAuthentication
Tests run: 8, Failures: 0, Errors: 0, Skipped: 0, Time elapsed: 10.606 sec - in org.apache.hadoop.yarn.server.resourcemanager.webapp.TestRMWebServicesDelegationTokenAuthentication
Running org.apache.hadoop.yarn.server.resourcemanager.webapp.TestRMWebServicesNodeLabels
Tests run: 5, Failures: 0, Errors: 0, Skipped: 0, Time elapsed: 7.099 sec - in org.apache.hadoop.yarn.server.resourcemanager.webapp.TestRMWebServicesNodeLabels
Running org.apache.hadoop.yarn.server.resourcemanager.webapp.TestRMWebappAuthentication
Tests run: 2, Failures: 0, Errors: 0, Skipped: 0, Time elapsed: 11.637 sec - in org.apache.hadoop.yarn.server.resourcemanager.webapp.TestRMWebappAuthentication
Running org.apache.hadoop.yarn.server.resourcemanager.webapp.dao.TestFairSchedulerQueueInfo
Tests run: 1, Failures: 0, Errors: 0, Skipped: 0, Time elapsed: 1.081 sec - in org.apache.hadoop.yarn.server.resourcemanager.webapp.dao.TestFairSchedulerQueueInfo
Running org.apache.hadoop.yarn.server.resourcemanager.webapp.TestNodesPage
Tests run: 5, Failures: 0, Errors: 0, Skipped: 0, Time elapsed: 5.068 sec - in org.apache.hadoop.yarn.server.resourcemanager.webapp.TestNodesPage
Running org.apache.hadoop.yarn.server.resourcemanager.webapp.TestRMWebAppFairScheduler
Tests run: 2, Failures: 0, Errors: 0, Skipped: 0, Time elapsed: 6.146 sec - in org.apache.hadoop.yarn.server.resourcemanager.webapp.TestRMWebAppFairScheduler
Running org.apache.hadoop.yarn.server.resourcemanager.webapp.TestRMWebServicesFairScheduler
Tests run: 3, Failures: 0, Errors: 0, Skipped: 0, Time elapsed: 5.6 sec - in org.apache.hadoop.yarn.server.resourcemanager.webapp.TestRMWebServicesFairScheduler
Running org.apache.hadoop.yarn.server.resourcemanager.webapp.TestRMWebServicesDelegationTokens
Tests run: 6, Failures: 0, Errors: 0, Skipped: 0, Time elapsed: 46.931 sec - in org.apache.hadoop.yarn.server.resourcemanager.webapp.TestRMWebServicesDelegationTokens
Running org.apache.hadoop.yarn.server.resourcemanager.TestClientRMTokens
Tests run: 6, Failures: 0, Errors: 0, Skipped: 0, Time elapsed: 18.135 sec - in org.apache.hadoop.yarn.server.resourcemanager.TestClientRMTokens
Running org.apache.hadoop.yarn.server.resourcemanager.TestAppManager
Tests run: 15, Failures: 0, Errors: 0, Skipped: 0, Time elapsed: 7.662 sec - in org.apache.hadoop.yarn.server.resourcemanager.TestAppManager
Running org.apache.hadoop.yarn.server.resourcemanager.TestResourceTrackerService
Tests run: 29, Failures: 0, Errors: 0, Skipped: 0, Time elapsed: 29.65 sec - in org.apache.hadoop.yarn.server.resourcemanager.TestResourceTrackerService
Running org.apache.hadoop.yarn.server.resourcemanager.placement.TestUserGroupMappingPlacementRule
Tests run: 1, Failures: 0, Errors: 0, Skipped: 0, Time elapsed: 0.974 sec - in org.apache.hadoop.yarn.server.resourcemanager.placement.TestUserGroupMappingPlacementRule
Running org.apache.hadoop.yarn.server.resourcemanager.rmcontainer.TestRMContainerImpl
Tests run: 5, Failures: 0, Errors: 0, Skipped: 0, Time elapsed: 3.875 sec - in org.apache.hadoop.yarn.server.resourcemanager.rmcontainer.TestRMContainerImpl
Running org.apache.hadoop.yarn.server.resourcemanager.TestApplicationMasterService
Tests run: 8, Failures: 0, Errors: 0, Skipped: 0, Time elapsed: 10.524 sec - in org.apache.hadoop.yarn.server.resourcemanager.TestApplicationMasterService
Running org.apache.hadoop.yarn.server.resourcemanager.TestRMRestart
Tests run: 28, Failures: 0, Errors: 0, Skipped: 0, Time elapsed: 67.066 sec - in org.apache.hadoop.yarn.server.resourcemanager.TestRMRestart
Running org.apache.hadoop.yarn.webapp.TestRMWithCSRFFilter
Tests run: 4, Failures: 0, Errors: 0, Skipped: 0, Time elapsed: 6.228 sec - in org.apache.hadoop.yarn.webapp.TestRMWithCSRFFilter

Results :

Failed tests: 
  TestContainerResourceUsage.testUsageAfterAMRestartWithMultipleContainers:252->amRestartTests:395 Unexcpected MemorySeconds value expected:<-1498011024470> but was:<2114>
  TestCapacityScheduler.testPreemptionInfo:1187 Attempt state is not correct (timeout). expected:<ALLOCATED> but was:<SCHEDULED>
  TestCapacityScheduler.testParentQueueMaxCapsAreRespected:2693 Attempt state is not correct (timeout). expected:<ALLOCATED> but was:<SCHEDULED>
  TestCapacityScheduler.testPendingResourceUpdatedAccordingToIncreaseRequestChanges:3150 Attempt state is not correct (timeout). expected:<ALLOCATED> but was:<SCHEDULED>
  TestCapacityScheduler.testResourceOverCommit:828 Attempt state is not correct (timeout). expected:<ALLOCATED> but was:<SCHEDULED>
  TestCapacityScheduler.testKillAllAppsInQueue:2128 App State is not correct (timeout). expected:<KILLED> but was:<KILLING>
  TestCapacityScheduler.testHierarchyQueuesCurrentLimits:2610 Attempt state is not correct (timeout). expected:<ALLOCATED> but was:<SCHEDULED>

Tests in error: 
  TestCapacityScheduler.testRecoverRequestAfterPreemption:1253 »  test timed out...
  TestCapacityScheduler.testAppReservationWithDominantResourceCalculator:2212 » 
  TestCapacityScheduler.testBlackListNodes:664 » NoClassDefFound org/apache/hado...
  TestCapacityScheduler.testMoveAppViolateQueueState »  Unexpected exception, ex...
  TestCapacityScheduler.testAllocateDoesNotBlockOnSchedulerLock:1033 » NoClassDefFound
  TestCapacityScheduler.testCapacityScheduler:328 » NoClassDefFound org/apache/h...
  TestCapacityScheduler.testMoveAppSuccess:1636 » NoClassDefFound org/apache/had...
  TestCapacityScheduler.testResourceUpdateDecommissioningNode:3351 » NoClassDefFound
  TestCapacityScheduler.testMoveAppForMoveToQueueWithFreeCap:1512 » NoClassDefFound
  TestCapacityScheduler.testAllocateReorder:729 » NoClassDefFound org/apache/had...
  TestCapacityScheduler.testMoveAppQueueMetricsCheck:1876 » NoClassDefFound org/...
  TestCapacityScheduler.testQueueHierarchyPendingResourceUpdate:2727 » NoClassDefFound
  TestCapacityScheduler.testHeadRoomCalculationWithDRC:3000 » NoClassDefFound or...
  TestCapacityScheduler.testApplicationHeadRoom:2918 » NoClassDefFound org/apach...

Tests run: 1399, Failures: 7, Errors: 14, Skipped: 3

[INFO] ------------------------------------------------------------------------
[INFO] Reactor Summary:
[INFO] 
[INFO] Apache Hadoop YARN ................................ SUCCESS [  3.804 s]
[INFO] Apache Hadoop YARN API ............................ SUCCESS [04:40 min]
[INFO] Apache Hadoop YARN Common ......................... SUCCESS [03:26 min]
[INFO] Apache Hadoop YARN Server ......................... SUCCESS [  0.097 s]
[INFO] Apache Hadoop YARN Server Common .................. SUCCESS [ 57.380 s]
[INFO] Apache Hadoop YARN NodeManager .................... SUCCESS [12:24 min]
[INFO] Apache Hadoop YARN Web Proxy ...................... SUCCESS [ 25.205 s]
[INFO] Apache Hadoop YARN ApplicationHistoryService ...... SUCCESS [03:29 min]
[INFO] Apache Hadoop YARN ResourceManager ................ FAILURE [36:55 min]
[INFO] Apache Hadoop YARN Server Tests ................... SKIPPED
[INFO] Apache Hadoop YARN Client ......................... SKIPPED
[INFO] Apache Hadoop YARN SharedCacheManager ............. SKIPPED
[INFO] Apache Hadoop YARN Timeline Plugin Storage ........ SKIPPED
[INFO] Apache Hadoop YARN Applications ................... SKIPPED
[INFO] Apache Hadoop YARN DistributedShell ............... SKIPPED
[INFO] Apache Hadoop YARN Unmanaged Am Launcher .......... SKIPPED
[INFO] Apache Hadoop YARN Site ........................... SKIPPED
[INFO] Apache Hadoop YARN Registry ....................... SKIPPED
[INFO] Apache Hadoop YARN Project ........................ SKIPPED
[INFO] ------------------------------------------------------------------------
[INFO] BUILD FAILURE
[INFO] ------------------------------------------------------------------------
[INFO] Total time: 01:02 h
[INFO] Finished at: 2016-05-10T18:05:19+00:00
[INFO] Final Memory: 60M/483M
[INFO] ------------------------------------------------------------------------
[ERROR] Failed to execute goal org.apache.maven.plugins:maven-surefire-plugin:2.17:test (default-test) on project hadoop-yarn-server-resourcemanager: There are test failures.
[ERROR] 
[ERROR] Please refer to <https://builds.apache.org/job/Hadoop-Yarn-trunk/ws/hadoop-yarn-project/hadoop-yarn/hadoop-yarn-server/hadoop-yarn-server-resourcemanager/target/surefire-reports> for the individual test results.
[ERROR] -> [Help 1]
[ERROR] 
[ERROR] To see the full stack trace of the errors, re-run Maven with the -e switch.
[ERROR] Re-run Maven using the -X switch to enable full debug logging.
[ERROR] 
[ERROR] For more information about the errors and possible solutions, please read the following articles:
[ERROR] [Help 1] http://cwiki.apache.org/confluence/display/MAVEN/MojoFailureException
[ERROR] 
[ERROR] After correcting the problems, you can resume the build with the command
[ERROR]   mvn <goals> -rf :hadoop-yarn-server-resourcemanager
Build step 'Execute shell' marked build as failure
Archiving artifacts
Recording test results

---------------------------------------------------------------------
To unsubscribe, e-mail: yarn-dev-unsubscribe@hadoop.apache.org
For additional commands, e-mail: yarn-dev-help@hadoop.apache.org