You are viewing a plain text version of this content. The canonical link for it is here.
Posted to hdfs-dev@hadoop.apache.org by Apache Jenkins Server <je...@builds.apache.org> on 2011/06/16 01:39:45 UTC
Hadoop-Hdfs-22-branch - Build # 68 - Failure
See https://builds.apache.org/job/Hadoop-Hdfs-22-branch/68/
###################################################################################
########################## LAST 60 LINES OF THE CONSOLE ###########################
[...truncated 3058 lines...]
compile-hdfs-test:
[delete] Deleting directory /grid/0/hudson/hudson-slave/workspace/Hadoop-Hdfs-22-branch/trunk/build-fi/test/cache
[mkdir] Created dir: /grid/0/hudson/hudson-slave/workspace/Hadoop-Hdfs-22-branch/trunk/build-fi/test/cache
[copy] Copying 1 file to /grid/0/hudson/hudson-slave/workspace/Hadoop-Hdfs-22-branch/trunk/build-fi/test/cache
[copy] Copying 1 file to /grid/0/hudson/hudson-slave/workspace/Hadoop-Hdfs-22-branch/trunk/build-fi/test/cache
[copy] Copying 1 file to /grid/0/hudson/hudson-slave/workspace/Hadoop-Hdfs-22-branch/trunk/build-fi/test/cache
[copy] Copying 1 file to /grid/0/hudson/hudson-slave/workspace/Hadoop-Hdfs-22-branch/trunk/build-fi/test/cache
[copy] Copying 1 file to /grid/0/hudson/hudson-slave/workspace/Hadoop-Hdfs-22-branch/trunk/build-fi/test/cache
[copy] Copying 1 file to /grid/0/hudson/hudson-slave/workspace/Hadoop-Hdfs-22-branch/trunk/build-fi/test/cache
[copy] Copying 1 file to /grid/0/hudson/hudson-slave/workspace/Hadoop-Hdfs-22-branch/trunk/build-fi/test/cache
[copy] Copying 1 file to /grid/0/hudson/hudson-slave/workspace/Hadoop-Hdfs-22-branch/trunk/build-fi/test/cache
[copy] Copying 1 file to /grid/0/hudson/hudson-slave/workspace/Hadoop-Hdfs-22-branch/trunk/build-fi/test/cache
[copy] Copying 1 file to /grid/0/hudson/hudson-slave/workspace/Hadoop-Hdfs-22-branch/trunk/build-fi/test/cache
run-test-hdfs-excluding-commit-and-smoke:
[mkdir] Created dir: /grid/0/hudson/hudson-slave/workspace/Hadoop-Hdfs-22-branch/trunk/build-fi/test/data
[mkdir] Created dir: /grid/0/hudson/hudson-slave/workspace/Hadoop-Hdfs-22-branch/trunk/build-fi/test/logs
[copy] Copying 1 file to /grid/0/hudson/hudson-slave/workspace/Hadoop-Hdfs-22-branch/trunk/build-fi/test/extraconf
[copy] Copying 1 file to /grid/0/hudson/hudson-slave/workspace/Hadoop-Hdfs-22-branch/trunk/build-fi/test/extraconf
[junit] WARNING: multiple versions of ant detected in path for junit
[junit] jar:file:/homes/hudson/tools/ant/latest/lib/ant.jar!/org/apache/tools/ant/Project.class
[junit] and jar:file:/homes/hudson/.ivy2/cache/ant/ant/jars/ant-1.6.5.jar!/org/apache/tools/ant/Project.class
[junit] Running org.apache.hadoop.fs.TestFiListPath
[junit] Tests run: 2, Failures: 0, Errors: 0, Time elapsed: 2.22 sec
[junit] Running org.apache.hadoop.fs.TestFiRename
[junit] Tests run: 4, Failures: 0, Errors: 0, Time elapsed: 5.805 sec
[junit] Running org.apache.hadoop.hdfs.TestFiHFlush
[junit] Tests run: 9, Failures: 0, Errors: 0, Time elapsed: 15.67 sec
[junit] Running org.apache.hadoop.hdfs.TestFiHftp
[junit] Tests run: 1, Failures: 0, Errors: 0, Time elapsed: 44.623 sec
[junit] Running org.apache.hadoop.hdfs.TestFiPipelines
[junit] Tests run: 3, Failures: 0, Errors: 0, Time elapsed: 5.397 sec
[junit] Running org.apache.hadoop.hdfs.server.datanode.TestFiDataTransferProtocol
[junit] Tests run: 29, Failures: 0, Errors: 0, Time elapsed: 210.008 sec
[junit] Running org.apache.hadoop.hdfs.server.datanode.TestFiDataTransferProtocol2
[junit] Tests run: 10, Failures: 0, Errors: 0, Time elapsed: 326.771 sec
[junit] Running org.apache.hadoop.hdfs.server.datanode.TestFiPipelineClose
[junit] Tests run: 3, Failures: 0, Errors: 0, Time elapsed: 35.44 sec
checkfailure:
-run-test-hdfs-fault-inject-withtestcaseonly:
run-test-hdfs-fault-inject:
BUILD FAILED
/grid/0/hudson/hudson-slave/workspace/Hadoop-Hdfs-22-branch/trunk/build.xml:747: Tests failed!
Total time: 65 minutes 45 seconds
[FINDBUGS] Skipping publisher since build result is FAILURE
Archiving artifacts
Publishing Clover coverage report...
No Clover report will be published due to a Build Failure
Recording test results
Publishing Javadoc
Recording fingerprints
Email was triggered for: Failure
Sending email for trigger: Failure
###################################################################################
############################## FAILED TESTS (if any) ##############################
2 tests failed.
REGRESSION: org.apache.hadoop.hdfs.server.balancer.TestBalancer.testBalancer0
Error Message:
127.0.0.1:33506is not an underUtilized node
Stack Trace:
junit.framework.AssertionFailedError: 127.0.0.1:33506is not an underUtilized node
at org.apache.hadoop.hdfs.server.balancer.Balancer.initNodes(Balancer.java:1011)
at org.apache.hadoop.hdfs.server.balancer.Balancer.initNodes(Balancer.java:953)
at org.apache.hadoop.hdfs.server.balancer.Balancer.run(Balancer.java:1496)
at org.apache.hadoop.hdfs.server.balancer.TestBalancer.runBalancer(TestBalancer.java:247)
at org.apache.hadoop.hdfs.server.balancer.TestBalancer.test(TestBalancer.java:234)
at org.apache.hadoop.hdfs.server.balancer.TestBalancer.oneNodeTest(TestBalancer.java:307)
at org.apache.hadoop.hdfs.server.balancer.TestBalancer.__CLR3_0_29j3j5bwxx(TestBalancer.java:327)
at org.apache.hadoop.hdfs.server.balancer.TestBalancer.testBalancer0(TestBalancer.java:324)
REGRESSION: org.apache.hadoop.hdfs.server.namenode.TestBlockTokenWithDFS.testEnd2End
Error Message:
127.0.0.1:60685is not an underUtilized node
Stack Trace:
junit.framework.AssertionFailedError: 127.0.0.1:60685is not an underUtilized node
at org.apache.hadoop.hdfs.server.balancer.Balancer.initNodes(Balancer.java:1011)
at org.apache.hadoop.hdfs.server.balancer.Balancer.initNodes(Balancer.java:953)
at org.apache.hadoop.hdfs.server.balancer.Balancer.run(Balancer.java:1496)
at org.apache.hadoop.hdfs.server.balancer.TestBalancer.runBalancer(TestBalancer.java:247)
at org.apache.hadoop.hdfs.server.balancer.TestBalancer.test(TestBalancer.java:234)
at org.apache.hadoop.hdfs.server.balancer.TestBalancer.oneNodeTest(TestBalancer.java:307)
at org.apache.hadoop.hdfs.server.balancer.TestBalancer.integrationTest(TestBalancer.java:319)
at org.apache.hadoop.hdfs.server.namenode.TestBlockTokenWithDFS.__CLR3_0_2wspf0n12hn(TestBlockTokenWithDFS.java:529)
at org.apache.hadoop.hdfs.server.namenode.TestBlockTokenWithDFS.testEnd2End(TestBlockTokenWithDFS.java:526)
Hadoop-Hdfs-22-branch - Build # 70 - Still Failing
Posted by Apache Jenkins Server <je...@builds.apache.org>.
See https://builds.apache.org/job/Hadoop-Hdfs-22-branch/70/
###################################################################################
########################## LAST 60 LINES OF THE CONSOLE ###########################
[...truncated 3098 lines...]
[mkdir] Created dir: /grid/0/hudson/hudson-slave/workspace/Hadoop-Hdfs-22-branch/trunk/build-fi/test/cache
[copy] Copying 1 file to /grid/0/hudson/hudson-slave/workspace/Hadoop-Hdfs-22-branch/trunk/build-fi/test/cache
[copy] Copying 1 file to /grid/0/hudson/hudson-slave/workspace/Hadoop-Hdfs-22-branch/trunk/build-fi/test/cache
[copy] Copying 1 file to /grid/0/hudson/hudson-slave/workspace/Hadoop-Hdfs-22-branch/trunk/build-fi/test/cache
[copy] Copying 1 file to /grid/0/hudson/hudson-slave/workspace/Hadoop-Hdfs-22-branch/trunk/build-fi/test/cache
[copy] Copying 1 file to /grid/0/hudson/hudson-slave/workspace/Hadoop-Hdfs-22-branch/trunk/build-fi/test/cache
[copy] Copying 1 file to /grid/0/hudson/hudson-slave/workspace/Hadoop-Hdfs-22-branch/trunk/build-fi/test/cache
[copy] Copying 1 file to /grid/0/hudson/hudson-slave/workspace/Hadoop-Hdfs-22-branch/trunk/build-fi/test/cache
[copy] Copying 1 file to /grid/0/hudson/hudson-slave/workspace/Hadoop-Hdfs-22-branch/trunk/build-fi/test/cache
[copy] Copying 1 file to /grid/0/hudson/hudson-slave/workspace/Hadoop-Hdfs-22-branch/trunk/build-fi/test/cache
[copy] Copying 1 file to /grid/0/hudson/hudson-slave/workspace/Hadoop-Hdfs-22-branch/trunk/build-fi/test/cache
run-test-hdfs-excluding-commit-and-smoke:
[mkdir] Created dir: /grid/0/hudson/hudson-slave/workspace/Hadoop-Hdfs-22-branch/trunk/build-fi/test/data
[mkdir] Created dir: /grid/0/hudson/hudson-slave/workspace/Hadoop-Hdfs-22-branch/trunk/build-fi/test/logs
[copy] Copying 1 file to /grid/0/hudson/hudson-slave/workspace/Hadoop-Hdfs-22-branch/trunk/build-fi/test/extraconf
[copy] Copying 1 file to /grid/0/hudson/hudson-slave/workspace/Hadoop-Hdfs-22-branch/trunk/build-fi/test/extraconf
[junit] WARNING: multiple versions of ant detected in path for junit
[junit] jar:file:/homes/hudson/tools/ant/latest/lib/ant.jar!/org/apache/tools/ant/Project.class
[junit] and jar:file:/homes/hudson/.ivy2/cache/ant/ant/jars/ant-1.6.5.jar!/org/apache/tools/ant/Project.class
[junit] Running org.apache.hadoop.fs.TestFiListPath
[junit] Tests run: 2, Failures: 0, Errors: 0, Time elapsed: 2.213 sec
[junit] Running org.apache.hadoop.fs.TestFiRename
[junit] Tests run: 4, Failures: 0, Errors: 0, Time elapsed: 5.579 sec
[junit] Running org.apache.hadoop.hdfs.TestFiHFlush
[junit] Tests run: 9, Failures: 0, Errors: 0, Time elapsed: 15.751 sec
[junit] Running org.apache.hadoop.hdfs.TestFiHftp
[junit] Tests run: 1, Failures: 0, Errors: 0, Time elapsed: 45.392 sec
[junit] Running org.apache.hadoop.hdfs.TestFiPipelines
[junit] Tests run: 3, Failures: 0, Errors: 0, Time elapsed: 5.456 sec
[junit] Running org.apache.hadoop.hdfs.server.datanode.TestFiDataTransferProtocol
[junit] Tests run: 29, Failures: 0, Errors: 0, Time elapsed: 210.077 sec
[junit] Running org.apache.hadoop.hdfs.server.datanode.TestFiDataTransferProtocol2
[junit] Tests run: 10, Failures: 0, Errors: 0, Time elapsed: 266.273 sec
[junit] Running org.apache.hadoop.hdfs.server.datanode.TestFiPipelineClose
[junit] Tests run: 3, Failures: 0, Errors: 0, Time elapsed: 35.771 sec
checkfailure:
-run-test-hdfs-fault-inject-withtestcaseonly:
run-test-hdfs-fault-inject:
BUILD FAILED
/grid/0/hudson/hudson-slave/workspace/Hadoop-Hdfs-22-branch/trunk/build.xml:747: Tests failed!
Total time: 64 minutes 29 seconds
[FINDBUGS] Skipping publisher since build result is FAILURE
Archiving artifacts
Publishing Clover coverage report...
No Clover report will be published due to a Build Failure
Recording test results
Publishing Javadoc
Recording fingerprints
Updating HDFS-2071
Updating HDFS-1952
Updating HDFS-941
Email was triggered for: Failure
Sending email for trigger: Failure
###################################################################################
############################## FAILED TESTS (if any) ##############################
1 tests failed.
REGRESSION: org.apache.hadoop.hdfs.server.namenode.TestBlockTokenWithDFS.testEnd2End
Error Message:
127.0.0.1:57795is not an underUtilized node
Stack Trace:
junit.framework.AssertionFailedError: 127.0.0.1:57795is not an underUtilized node
at org.apache.hadoop.hdfs.server.balancer.Balancer.initNodes(Balancer.java:1011)
at org.apache.hadoop.hdfs.server.balancer.Balancer.initNodes(Balancer.java:953)
at org.apache.hadoop.hdfs.server.balancer.Balancer.run(Balancer.java:1496)
at org.apache.hadoop.hdfs.server.balancer.TestBalancer.runBalancer(TestBalancer.java:247)
at org.apache.hadoop.hdfs.server.balancer.TestBalancer.test(TestBalancer.java:234)
at org.apache.hadoop.hdfs.server.balancer.TestBalancer.oneNodeTest(TestBalancer.java:307)
at org.apache.hadoop.hdfs.server.balancer.TestBalancer.integrationTest(TestBalancer.java:319)
at org.apache.hadoop.hdfs.server.namenode.TestBlockTokenWithDFS.__CLR3_0_2wspf0n12iq(TestBlockTokenWithDFS.java:529)
at org.apache.hadoop.hdfs.server.namenode.TestBlockTokenWithDFS.testEnd2End(TestBlockTokenWithDFS.java:526)
Hadoop-Hdfs-22-branch - Build # 69 - Still Failing
Posted by Apache Jenkins Server <je...@builds.apache.org>.
See https://builds.apache.org/job/Hadoop-Hdfs-22-branch/69/
###################################################################################
########################## LAST 60 LINES OF THE CONSOLE ###########################
[...truncated 3077 lines...]
compile-hdfs-test:
[delete] Deleting directory /grid/0/hudson/hudson-slave/workspace/Hadoop-Hdfs-22-branch/trunk/build-fi/test/cache
[mkdir] Created dir: /grid/0/hudson/hudson-slave/workspace/Hadoop-Hdfs-22-branch/trunk/build-fi/test/cache
[copy] Copying 1 file to /grid/0/hudson/hudson-slave/workspace/Hadoop-Hdfs-22-branch/trunk/build-fi/test/cache
[copy] Copying 1 file to /grid/0/hudson/hudson-slave/workspace/Hadoop-Hdfs-22-branch/trunk/build-fi/test/cache
[copy] Copying 1 file to /grid/0/hudson/hudson-slave/workspace/Hadoop-Hdfs-22-branch/trunk/build-fi/test/cache
[copy] Copying 1 file to /grid/0/hudson/hudson-slave/workspace/Hadoop-Hdfs-22-branch/trunk/build-fi/test/cache
[copy] Copying 1 file to /grid/0/hudson/hudson-slave/workspace/Hadoop-Hdfs-22-branch/trunk/build-fi/test/cache
[copy] Copying 1 file to /grid/0/hudson/hudson-slave/workspace/Hadoop-Hdfs-22-branch/trunk/build-fi/test/cache
[copy] Copying 1 file to /grid/0/hudson/hudson-slave/workspace/Hadoop-Hdfs-22-branch/trunk/build-fi/test/cache
[copy] Copying 1 file to /grid/0/hudson/hudson-slave/workspace/Hadoop-Hdfs-22-branch/trunk/build-fi/test/cache
[copy] Copying 1 file to /grid/0/hudson/hudson-slave/workspace/Hadoop-Hdfs-22-branch/trunk/build-fi/test/cache
[copy] Copying 1 file to /grid/0/hudson/hudson-slave/workspace/Hadoop-Hdfs-22-branch/trunk/build-fi/test/cache
run-test-hdfs-excluding-commit-and-smoke:
[mkdir] Created dir: /grid/0/hudson/hudson-slave/workspace/Hadoop-Hdfs-22-branch/trunk/build-fi/test/data
[mkdir] Created dir: /grid/0/hudson/hudson-slave/workspace/Hadoop-Hdfs-22-branch/trunk/build-fi/test/logs
[copy] Copying 1 file to /grid/0/hudson/hudson-slave/workspace/Hadoop-Hdfs-22-branch/trunk/build-fi/test/extraconf
[copy] Copying 1 file to /grid/0/hudson/hudson-slave/workspace/Hadoop-Hdfs-22-branch/trunk/build-fi/test/extraconf
[junit] WARNING: multiple versions of ant detected in path for junit
[junit] jar:file:/homes/hudson/tools/ant/latest/lib/ant.jar!/org/apache/tools/ant/Project.class
[junit] and jar:file:/homes/hudson/.ivy2/cache/ant/ant/jars/ant-1.6.5.jar!/org/apache/tools/ant/Project.class
[junit] Running org.apache.hadoop.fs.TestFiListPath
[junit] Tests run: 2, Failures: 0, Errors: 0, Time elapsed: 2.316 sec
[junit] Running org.apache.hadoop.fs.TestFiRename
[junit] Tests run: 4, Failures: 0, Errors: 0, Time elapsed: 5.378 sec
[junit] Running org.apache.hadoop.hdfs.TestFiHFlush
[junit] Tests run: 9, Failures: 0, Errors: 0, Time elapsed: 15.988 sec
[junit] Running org.apache.hadoop.hdfs.TestFiHftp
[junit] Tests run: 1, Failures: 0, Errors: 0, Time elapsed: 41.99 sec
[junit] Running org.apache.hadoop.hdfs.TestFiPipelines
[junit] Tests run: 3, Failures: 0, Errors: 0, Time elapsed: 5.869 sec
[junit] Running org.apache.hadoop.hdfs.server.datanode.TestFiDataTransferProtocol
[junit] Tests run: 29, Failures: 0, Errors: 0, Time elapsed: 211.356 sec
[junit] Running org.apache.hadoop.hdfs.server.datanode.TestFiDataTransferProtocol2
[junit] Tests run: 10, Failures: 0, Errors: 0, Time elapsed: 322.187 sec
[junit] Running org.apache.hadoop.hdfs.server.datanode.TestFiPipelineClose
[junit] Tests run: 3, Failures: 0, Errors: 0, Time elapsed: 35.8 sec
checkfailure:
-run-test-hdfs-fault-inject-withtestcaseonly:
run-test-hdfs-fault-inject:
BUILD FAILED
/grid/0/hudson/hudson-slave/workspace/Hadoop-Hdfs-22-branch/trunk/build.xml:747: Tests failed!
Total time: 111 minutes 4 seconds
[FINDBUGS] Skipping publisher since build result is FAILURE
Archiving artifacts
Publishing Clover coverage report...
No Clover report will be published due to a Build Failure
Recording test results
Publishing Javadoc
Recording fingerprints
Email was triggered for: Failure
Sending email for trigger: Failure
###################################################################################
############################## FAILED TESTS (if any) ##############################
2 tests failed.
REGRESSION: org.apache.hadoop.cli.TestHDFSCLI.testAll
Error Message:
Timeout occurred. Please note the time in the report does not reflect the time until the timeout.
Stack Trace:
junit.framework.AssertionFailedError: Timeout occurred. Please note the time in the report does not reflect the time until the timeout.
REGRESSION: org.apache.hadoop.hdfs.server.datanode.TestBlockRecovery.testErrorReplicas
Error Message:
Timeout occurred. Please note the time in the report does not reflect the time until the timeout.
Stack Trace:
junit.framework.AssertionFailedError: Timeout occurred. Please note the time in the report does not reflect the time until the timeout.