You are viewing a plain text version of this content. The canonical link for it is here.
Posted to notifications@maven.apache.org by Apache Jenkins Server <je...@builds.apache.org> on 2019/04/02 09:03:44 UTC

Build failed in Jenkins: Maven TLP » maven-surefire » 1546-1222 #1

See https://builds.apache.org/job/maven-box/job/maven-surefire/job/1546-1222/1/

No changes.

1 tests failed.
FAILED:  junit.framework.JUnit4TestCaseFacade.displayNamesIgnoredInReport

Error Message:
expected: <some display name> but was: <myNamedTestMethod>

Stack Trace:
org.opentest4j.AssertionFailedError: expected: <some display name> but was: <myNamedTestMethod>
	at org.junit.jupiter.api.AssertionUtils.fail(AssertionUtils.java:54)
	at org.junit.jupiter.api.AssertEquals.failNotEqual(AssertEquals.java:195)
	at org.junit.jupiter.api.AssertEquals.assertEquals(AssertEquals.java:184)
	at org.junit.jupiter.api.AssertEquals.assertEquals(AssertEquals.java:179)
	at org.junit.jupiter.api.Assertions.assertEquals(Assertions.java:508)
	at org.apache.maven.surefire.junitplatform.RunListenerAdapterTest.displayNamesIgnoredInReport(RunListenerAdapterTest.java:516)
	at sun.reflect.NativeMethodAccessorImpl.invoke0(Native Method)
	at sun.reflect.NativeMethodAccessorImpl.invoke(NativeMethodAccessorImpl.java:62)
	at sun.reflect.DelegatingMethodAccessorImpl.invoke(DelegatingMethodAccessorImpl.java:43)
	at java.lang.reflect.Method.invoke(Method.java:498)
	at org.junit.runners.model.FrameworkMethod$1.runReflectiveCall(FrameworkMethod.java:50)
	at org.junit.internal.runners.model.ReflectiveCallable.run(ReflectiveCallable.java:12)
	at org.junit.runners.model.FrameworkMethod.invokeExplosively(FrameworkMethod.java:47)
	at org.junit.internal.runners.statements.InvokeMethod.evaluate(InvokeMethod.java:17)
	at org.junit.internal.runners.statements.RunBefores.evaluate(RunBefores.java:26)
	at org.junit.runners.ParentRunner.runLeaf(ParentRunner.java:325)
	at org.junit.runners.BlockJUnit4ClassRunner.runChild(BlockJUnit4ClassRunner.java:78)
	at org.junit.runners.BlockJUnit4ClassRunner.runChild(BlockJUnit4ClassRunner.java:57)
	at org.junit.runners.ParentRunner$3.run(ParentRunner.java:290)
	at org.junit.runners.ParentRunner$1.schedule(ParentRunner.java:71)
	at org.junit.runners.ParentRunner.runChildren(ParentRunner.java:288)
	at org.junit.runners.ParentRunner.access$000(ParentRunner.java:58)
	at org.junit.runners.ParentRunner$2.evaluate(ParentRunner.java:268)
	at org.junit.runners.ParentRunner.run(ParentRunner.java:363)
	at org.junit.runners.Suite.runChild(Suite.java:128)
	at org.junit.runners.Suite.runChild(Suite.java:27)
	at org.junit.runners.ParentRunner$3.run(ParentRunner.java:290)
	at org.junit.runners.ParentRunner$1.schedule(ParentRunner.java:71)
	at org.junit.runners.ParentRunner.runChildren(ParentRunner.java:288)
	at org.junit.runners.ParentRunner.access$000(ParentRunner.java:58)
	at org.junit.runners.ParentRunner$2.evaluate(ParentRunner.java:268)
	at org.junit.runners.ParentRunner.run(ParentRunner.java:363)
	at junit.framework.JUnit4TestAdapter.run(JUnit4TestAdapter.java:38)
	at sun.reflect.NativeMethodAccessorImpl.invoke0(Native Method)
	at sun.reflect.NativeMethodAccessorImpl.invoke(NativeMethodAccessorImpl.java:62)
	at sun.reflect.DelegatingMethodAccessorImpl.invoke(DelegatingMethodAccessorImpl.java:43)
	at java.lang.reflect.Method.invoke(Method.java:498)
	at org.apache.maven.shadefire.surefire.junit.JUnitTestSet.execute(JUnitTestSet.java:99)
	at org.apache.maven.shadefire.surefire.junit.JUnit3Provider.executeTestSet(JUnit3Provider.java:140)
	at org.apache.maven.shadefire.surefire.junit.JUnit3Provider.invoke(JUnit3Provider.java:113)
	at org.apache.maven.shadefire.surefire.booter.ForkedBooter.invokeProviderInSameClassLoader(ForkedBooter.java:384)
	at org.apache.maven.shadefire.surefire.booter.ForkedBooter.runSuitesInProcess(ForkedBooter.java:345)
	at org.apache.maven.shadefire.surefire.booter.ForkedBooter.execute(ForkedBooter.java:126)
	at org.apache.maven.shadefire.surefire.booter.ForkedBooter.main(ForkedBooter.java:418)




Build log:
[...truncated 32450 lines...]
[2019-04-02T09:03:31.272Z] [INFO] Exclude: .repository/**
[2019-04-02T09:03:31.272Z] [INFO] Exclude: .maven/spy.log
[2019-04-02T09:03:31.272Z] [INFO] Exclude: dependency-reduced-pom.xml
[2019-04-02T09:03:31.272Z] [INFO] Exclude: .java-version
[2019-04-02T09:03:31.272Z] [INFO] Exclude: Jenkinsfile
[2019-04-02T09:03:31.272Z] [INFO] Exclude: README.md
[2019-04-02T09:03:31.272Z] [INFO] Exclude: .gitignore
[2019-04-02T09:03:31.272Z] [INFO] Exclude: .git/**/*
[2019-04-02T09:03:31.272Z] [INFO] Exclude: **/.idea
[2019-04-02T09:03:31.273Z] [INFO] Exclude: **/.svn/**/*
[2019-04-02T09:03:31.273Z] [INFO] Exclude: **/*.iml
[2019-04-02T09:03:31.273Z] [INFO] Exclude: **/*.ipr
[2019-04-02T09:03:31.273Z] [INFO] Exclude: **/*.iws
[2019-04-02T09:03:31.273Z] [INFO] Exclude: **/*.versionsBackup
[2019-04-02T09:03:31.273Z] [INFO] Exclude: **/dependency-reduced-pom.xml
[2019-04-02T09:03:31.273Z] [INFO] Exclude: .repository/**
[2019-04-02T09:03:31.273Z] [INFO] Exclude: src/test/resources/**/*
[2019-04-02T09:03:31.273Z] [INFO] Exclude: src/test/resources/**/*.css
[2019-04-02T09:03:31.273Z] [INFO] Exclude: **/*.jj
[2019-04-02T09:03:31.273Z] [INFO] Exclude: src/main/resources/META-INF/services/org.apache.maven.surefire.providerapi.SurefireProvider
[2019-04-02T09:03:31.273Z] [INFO] Exclude: DEPENDENCIES
[2019-04-02T09:03:31.273Z] [INFO] Exclude: .m2/**
[2019-04-02T09:03:31.273Z] [INFO] Exclude: .m2
[2019-04-02T09:03:31.273Z] [INFO] Exclude: .travis.yml
[2019-04-02T09:03:31.273Z] [INFO] 10 resources included (use -debug for more details)
[2019-04-02T09:03:31.603Z] [INFO] Rat check: Summary over all files. Unapproved: 0, unknown: 0, generated: 0, approved: 10 licenses.
[2019-04-02T09:03:31.603Z] [INFO] 
[2019-04-02T09:03:31.603Z] [INFO] --- jacoco-maven-plugin:0.8.3:prepare-agent (jacoco-agent) @ surefire-junit-platform ---
[2019-04-02T09:03:31.603Z] [INFO] Skipping JaCoCo execution because property jacoco.skip is set.
[2019-04-02T09:03:31.603Z] [INFO] jacoco.agent set to empty
[2019-04-02T09:03:31.603Z] [INFO] 
[2019-04-02T09:03:31.603Z] [INFO] --- maven-compiler-plugin:3.7.0:compile (compile-generated) @ surefire-junit-platform ---
[2019-04-02T09:03:31.603Z] [INFO] Nothing to compile - all classes are up to date
[2019-04-02T09:03:31.603Z] [INFO] 
[2019-04-02T09:03:31.603Z] [INFO] --- maven-remote-resources-plugin:1.5:process (process-resource-bundles) @ surefire-junit-platform ---
[2019-04-02T09:03:31.603Z] [INFO] 
[2019-04-02T09:03:31.603Z] [INFO] --- maven-resources-plugin:3.1.0:resources (default-resources) @ surefire-junit-platform ---
[2019-04-02T09:03:31.603Z] [INFO] Using 'UTF-8' encoding to copy filtered resources.
[2019-04-02T09:03:31.603Z] [INFO] Copying 1 resource
[2019-04-02T09:03:31.603Z] [INFO] Copying 3 resources
[2019-04-02T09:03:31.603Z] [INFO] 
[2019-04-02T09:03:31.603Z] [INFO] --- maven-compiler-plugin:3.7.0:compile (default-compile) @ surefire-junit-platform ---
[2019-04-02T09:03:31.603Z] [INFO] Changes detected - recompiling the module!
[2019-04-02T09:03:31.603Z] [INFO] Compiling 4 source files to C:\Users\jenkins\AppData\Local\Temp\2\jenkins-maven-box-maven-surefire-1546-1222-1\surefire-providers\surefire-junit-platform\target\classes
[2019-04-02T09:03:34.444Z] [INFO] 
[2019-04-02T09:03:34.444Z] [INFO] --- animal-sniffer-maven-plugin:1.17:check (signature-check) @ surefire-junit-platform ---
[2019-04-02T09:03:34.444Z] [INFO] Checking unresolved references to org.codehaus.mojo.signature:java18:1.0
[2019-04-02T09:03:34.444Z] [INFO] Downloading from central: https://repo.maven.apache.org/maven2/org/codehaus/mojo/signature/java18/1.0/java18-1.0.signature
[2019-04-02T09:03:34.444Z] [INFO] Downloaded from central: https://repo.maven.apache.org/maven2/org/codehaus/mojo/signature/java18/1.0/java18-1.0.signature (2.0 MB at 7.4 MB/s)
[2019-04-02T09:03:35.547Z] [INFO] 
[2019-04-02T09:03:35.547Z] [INFO] --- maven-resources-plugin:3.1.0:testResources (default-testResources) @ surefire-junit-platform ---
[2019-04-02T09:03:35.548Z] [INFO] Using 'UTF-8' encoding to copy filtered resources.
[2019-04-02T09:03:35.548Z] [INFO] skip non existing resourceDirectory C:\Users\jenkins\AppData\Local\Temp\2\jenkins-maven-box-maven-surefire-1546-1222-1\surefire-providers\surefire-junit-platform\src\test\resources
[2019-04-02T09:03:35.548Z] [INFO] Copying 3 resources
[2019-04-02T09:03:35.548Z] [INFO] 
[2019-04-02T09:03:35.548Z] [INFO] --- maven-compiler-plugin:3.7.0:testCompile (default-testCompile) @ surefire-junit-platform ---
[2019-04-02T09:03:35.548Z] [INFO] Changes detected - recompiling the module!
[2019-04-02T09:03:35.548Z] [INFO] Compiling 5 source files to C:\Users\jenkins\AppData\Local\Temp\2\jenkins-maven-box-maven-surefire-1546-1222-1\surefire-providers\surefire-junit-platform\target\test-classes
[2019-04-02T09:03:39.142Z] [INFO] 
[2019-04-02T09:03:39.142Z] [INFO] --- maven-surefire-plugin:3.0.0-M3:test (default-test) @ surefire-junit-platform ---
[2019-04-02T09:03:39.142Z] [INFO] Surefire report directory: C:\Users\jenkins\AppData\Local\Temp\2\jenkins-maven-box-maven-surefire-1546-1222-1\surefire-providers\surefire-junit-platform\target\surefire-reports
[2019-04-02T09:03:39.142Z] [INFO] Using configured provider org.apache.maven.shadefire.surefire.junit.JUnit3Provider
[2019-04-02T09:03:39.142Z] [INFO] parallel='none', perCoreThreadCount=true, threadCount=0, useUnlimitedThreads=false, threadCountSuites=0, threadCountClasses=0, threadCountMethods=0, parallelOptimized=true
[2019-04-02T09:03:39.142Z] [INFO] 
[2019-04-02T09:03:39.142Z] [INFO] -------------------------------------------------------
[2019-04-02T09:03:39.142Z] [INFO]  T E S T S
[2019-04-02T09:03:39.142Z] [INFO] -------------------------------------------------------
[2019-04-02T09:03:39.813Z] [INFO] Running org.apache.maven.surefire.junitplatform.JUnit47SuiteTest
[2019-04-02T09:03:42.566Z] [ERROR] Tests run: 54, Failures: 0, Errors: 1, Skipped: 0, Time elapsed: 2.884 s <<< FAILURE! - in org.apache.maven.surefire.junitplatform.JUnit47SuiteTest
[2019-04-02T09:03:42.567Z] [ERROR] displayNamesIgnoredInReport(org.apache.maven.surefire.junitplatform.RunListenerAdapterTest)  Time elapsed: 0.022 s  <<< ERROR!
[2019-04-02T09:03:42.567Z] org.opentest4j.AssertionFailedError: expected: <some display name> but was: <myNamedTestMethod>
[2019-04-02T09:03:42.567Z] 	at org.junit.jupiter.api.AssertionUtils.fail(AssertionUtils.java:54)
[2019-04-02T09:03:42.567Z] 	at org.junit.jupiter.api.AssertEquals.failNotEqual(AssertEquals.java:195)
[2019-04-02T09:03:42.567Z] 	at org.junit.jupiter.api.AssertEquals.assertEquals(AssertEquals.java:184)
[2019-04-02T09:03:42.567Z] 	at org.junit.jupiter.api.AssertEquals.assertEquals(AssertEquals.java:179)
[2019-04-02T09:03:42.567Z] 	at org.junit.jupiter.api.Assertions.assertEquals(Assertions.java:508)
[2019-04-02T09:03:42.567Z] 	at org.apache.maven.surefire.junitplatform.RunListenerAdapterTest.displayNamesIgnoredInReport(RunListenerAdapterTest.java:516)
[2019-04-02T09:03:42.567Z] 	at sun.reflect.NativeMethodAccessorImpl.invoke0(Native Method)
[2019-04-02T09:03:42.567Z] 	at sun.reflect.NativeMethodAccessorImpl.invoke(NativeMethodAccessorImpl.java:62)
[2019-04-02T09:03:42.567Z] 	at sun.reflect.DelegatingMethodAccessorImpl.invoke(DelegatingMethodAccessorImpl.java:43)
[2019-04-02T09:03:42.567Z] 	at java.lang.reflect.Method.invoke(Method.java:498)
[2019-04-02T09:03:42.567Z] 	at org.junit.runners.model.FrameworkMethod$1.runReflectiveCall(FrameworkMethod.java:50)
[2019-04-02T09:03:42.567Z] 	at org.junit.internal.runners.model.ReflectiveCallable.run(ReflectiveCallable.java:12)
[2019-04-02T09:03:42.567Z] 	at org.junit.runners.model.FrameworkMethod.invokeExplosively(FrameworkMethod.java:47)
[2019-04-02T09:03:42.567Z] 	at org.junit.internal.runners.statements.InvokeMethod.evaluate(InvokeMethod.java:17)
[2019-04-02T09:03:42.567Z] 	at org.junit.internal.runners.statements.RunBefores.evaluate(RunBefores.java:26)
[2019-04-02T09:03:42.567Z] 	at org.junit.runners.ParentRunner.runLeaf(ParentRunner.java:325)
[2019-04-02T09:03:42.567Z] 	at org.junit.runners.BlockJUnit4ClassRunner.runChild(BlockJUnit4ClassRunner.java:78)
[2019-04-02T09:03:42.567Z] 	at org.junit.runners.BlockJUnit4ClassRunner.runChild(BlockJUnit4ClassRunner.java:57)
[2019-04-02T09:03:42.567Z] 	at org.junit.runners.ParentRunner$3.run(ParentRunner.java:290)
[2019-04-02T09:03:42.567Z] 	at org.junit.runners.ParentRunner$1.schedule(ParentRunner.java:71)
[2019-04-02T09:03:42.567Z] 	at org.junit.runners.ParentRunner.runChildren(ParentRunner.java:288)
[2019-04-02T09:03:42.567Z] 	at org.junit.runners.ParentRunner.access$000(ParentRunner.java:58)
[2019-04-02T09:03:42.567Z] 	at org.junit.runners.ParentRunner$2.evaluate(ParentRunner.java:268)
[2019-04-02T09:03:42.567Z] 	at org.junit.runners.ParentRunner.run(ParentRunner.java:363)
[2019-04-02T09:03:42.567Z] 	at org.junit.runners.Suite.runChild(Suite.java:128)
[2019-04-02T09:03:42.567Z] 	at org.junit.runners.Suite.runChild(Suite.java:27)
[2019-04-02T09:03:42.567Z] 	at org.junit.runners.ParentRunner$3.run(ParentRunner.java:290)
[2019-04-02T09:03:42.567Z] 	at org.junit.runners.ParentRunner$1.schedule(ParentRunner.java:71)
[2019-04-02T09:03:42.567Z] 	at org.junit.runners.ParentRunner.runChildren(ParentRunner.java:288)
[2019-04-02T09:03:42.567Z] 	at org.junit.runners.ParentRunner.access$000(ParentRunner.java:58)
[2019-04-02T09:03:42.567Z] 	at org.junit.runners.ParentRunner$2.evaluate(ParentRunner.java:268)
[2019-04-02T09:03:42.567Z] 	at org.junit.runners.ParentRunner.run(ParentRunner.java:363)
[2019-04-02T09:03:42.567Z] 	at junit.framework.JUnit4TestAdapter.run(JUnit4TestAdapter.java:38)
[2019-04-02T09:03:42.567Z] 	at sun.reflect.NativeMethodAccessorImpl.invoke0(Native Method)
[2019-04-02T09:03:42.567Z] 	at sun.reflect.NativeMethodAccessorImpl.invoke(NativeMethodAccessorImpl.java:62)
[2019-04-02T09:03:42.567Z] 	at sun.reflect.DelegatingMethodAccessorImpl.invoke(DelegatingMethodAccessorImpl.java:43)
[2019-04-02T09:03:42.567Z] 	at java.lang.reflect.Method.invoke(Method.java:498)
[2019-04-02T09:03:42.567Z] 	at org.apache.maven.shadefire.surefire.junit.JUnitTestSet.execute(JUnitTestSet.java:99)
[2019-04-02T09:03:42.567Z] 	at org.apache.maven.shadefire.surefire.junit.JUnit3Provider.executeTestSet(JUnit3Provider.java:140)
[2019-04-02T09:03:42.567Z] 	at org.apache.maven.shadefire.surefire.junit.JUnit3Provider.invoke(JUnit3Provider.java:113)
[2019-04-02T09:03:42.567Z] 	at org.apache.maven.shadefire.surefire.booter.ForkedBooter.invokeProviderInSameClassLoader(ForkedBooter.java:384)
[2019-04-02T09:03:42.567Z] 	at org.apache.maven.shadefire.surefire.booter.ForkedBooter.runSuitesInProcess(ForkedBooter.java:345)
[2019-04-02T09:03:42.567Z] 	at org.apache.maven.shadefire.surefire.booter.ForkedBooter.execute(ForkedBooter.java:126)
[2019-04-02T09:03:42.567Z] 	at org.apache.maven.shadefire.surefire.booter.ForkedBooter.main(ForkedBooter.java:418)
[2019-04-02T09:03:42.567Z] 
[2019-04-02T09:03:42.876Z] [INFO] 
[2019-04-02T09:03:42.876Z] [INFO] Results:
[2019-04-02T09:03:42.876Z] [INFO] 
[2019-04-02T09:03:42.876Z] [ERROR] Errors: 
[2019-04-02T09:03:42.876Z] [ERROR]   junit.framework.JUnit4TestCaseFacade#UNKNOWN  expected: <some display name> bu...
[2019-04-02T09:03:42.876Z] [INFO] 
[2019-04-02T09:03:42.876Z] [ERROR] Tests run: 54, Failures: 0, Errors: 1, Skipped: 0
[2019-04-02T09:03:42.876Z] [INFO] 
[2019-04-02T09:03:42.876Z] [INFO] ------------------------------------------------------------------------
[2019-04-02T09:03:42.876Z] [INFO] Reactor Summary for Apache Maven Surefire 3.0.0-SNAPSHOT:
[2019-04-02T09:03:42.876Z] [INFO] 
[2019-04-02T09:03:42.876Z] [INFO] Apache Maven Surefire .............................. SUCCESS [01:16 min]
[2019-04-02T09:03:42.876Z] [INFO] SureFire Logger API ................................ SUCCESS [ 16.262 s]
[2019-04-02T09:03:42.876Z] [INFO] SureFire API ....................................... SUCCESS [ 24.947 s]
[2019-04-02T09:03:42.876Z] [INFO] SureFire Booter .................................... SUCCESS [ 25.469 s]
[2019-04-02T09:03:42.876Z] [INFO] Maven Surefire Test-Grouping Support ............... SUCCESS [ 14.960 s]
[2019-04-02T09:03:42.876Z] [INFO] SureFire Providers ................................. SUCCESS [  1.634 s]
[2019-04-02T09:03:42.876Z] [INFO] Shared JUnit3 Provider Code ........................ SUCCESS [  7.370 s]
[2019-04-02T09:03:42.876Z] [INFO] Shared Java 5 Provider Base ........................ SUCCESS [  9.295 s]
[2019-04-02T09:03:42.876Z] [INFO] Shared JUnit4 Provider Code ........................ SUCCESS [  9.317 s]
[2019-04-02T09:03:42.876Z] [INFO] Shared JUnit48 Provider Code ....................... SUCCESS [ 10.305 s]
[2019-04-02T09:03:42.876Z] [INFO] SureFire JUnit Runner .............................. SUCCESS [  7.795 s]
[2019-04-02T09:03:42.876Z] [INFO] SureFire JUnit4 Runner ............................. SUCCESS [ 37.683 s]
[2019-04-02T09:03:42.876Z] [INFO] Maven Surefire Common .............................. SUCCESS [ 42.903 s]
[2019-04-02T09:03:42.876Z] [INFO] SureFire JUnitCore Runner .......................... SUCCESS [02:26 min]
[2019-04-02T09:03:42.876Z] [INFO] SureFire JUnit Platform Runner ..................... FAILURE [ 14.510 s]
[2019-04-02T09:03:42.876Z] [INFO] SureFire TestNG Utils .............................. SKIPPED
[2019-04-02T09:03:42.876Z] [INFO] SureFire TestNG Runner ............................. SKIPPED
[2019-04-02T09:03:42.876Z] [INFO] ShadeFire JUnit3 Provider .......................... SKIPPED
[2019-04-02T09:03:42.876Z] [INFO] Surefire Report Parser ............................. SKIPPED
[2019-04-02T09:03:42.876Z] [INFO] Maven Surefire Plugin .............................. SKIPPED
[2019-04-02T09:03:42.876Z] [INFO] Maven Failsafe Plugin .............................. SKIPPED
[2019-04-02T09:03:42.876Z] [INFO] Maven Surefire Report Plugin ....................... SKIPPED
[2019-04-02T09:03:42.876Z] [INFO] Maven Surefire Integration Tests ................... SKIPPED
[2019-04-02T09:03:42.876Z] [INFO] ------------------------------------------------------------------------
[2019-04-02T09:03:42.876Z] [INFO] BUILD FAILURE
[2019-04-02T09:03:42.876Z] [INFO] ------------------------------------------------------------------------
[2019-04-02T09:03:42.876Z] [INFO] Total time:  07:29 min
[2019-04-02T09:03:42.876Z] [INFO] Finished at: 2019-04-02T02:03:42-07:00
[2019-04-02T09:03:42.876Z] [INFO] ------------------------------------------------------------------------
[2019-04-02T09:03:42.876Z] [ERROR] Failed to execute goal org.apache.maven.plugins:maven-surefire-plugin:3.0.0-M3:test (default-test) on project surefire-junit-platform: There are test failures.
[2019-04-02T09:03:42.876Z] [ERROR] 
[2019-04-02T09:03:42.876Z] [ERROR] Please refer to C:\Users\jenkins\AppData\Local\Temp\2\jenkins-maven-box-maven-surefire-1546-1222-1\surefire-providers\surefire-junit-platform\target\surefire-reports for the individual test results.
[2019-04-02T09:03:42.876Z] [ERROR] Please refer to dump files (if any exist) [date].dump, [date]-jvmRun[N].dump and [date].dumpstream.
[2019-04-02T09:03:42.876Z] [ERROR] -> [Help 1]
[2019-04-02T09:03:42.876Z] org.apache.maven.lifecycle.LifecycleExecutionException: Failed to execute goal org.apache.maven.plugins:maven-surefire-plugin:3.0.0-M3:test (default-test) on project surefire-junit-platform: There are test failures.
[2019-04-02T09:03:42.876Z] 
[2019-04-02T09:03:42.876Z] Please refer to C:\Users\jenkins\AppData\Local\Temp\2\jenkins-maven-box-maven-surefire-1546-1222-1\surefire-providers\surefire-junit-platform\target\surefire-reports for the individual test results.
[2019-04-02T09:03:42.876Z] Please refer to dump files (if any exist) [date].dump, [date]-jvmRun[N].dump and [date].dumpstream.
[2019-04-02T09:03:42.876Z]     at org.apache.maven.lifecycle.internal.MojoExecutor.execute (MojoExecutor.java:215)
[2019-04-02T09:03:42.876Z]     at org.apache.maven.lifecycle.internal.MojoExecutor.execute (MojoExecutor.java:156)
[2019-04-02T09:03:42.876Z]     at org.apache.maven.lifecycle.internal.MojoExecutor.execute (MojoExecutor.java:148)
[2019-04-02T09:03:42.876Z]     at org.apache.maven.lifecycle.internal.LifecycleModuleBuilder.buildProject (LifecycleModuleBuilder.java:117)
[2019-04-02T09:03:42.876Z]     at org.apache.maven.lifecycle.internal.LifecycleModuleBuilder.buildProject (LifecycleModuleBuilder.java:81)
[2019-04-02T09:03:42.876Z]     at org.apache.maven.lifecycle.internal.builder.singlethreaded.SingleThreadedBuilder.build (SingleThreadedBuilder.java:56)
[2019-04-02T09:03:42.876Z]     at org.apache.maven.lifecycle.internal.LifecycleStarter.execute (LifecycleStarter.java:128)
[2019-04-02T09:03:42.876Z]     at org.apache.maven.DefaultMaven.doExecute (DefaultMaven.java:305)
[2019-04-02T09:03:42.876Z]     at org.apache.maven.DefaultMaven.doExecute (DefaultMaven.java:192)
[2019-04-02T09:03:42.876Z]     at org.apache.maven.DefaultMaven.execute (DefaultMaven.java:105)
[2019-04-02T09:03:42.876Z]     at org.apache.maven.cli.MavenCli.execute (MavenCli.java:956)
[2019-04-02T09:03:42.876Z]     at org.apache.maven.cli.MavenCli.doMain (MavenCli.java:288)
[2019-04-02T09:03:42.876Z]     at org.apache.maven.cli.MavenCli.main (MavenCli.java:192)
[2019-04-02T09:03:42.876Z]     at sun.reflect.NativeMethodAccessorImpl.invoke0 (Native Method)
[2019-04-02T09:03:42.876Z]     at sun.reflect.NativeMethodAccessorImpl.invoke (NativeMethodAccessorImpl.java:62)
[2019-04-02T09:03:42.876Z]     at sun.reflect.DelegatingMethodAccessorImpl.invoke (DelegatingMethodAccessorImpl.java:43)
[2019-04-02T09:03:42.876Z]     at java.lang.reflect.Method.invoke (Method.java:498)
[2019-04-02T09:03:42.876Z]     at org.codehaus.plexus.classworlds.launcher.Launcher.launchEnhanced (Launcher.java:289)
[2019-04-02T09:03:42.876Z]     at org.codehaus.plexus.classworlds.launcher.Launcher.launch (Launcher.java:229)
[2019-04-02T09:03:42.876Z]     at org.codehaus.plexus.classworlds.launcher.Launcher.mainWithExitCode (Launcher.java:415)
[2019-04-02T09:03:42.876Z]     at org.codehaus.plexus.classworlds.launcher.Launcher.main (Launcher.java:356)
[2019-04-02T09:03:42.876Z] Caused by: org.apache.maven.plugin.MojoFailureException: There are test failures.
[2019-04-02T09:03:42.876Z] 
[2019-04-02T09:03:42.877Z] Please refer to C:\Users\jenkins\AppData\Local\Temp\2\jenkins-maven-box-maven-surefire-1546-1222-1\surefire-providers\surefire-junit-platform\target\surefire-reports for the individual test results.
[2019-04-02T09:03:42.877Z] Please refer to dump files (if any exist) [date].dump, [date]-jvmRun[N].dump and [date].dumpstream.
[2019-04-02T09:03:42.877Z]     at org.apache.maven.plugin.surefire.SurefireHelper.throwException (SurefireHelper.java:271)
[2019-04-02T09:03:42.877Z]     at org.apache.maven.plugin.surefire.SurefireHelper.reportExecution (SurefireHelper.java:159)
[2019-04-02T09:03:42.877Z]     at org.apache.maven.plugin.surefire.SurefirePlugin.handleSummary (SurefirePlugin.java:373)
[2019-04-02T09:03:42.877Z]     at org.apache.maven.plugin.surefire.AbstractSurefireMojo.executeAfterPreconditionsChecked (AbstractSurefireMojo.java:1018)
[2019-04-02T09:03:42.877Z]     at org.apache.maven.plugin.surefire.AbstractSurefireMojo.execute (AbstractSurefireMojo.java:848)
[2019-04-02T09:03:42.877Z]     at org.apache.maven.plugin.DefaultBuildPluginManager.executeMojo (DefaultBuildPluginManager.java:137)
[2019-04-02T09:03:42.877Z]     at org.apache.maven.lifecycle.internal.MojoExecutor.execute (MojoExecutor.java:210)
[2019-04-02T09:03:42.877Z]     at org.apache.maven.lifecycle.internal.MojoExecutor.execute (MojoExecutor.java:156)
[2019-04-02T09:03:42.877Z]     at org.apache.maven.lifecycle.internal.MojoExecutor.execute (MojoExecutor.java:148)
[2019-04-02T09:03:42.877Z]     at org.apache.maven.lifecycle.internal.LifecycleModuleBuilder.buildProject (LifecycleModuleBuilder.java:117)
[2019-04-02T09:03:42.877Z]     at org.apache.maven.lifecycle.internal.LifecycleModuleBuilder.buildProject (LifecycleModuleBuilder.java:81)
[2019-04-02T09:03:43.170Z]     at org.apache.maven.lifecycle.internal.builder.singlethreaded.SingleThreadedBuilder.build (SingleThreadedBuilder.java:56)
[2019-04-02T09:03:43.170Z]     at org.apache.maven.lifecycle.internal.LifecycleStarter.execute (LifecycleStarter.java:128)
[2019-04-02T09:03:43.170Z]     at org.apache.maven.DefaultMaven.doExecute (DefaultMaven.java:305)
[2019-04-02T09:03:43.170Z]     at org.apache.maven.DefaultMaven.doExecute (DefaultMaven.java:192)
[2019-04-02T09:03:43.170Z]     at org.apache.maven.DefaultMaven.execute (DefaultMaven.java:105)
[2019-04-02T09:03:43.170Z]     at org.apache.maven.cli.MavenCli.execute (MavenCli.java:956)
[2019-04-02T09:03:43.170Z]     at org.apache.maven.cli.MavenCli.doMain (MavenCli.java:288)
[2019-04-02T09:03:43.170Z]     at org.apache.maven.cli.MavenCli.main (MavenCli.java:192)
[2019-04-02T09:03:43.170Z]     at sun.reflect.NativeMethodAccessorImpl.invoke0 (Native Method)
[2019-04-02T09:03:43.170Z]     at sun.reflect.NativeMethodAccessorImpl.invoke (NativeMethodAccessorImpl.java:62)
[2019-04-02T09:03:43.170Z]     at sun.reflect.DelegatingMethodAccessorImpl.invoke (DelegatingMethodAccessorImpl.java:43)
[2019-04-02T09:03:43.170Z]     at java.lang.reflect.Method.invoke (Method.java:498)
[2019-04-02T09:03:43.170Z]     at org.codehaus.plexus.classworlds.launcher.Launcher.launchEnhanced (Launcher.java:289)
[2019-04-02T09:03:43.170Z]     at org.codehaus.plexus.classworlds.launcher.Launcher.launch (Launcher.java:229)
[2019-04-02T09:03:43.170Z]     at org.codehaus.plexus.classworlds.launcher.Launcher.mainWithExitCode (Launcher.java:415)
[2019-04-02T09:03:43.170Z]     at org.codehaus.plexus.classworlds.launcher.Launcher.main (Launcher.java:356)
[2019-04-02T09:03:43.170Z] [ERROR] 
[2019-04-02T09:03:43.170Z] [ERROR] Re-run Maven using the -X switch to enable full debug logging.
[2019-04-02T09:03:43.170Z] [ERROR] 
[2019-04-02T09:03:43.170Z] [ERROR] For more information about the errors and possible solutions, please read the following articles:
[2019-04-02T09:03:43.170Z] [ERROR] [Help 1] http://cwiki.apache.org/confluence/display/MAVEN/MojoFailureException
[2019-04-02T09:03:43.170Z] [ERROR] 
[2019-04-02T09:03:43.170Z] [ERROR] After correcting the problems, you can resume the build with the command
[2019-04-02T09:03:43.170Z] [ERROR]   mvn <goals> -rf :surefire-junit-platform
[Pipeline] }
[Pipeline] // withEnv
[Pipeline] }
[Pipeline] // stage
[Pipeline] fileExists
[Pipeline] fileExists
[Pipeline] archiveArtifacts
[2019-04-02T09:03:43.403Z] Archiving artifacts
[Pipeline] cleanWs
[2019-04-02T09:03:43.965Z] [WS-CLEANUP] Deleting project workspace...
[2019-04-02T09:03:43.965Z] [WS-CLEANUP] Deferred wipeout is used...
[2019-04-02T09:03:44.032Z] [WS-CLEANUP] done
[Pipeline] }
[Pipeline] // ws
[Pipeline] }
[Pipeline] // timestamps
[Pipeline] }
[Pipeline] // node
[Pipeline] }
[Pipeline] // parallel
[Pipeline] echo
Build result: FAILURE
[Pipeline] jiraIssueSelector
[Pipeline] emailext

Build succeeded in Jenkins: Maven TLP » maven-surefire » 1546-1222 #9

Posted by Apache Jenkins Server <je...@builds.apache.org>.
See https://builds.apache.org/job/maven-box/job/maven-surefire/job/1546-1222/9/

Changes:

* Shorten wsDir
* Fix groovy script
* rewrite groovy statement
* Keep original stageId
* Reduce stageDir
* build fix
* build fix
* build fix
* build fix

All tests passed

Build failed in Jenkins: Maven TLP » maven-surefire » 1546-1222 #8

Posted by Apache Jenkins Server <je...@builds.apache.org>.
See https://builds.apache.org/job/maven-box/job/maven-surefire/job/1546-1222/8/

Changes:

* display name in TEST-*.txt and encoding in IT
* display name in TEST-*.txt and encoding in IT
* display name in TEST-*.txt and encoding in IT
* display name in TEST-*.txt and encoding in IT

1 tests failed.
FAILED:  org.apache.maven.surefire.its.JUnitPlatformIT.testJupiterEngineWithDisplayNames

Error Message:
Did not find expected message in log

Stack Trace:
junit.framework.AssertionFailedError: Did not find expected message in log
	at org.apache.maven.surefire.its.JUnitPlatformIT.testJupiterEngineWithDisplayNames(JUnitPlatformIT.java:57)




Build log:
[...truncated 44235 lines...]
[2019-04-04T04:32:23.617Z] org.apache.maven.lifecycle.LifecycleExecutionException: Failed to execute goal org.apache.maven.plugins:maven-failsafe-plugin:3.0.0-M3:verify (default) on project surefire-its: There are test failures.
[2019-04-04T04:32:23.617Z] 
[2019-04-04T04:32:23.617Z] Please refer to /home/jenkins/jenkins-slave/workspace/ven-box_maven-surefire_1546-1222@2/surefire-its/target/failsafe-reports for the individual test results.
[2019-04-04T04:32:23.617Z] Please refer to dump files (if any exist) [date].dump, [date]-jvmRun[N].dump and [date].dumpstream.
[2019-04-04T04:32:23.617Z]     at org.apache.maven.lifecycle.internal.MojoExecutor.execute (MojoExecutor.java:215)
[2019-04-04T04:32:23.617Z]     at org.apache.maven.lifecycle.internal.MojoExecutor.execute (MojoExecutor.java:156)
[2019-04-04T04:32:23.617Z]     at org.apache.maven.lifecycle.internal.MojoExecutor.execute (MojoExecutor.java:148)
[2019-04-04T04:32:23.617Z]     at org.apache.maven.lifecycle.internal.LifecycleModuleBuilder.buildProject (LifecycleModuleBuilder.java:117)
[2019-04-04T04:32:23.617Z]     at org.apache.maven.lifecycle.internal.LifecycleModuleBuilder.buildProject (LifecycleModuleBuilder.java:81)
[2019-04-04T04:32:23.617Z]     at org.apache.maven.lifecycle.internal.builder.singlethreaded.SingleThreadedBuilder.build (SingleThreadedBuilder.java:56)
[2019-04-04T04:32:23.617Z]     at org.apache.maven.lifecycle.internal.LifecycleStarter.execute (LifecycleStarter.java:128)
[2019-04-04T04:32:23.617Z]     at org.apache.maven.DefaultMaven.doExecute (DefaultMaven.java:305)
[2019-04-04T04:32:23.617Z]     at org.apache.maven.DefaultMaven.doExecute (DefaultMaven.java:192)
[2019-04-04T04:32:23.617Z]     at org.apache.maven.DefaultMaven.execute (DefaultMaven.java:105)
[2019-04-04T04:32:23.617Z]     at org.apache.maven.cli.MavenCli.execute (MavenCli.java:956)
[2019-04-04T04:32:23.617Z]     at org.apache.maven.cli.MavenCli.doMain (MavenCli.java:288)
[2019-04-04T04:32:23.617Z]     at org.apache.maven.cli.MavenCli.main (MavenCli.java:192)
[2019-04-04T04:32:23.618Z]     at sun.reflect.NativeMethodAccessorImpl.invoke0 (Native Method)
[2019-04-04T04:32:23.618Z]     at sun.reflect.NativeMethodAccessorImpl.invoke (NativeMethodAccessorImpl.java:62)
[2019-04-04T04:32:23.618Z]     at sun.reflect.DelegatingMethodAccessorImpl.invoke (DelegatingMethodAccessorImpl.java:43)
[2019-04-04T04:32:23.618Z]     at java.lang.reflect.Method.invoke (Method.java:498)
[2019-04-04T04:32:23.618Z]     at org.codehaus.plexus.classworlds.launcher.Launcher.launchEnhanced (Launcher.java:289)
[2019-04-04T04:32:23.618Z]     at org.codehaus.plexus.classworlds.launcher.Launcher.launch (Launcher.java:229)
[2019-04-04T04:32:23.618Z]     at org.codehaus.plexus.classworlds.launcher.Launcher.mainWithExitCode (Launcher.java:415)
[2019-04-04T04:32:23.618Z]     at org.codehaus.plexus.classworlds.launcher.Launcher.main (Launcher.java:356)
[2019-04-04T04:32:23.618Z] Caused by: org.apache.maven.plugin.MojoFailureException: There are test failures.
[2019-04-04T04:32:23.618Z] 
[2019-04-04T04:32:23.618Z] Please refer to /home/jenkins/jenkins-slave/workspace/ven-box_maven-surefire_1546-1222@2/surefire-its/target/failsafe-reports for the individual test results.
[2019-04-04T04:32:23.618Z] Please refer to dump files (if any exist) [date].dump, [date]-jvmRun[N].dump and [date].dumpstream.
[2019-04-04T04:32:23.618Z]     at org.apache.maven.plugin.surefire.SurefireHelper.throwException (SurefireHelper.java:271)
[2019-04-04T04:32:23.618Z]     at org.apache.maven.plugin.surefire.SurefireHelper.reportExecution (SurefireHelper.java:159)
[2019-04-04T04:32:23.618Z]     at org.apache.maven.plugin.failsafe.VerifyMojo.execute (VerifyMojo.java:192)
[2019-04-04T04:32:23.618Z]     at org.apache.maven.plugin.DefaultBuildPluginManager.executeMojo (DefaultBuildPluginManager.java:137)
[2019-04-04T04:32:23.618Z]     at org.apache.maven.lifecycle.internal.MojoExecutor.execute (MojoExecutor.java:210)
[2019-04-04T04:32:23.618Z]     at org.apache.maven.lifecycle.internal.MojoExecutor.execute (MojoExecutor.java:156)
[2019-04-04T04:32:23.618Z]     at org.apache.maven.lifecycle.internal.MojoExecutor.execute (MojoExecutor.java:148)
[2019-04-04T04:32:23.618Z]     at org.apache.maven.lifecycle.internal.LifecycleModuleBuilder.buildProject (LifecycleModuleBuilder.java:117)
[2019-04-04T04:32:23.618Z]     at org.apache.maven.lifecycle.internal.LifecycleModuleBuilder.buildProject (LifecycleModuleBuilder.java:81)
[2019-04-04T04:32:23.618Z]     at org.apache.maven.lifecycle.internal.builder.singlethreaded.SingleThreadedBuilder.build (SingleThreadedBuilder.java:56)
[2019-04-04T04:32:23.618Z]     at org.apache.maven.lifecycle.internal.LifecycleStarter.execute (LifecycleStarter.java:128)
[2019-04-04T04:32:23.618Z]     at org.apache.maven.DefaultMaven.doExecute (DefaultMaven.java:305)
[2019-04-04T04:32:23.618Z]     at org.apache.maven.DefaultMaven.doExecute (DefaultMaven.java:192)
[2019-04-04T04:32:23.618Z]     at org.apache.maven.DefaultMaven.execute (DefaultMaven.java:105)
[2019-04-04T04:32:23.618Z]     at org.apache.maven.cli.MavenCli.execute (MavenCli.java:956)
[2019-04-04T04:32:23.618Z]     at org.apache.maven.cli.MavenCli.doMain (MavenCli.java:288)
[2019-04-04T04:32:23.618Z]     at org.apache.maven.cli.MavenCli.main (MavenCli.java:192)
[2019-04-04T04:32:23.618Z]     at sun.reflect.NativeMethodAccessorImpl.invoke0 (Native Method)
[2019-04-04T04:32:23.618Z]     at sun.reflect.NativeMethodAccessorImpl.invoke (NativeMethodAccessorImpl.java:62)
[2019-04-04T04:32:23.618Z]     at sun.reflect.DelegatingMethodAccessorImpl.invoke (DelegatingMethodAccessorImpl.java:43)
[2019-04-04T04:32:23.618Z]     at java.lang.reflect.Method.invoke (Method.java:498)
[2019-04-04T04:32:23.618Z]     at org.codehaus.plexus.classworlds.launcher.Launcher.launchEnhanced (Launcher.java:289)
[2019-04-04T04:32:23.618Z]     at org.codehaus.plexus.classworlds.launcher.Launcher.launch (Launcher.java:229)
[2019-04-04T04:32:23.618Z]     at org.codehaus.plexus.classworlds.launcher.Launcher.mainWithExitCode (Launcher.java:415)
[2019-04-04T04:32:23.618Z]     at org.codehaus.plexus.classworlds.launcher.Launcher.main (Launcher.java:356)
[2019-04-04T04:32:23.618Z] [ERROR] 
[2019-04-04T04:32:23.618Z] [ERROR] Re-run Maven using the -X switch to enable full debug logging.
[2019-04-04T04:32:23.618Z] [ERROR] 
[2019-04-04T04:32:23.618Z] [ERROR] For more information about the errors and possible solutions, please read the following articles:
[2019-04-04T04:32:23.618Z] [ERROR] [Help 1] http://cwiki.apache.org/confluence/display/MAVEN/MojoFailureException
[2019-04-04T04:32:23.618Z] [ERROR] 
[2019-04-04T04:32:23.618Z] [ERROR] After correcting the problems, you can resume the build with the command
[2019-04-04T04:32:23.618Z] [ERROR]   mvn <goals> -rf :surefire-its
[Pipeline] }
[Pipeline] // withEnv
[Pipeline] }
[Pipeline] // stage
[Pipeline] openTasks
[2019-04-04T04:32:24.196Z] [TASKS] Skipping publisher since build result is FAILURE
[Pipeline] jacoco
[Pipeline] junit
[2019-04-04T04:32:24.547Z] Recording test results
[Pipeline] fileExists
[Pipeline] zip
[2019-04-04T04:32:26.280Z] Writing zip file of /home/jenkins/jenkins-slave/workspace/ven-box_maven-surefire_1546-1222@2/maven-failsafe-plugin/target/it to /home/jenkins/jenkins-slave/workspace/ven-box_maven-surefire_1546-1222@2/maven-failsafe-plugin--linux-jdk12-maven3.6.x.zip
[2019-04-04T04:32:26.475Z] Zipped 78 entries.
[2019-04-04T04:32:26.475Z] Archiving /home/jenkins/jenkins-slave/workspace/ven-box_maven-surefire_1546-1222@2/maven-failsafe-plugin--linux-jdk12-maven3.6.x.zip
[2019-04-04T04:32:26.475Z] [Fast Archiver] No prior successful build to compare, so performing full copy of artifacts
[Pipeline] fileExists
[Pipeline] zip
[2019-04-04T04:32:27.447Z] Writing zip file of /home/jenkins/jenkins-slave/workspace/ven-box_maven-surefire_1546-1222@2/surefire-its/target to /home/jenkins/jenkins-slave/workspace/ven-box_maven-surefire_1546-1222@2/surefire-its--linux-jdk12-maven3.6.x.zip
[2019-04-04T04:32:28.500Z] Zipped 1964 entries.
[2019-04-04T04:32:28.500Z] Archiving /home/jenkins/jenkins-slave/workspace/ven-box_maven-surefire_1546-1222@2/surefire-its--linux-jdk12-maven3.6.x.zip
[2019-04-04T04:32:28.500Z] [Fast Archiver] No prior successful build to compare, so performing full copy of artifacts
[Pipeline] archiveArtifacts
[2019-04-04T04:32:29.753Z] Archiving artifacts
[2019-04-04T04:32:29.911Z] [Fast Archiver] No prior successful build to compare, so performing full copy of artifacts
[Pipeline] cleanWs
[2019-04-04T04:32:30.702Z] [WS-CLEANUP] Deleting project workspace...
[2019-04-04T04:32:30.702Z] [WS-CLEANUP] Deferred wipeout is used...
[2019-04-04T04:32:32.862Z] [WS-CLEANUP] done
[Pipeline] }
[Pipeline] // ws
[Pipeline] }
[Pipeline] // timestamps
[Pipeline] }
[Pipeline] // node
[Pipeline] }
[2019-04-04T04:33:29.728Z] [ERROR] Tests run: 6, Failures: 1, Errors: 0, Skipped: 0, Time elapsed: 68.105 s <<< FAILURE! - in org.apache.maven.surefire.its.JUnitPlatformIT
[2019-04-04T04:33:29.728Z] [ERROR] testJupiterEngineWithDisplayNames(org.apache.maven.surefire.its.JUnitPlatformIT)  Time elapsed: 9.913 s  <<< FAILURE!
[2019-04-04T04:33:29.728Z] junit.framework.AssertionFailedError: Did not find expected message in log
[2019-04-04T04:33:29.728Z] 	at org.apache.maven.surefire.its.JUnitPlatformIT.testJupiterEngineWithDisplayNames(JUnitPlatformIT.java:57)
[2019-04-04T04:33:29.728Z] 
[2019-04-04T04:33:29.728Z] [INFO] 
[2019-04-04T04:33:29.728Z] [INFO] Results:
[2019-04-04T04:33:29.728Z] [INFO] 
[2019-04-04T04:33:29.728Z] [ERROR] Failures: 
[2019-04-04T04:33:29.728Z] [ERROR]   JUnitPlatformIT.testJupiterEngineWithDisplayNames:57 Did not find expected message in log
[2019-04-04T04:33:29.728Z] [INFO] 
[2019-04-04T04:33:29.728Z] [ERROR] Tests run: 6, Failures: 1, Errors: 0, Skipped: 0
[2019-04-04T04:33:29.728Z] [INFO] 
[2019-04-04T04:33:29.728Z] [INFO] 
[2019-04-04T04:33:29.728Z] [INFO] --- maven-checkstyle-plugin:3.0.0:check (checkstyle-check) @ surefire-its ---
[2019-04-04T04:33:29.728Z] [INFO] 
[2019-04-04T04:33:29.728Z] [INFO] --- maven-failsafe-plugin:3.0.0-M3:verify (default) @ surefire-its ---
[2019-04-04T04:33:29.728Z] [INFO] Failsafe report directory: /home/jenkins/jenkins-slave/workspace/ven-box_maven-surefire_1546-1222@2/surefire-its/target/failsafe-reports
[2019-04-04T04:33:29.728Z] [INFO] ------------------------------------------------------------------------
[2019-04-04T04:33:29.728Z] [INFO] Reactor Summary for Apache Maven Surefire 3.0.0-SNAPSHOT:
[2019-04-04T04:33:29.728Z] [INFO] 
[2019-04-04T04:33:29.728Z] [INFO] Apache Maven Surefire .............................. SUCCESS [ 17.712 s]
[2019-04-04T04:33:29.728Z] [INFO] SureFire Logger API ................................ SUCCESS [  3.815 s]
[2019-04-04T04:33:29.728Z] [INFO] SureFire API ....................................... SUCCESS [ 10.203 s]
[2019-04-04T04:33:29.728Z] [INFO] SureFire Booter .................................... SUCCESS [  9.902 s]
[2019-04-04T04:33:29.728Z] [INFO] Maven Surefire Test-Grouping Support ............... SUCCESS [  4.586 s]
[2019-04-04T04:33:29.728Z] [INFO] SureFire Providers ................................. SUCCESS [  0.801 s]
[2019-04-04T04:33:29.728Z] [INFO] Shared JUnit3 Provider Code ........................ SUCCESS [  2.920 s]
[2019-04-04T04:33:29.728Z] [INFO] Shared Java 5 Provider Base ........................ SUCCESS [  3.655 s]
[2019-04-04T04:33:29.728Z] [INFO] Shared JUnit4 Provider Code ........................ SUCCESS [  3.759 s]
[2019-04-04T04:33:29.728Z] [INFO] Shared JUnit48 Provider Code ....................... SUCCESS [  4.412 s]
[2019-04-04T04:33:29.728Z] [INFO] SureFire JUnit Runner .............................. SUCCESS [  3.340 s]
[2019-04-04T04:33:29.728Z] [INFO] SureFire JUnit4 Runner ............................. SUCCESS [  3.272 s]
[2019-04-04T04:33:29.728Z] [INFO] Maven Surefire Common .............................. SUCCESS [ 26.335 s]
[2019-04-04T04:33:29.728Z] [INFO] SureFire JUnitCore Runner .......................... SUCCESS [02:23 min]
[2019-04-04T04:33:29.728Z] [INFO] SureFire JUnit Platform Runner ..................... SUCCESS [ 16.084 s]
[2019-04-04T04:33:29.728Z] [INFO] SureFire TestNG Utils .............................. SUCCESS [  7.445 s]
[2019-04-04T04:33:29.728Z] [INFO] SureFire TestNG Runner ............................. SUCCESS [  8.851 s]
[2019-04-04T04:33:29.728Z] [INFO] ShadeFire JUnit3 Provider .......................... SUCCESS [  2.425 s]
[2019-04-04T04:33:29.728Z] [INFO] Surefire Report Parser ............................. SUCCESS [ 10.771 s]
[2019-04-04T04:33:29.728Z] [INFO] Maven Surefire Plugin .............................. SUCCESS [ 14.381 s]
[2019-04-04T04:33:29.728Z] [INFO] Maven Failsafe Plugin .............................. SUCCESS [02:08 min]
[2019-04-04T04:33:29.728Z] [INFO] Maven Surefire Report Plugin ....................... SUCCESS [ 24.912 s]
[2019-04-04T04:33:29.729Z] [INFO] Maven Surefire Integration Tests ................... FAILURE [01:28 min]
[2019-04-04T04:33:29.729Z] [INFO] ------------------------------------------------------------------------
[2019-04-04T04:33:29.729Z] [INFO] BUILD FAILURE
[2019-04-04T04:33:29.729Z] [INFO] ------------------------------------------------------------------------
[2019-04-04T04:33:29.729Z] [INFO] Total time:  09:01 min
[2019-04-04T04:33:29.729Z] [INFO] Finished at: 2019-04-04T04:33:27Z
[2019-04-04T04:33:29.729Z] [INFO] ------------------------------------------------------------------------
[2019-04-04T04:33:29.729Z] [ERROR] Failed to execute goal org.apache.maven.plugins:maven-failsafe-plugin:3.0.0-M3:verify (default) on project surefire-its: There are test failures.
[2019-04-04T04:33:29.729Z] [ERROR] 
[2019-04-04T04:33:29.729Z] [ERROR] Please refer to /home/jenkins/jenkins-slave/workspace/ven-box_maven-surefire_1546-1222@2/surefire-its/target/failsafe-reports for the individual test results.
[2019-04-04T04:33:29.729Z] [ERROR] Please refer to dump files (if any exist) [date].dump, [date]-jvmRun[N].dump and [date].dumpstream.
[2019-04-04T04:33:29.729Z] [ERROR] -> [Help 1]
[2019-04-04T04:33:29.729Z] org.apache.maven.lifecycle.LifecycleExecutionException: Failed to execute goal org.apache.maven.plugins:maven-failsafe-plugin:3.0.0-M3:verify (default) on project surefire-its: There are test failures.
[2019-04-04T04:33:29.729Z] 
[2019-04-04T04:33:29.729Z] Please refer to /home/jenkins/jenkins-slave/workspace/ven-box_maven-surefire_1546-1222@2/surefire-its/target/failsafe-reports for the individual test results.
[2019-04-04T04:33:29.729Z] Please refer to dump files (if any exist) [date].dump, [date]-jvmRun[N].dump and [date].dumpstream.
[2019-04-04T04:33:29.729Z]     at org.apache.maven.lifecycle.internal.MojoExecutor.execute (MojoExecutor.java:215)
[2019-04-04T04:33:29.729Z]     at org.apache.maven.lifecycle.internal.MojoExecutor.execute (MojoExecutor.java:156)
[2019-04-04T04:33:29.729Z]     at org.apache.maven.lifecycle.internal.MojoExecutor.execute (MojoExecutor.java:148)
[2019-04-04T04:33:29.729Z]     at org.apache.maven.lifecycle.internal.LifecycleModuleBuilder.buildProject (LifecycleModuleBuilder.java:117)
[2019-04-04T04:33:29.729Z]     at org.apache.maven.lifecycle.internal.LifecycleModuleBuilder.buildProject (LifecycleModuleBuilder.java:81)
[2019-04-04T04:33:29.729Z]     at org.apache.maven.lifecycle.internal.builder.singlethreaded.SingleThreadedBuilder.build (SingleThreadedBuilder.java:56)
[2019-04-04T04:33:29.729Z]     at org.apache.maven.lifecycle.internal.LifecycleStarter.execute (LifecycleStarter.java:128)
[2019-04-04T04:33:29.729Z]     at org.apache.maven.DefaultMaven.doExecute (DefaultMaven.java:305)
[2019-04-04T04:33:29.729Z]     at org.apache.maven.DefaultMaven.doExecute (DefaultMaven.java:192)
[2019-04-04T04:33:29.729Z]     at org.apache.maven.DefaultMaven.execute (DefaultMaven.java:105)
[2019-04-04T04:33:29.729Z]     at org.apache.maven.cli.MavenCli.execute (MavenCli.java:956)
[2019-04-04T04:33:29.729Z]     at org.apache.maven.cli.MavenCli.doMain (MavenCli.java:288)
[2019-04-04T04:33:29.729Z]     at org.apache.maven.cli.MavenCli.main (MavenCli.java:192)
[2019-04-04T04:33:29.729Z]     at sun.reflect.NativeMethodAccessorImpl.invoke0 (Native Method)
[2019-04-04T04:33:29.729Z]     at sun.reflect.NativeMethodAccessorImpl.invoke (NativeMethodAccessorImpl.java:62)
[2019-04-04T04:33:29.729Z]     at sun.reflect.DelegatingMethodAccessorImpl.invoke (DelegatingMethodAccessorImpl.java:43)
[2019-04-04T04:33:29.729Z]     at java.lang.reflect.Method.invoke (Method.java:498)
[2019-04-04T04:33:29.729Z]     at org.codehaus.plexus.classworlds.launcher.Launcher.launchEnhanced (Launcher.java:289)
[2019-04-04T04:33:29.729Z]     at org.codehaus.plexus.classworlds.launcher.Launcher.launch (Launcher.java:229)
[2019-04-04T04:33:29.729Z]     at org.codehaus.plexus.classworlds.launcher.Launcher.mainWithExitCode (Launcher.java:415)
[2019-04-04T04:33:29.729Z]     at org.codehaus.plexus.classworlds.launcher.Launcher.main (Launcher.java:356)
[2019-04-04T04:33:29.729Z] Caused by: org.apache.maven.plugin.MojoFailureException: There are test failures.
[2019-04-04T04:33:29.729Z] 
[2019-04-04T04:33:29.729Z] Please refer to /home/jenkins/jenkins-slave/workspace/ven-box_maven-surefire_1546-1222@2/surefire-its/target/failsafe-reports for the individual test results.
[2019-04-04T04:33:29.729Z] Please refer to dump files (if any exist) [date].dump, [date]-jvmRun[N].dump and [date].dumpstream.
[2019-04-04T04:33:29.729Z]     at org.apache.maven.plugin.surefire.SurefireHelper.throwException (SurefireHelper.java:271)
[2019-04-04T04:33:29.729Z]     at org.apache.maven.plugin.surefire.SurefireHelper.reportExecution (SurefireHelper.java:159)
[2019-04-04T04:33:29.729Z]     at org.apache.maven.plugin.failsafe.VerifyMojo.execute (VerifyMojo.java:192)
[2019-04-04T04:33:29.729Z]     at org.apache.maven.plugin.DefaultBuildPluginManager.executeMojo (DefaultBuildPluginManager.java:137)
[2019-04-04T04:33:29.729Z]     at org.apache.maven.lifecycle.internal.MojoExecutor.execute (MojoExecutor.java:210)
[2019-04-04T04:33:29.729Z]     at org.apache.maven.lifecycle.internal.MojoExecutor.execute (MojoExecutor.java:156)
[2019-04-04T04:33:29.729Z]     at org.apache.maven.lifecycle.internal.MojoExecutor.execute (MojoExecutor.java:148)
[2019-04-04T04:33:29.729Z]     at org.apache.maven.lifecycle.internal.LifecycleModuleBuilder.buildProject (LifecycleModuleBuilder.java:117)
[2019-04-04T04:33:29.729Z]     at org.apache.maven.lifecycle.internal.LifecycleModuleBuilder.buildProject (LifecycleModuleBuilder.java:81)
[2019-04-04T04:33:29.729Z]     at org.apache.maven.lifecycle.internal.builder.singlethreaded.SingleThreadedBuilder.build (SingleThreadedBuilder.java:56)
[2019-04-04T04:33:29.729Z]     at org.apache.maven.lifecycle.internal.LifecycleStarter.execute (LifecycleStarter.java:128)
[2019-04-04T04:33:29.729Z]     at org.apache.maven.DefaultMaven.doExecute (DefaultMaven.java:305)
[2019-04-04T04:33:29.729Z]     at org.apache.maven.DefaultMaven.doExecute (DefaultMaven.java:192)
[2019-04-04T04:33:29.729Z]     at org.apache.maven.DefaultMaven.execute (DefaultMaven.java:105)
[2019-04-04T04:33:29.729Z]     at org.apache.maven.cli.MavenCli.execute (MavenCli.java:956)
[2019-04-04T04:33:29.729Z]     at org.apache.maven.cli.MavenCli.doMain (MavenCli.java:288)
[2019-04-04T04:33:29.729Z]     at org.apache.maven.cli.MavenCli.main (MavenCli.java:192)
[2019-04-04T04:33:29.729Z]     at sun.reflect.NativeMethodAccessorImpl.invoke0 (Native Method)
[2019-04-04T04:33:29.729Z]     at sun.reflect.NativeMethodAccessorImpl.invoke (NativeMethodAccessorImpl.java:62)
[2019-04-04T04:33:29.729Z]     at sun.reflect.DelegatingMethodAccessorImpl.invoke (DelegatingMethodAccessorImpl.java:43)
[2019-04-04T04:33:29.729Z]     at java.lang.reflect.Method.invoke (Method.java:498)
[2019-04-04T04:33:29.729Z]     at org.codehaus.plexus.classworlds.launcher.Launcher.launchEnhanced (Launcher.java:289)
[2019-04-04T04:33:29.729Z]     at org.codehaus.plexus.classworlds.launcher.Launcher.launch (Launcher.java:229)
[2019-04-04T04:33:29.729Z]     at org.codehaus.plexus.classworlds.launcher.Launcher.mainWithExitCode (Launcher.java:415)
[2019-04-04T04:33:29.729Z]     at org.codehaus.plexus.classworlds.launcher.Launcher.main (Launcher.java:356)
[2019-04-04T04:33:29.729Z] [ERROR] 
[2019-04-04T04:33:29.729Z] [ERROR] Re-run Maven using the -X switch to enable full debug logging.
[2019-04-04T04:33:29.730Z] [ERROR] 
[2019-04-04T04:33:29.730Z] [ERROR] For more information about the errors and possible solutions, please read the following articles:
[2019-04-04T04:33:29.730Z] [ERROR] [Help 1] http://cwiki.apache.org/confluence/display/MAVEN/MojoFailureException
[2019-04-04T04:33:29.730Z] [ERROR] 
[2019-04-04T04:33:29.730Z] [ERROR] After correcting the problems, you can resume the build with the command
[2019-04-04T04:33:29.730Z] [ERROR]   mvn <goals> -rf :surefire-its
[Pipeline] }
[Pipeline] // withEnv
[Pipeline] }
[Pipeline] // stage
[Pipeline] fileExists
[Pipeline] zip
[2019-04-04T04:33:30.771Z] Writing zip file of /home/jenkins/jenkins-slave/workspace/ven-box_maven-surefire_1546-1222@2/maven-failsafe-plugin/target/it to /home/jenkins/jenkins-slave/workspace/ven-box_maven-surefire_1546-1222@2/maven-failsafe-plugin--linux-jdk11-maven3.6.x.zip
[2019-04-04T04:33:30.972Z] Zipped 79 entries.
[2019-04-04T04:33:30.972Z] Archiving /home/jenkins/jenkins-slave/workspace/ven-box_maven-surefire_1546-1222@2/maven-failsafe-plugin--linux-jdk11-maven3.6.x.zip
[2019-04-04T04:33:30.972Z] [Fast Archiver] No prior successful build to compare, so performing full copy of artifacts
[Pipeline] fileExists
[Pipeline] zip
[2019-04-04T04:33:31.942Z] Writing zip file of /home/jenkins/jenkins-slave/workspace/ven-box_maven-surefire_1546-1222@2/surefire-its/target to /home/jenkins/jenkins-slave/workspace/ven-box_maven-surefire_1546-1222@2/surefire-its--linux-jdk11-maven3.6.x.zip
[2019-04-04T04:33:32.884Z] Zipped 1964 entries.
[2019-04-04T04:33:32.884Z] Archiving /home/jenkins/jenkins-slave/workspace/ven-box_maven-surefire_1546-1222@2/surefire-its--linux-jdk11-maven3.6.x.zip
[2019-04-04T04:33:32.884Z] [Fast Archiver] No prior successful build to compare, so performing full copy of artifacts
[Pipeline] archiveArtifacts
[2019-04-04T04:33:34.050Z] Archiving artifacts
[2019-04-04T04:33:34.207Z] [Fast Archiver] No prior successful build to compare, so performing full copy of artifacts
[Pipeline] cleanWs
[2019-04-04T04:33:35.100Z] [WS-CLEANUP] Deleting project workspace...
[2019-04-04T04:33:35.100Z] [WS-CLEANUP] Deferred wipeout is used...
[2019-04-04T04:33:35.423Z] [WS-CLEANUP] done
[Pipeline] }
[Pipeline] // ws
[Pipeline] }
[Pipeline] // timestamps
[Pipeline] }
[Pipeline] // node
[Pipeline] }
[Pipeline] // parallel
[Pipeline] echo
Build result: FAILURE
[Pipeline] jiraIssueSelector
[Pipeline] emailext

Build failed in Jenkins: Maven TLP » maven-surefire » 1546-1222 #7

Posted by Apache Jenkins Server <je...@builds.apache.org>.
See https://builds.apache.org/job/maven-box/job/maven-surefire/job/1546-1222/7/

Changes:

* StatelessXmlReporter using display names without configuration
* StatelessXmlReporter using display names without configuration
* StatelessXmlReporter using display names without configuration
* StatelessXmlReporter using display names without configuration
* StatelessXmlReporter using display names without configuration
* StatelessXmlReporter using display names without configuration
* StatelessXmlReporter using display names without configuration
* StatelessXmlReporter using display names without configuration

1 tests failed.
FAILED:  org.apache.maven.surefire.its.JUnitPlatformIT.testJupiterEngineWithDisplayNames

Error Message:
Did not find expected message in log

Stack Trace:
junit.framework.AssertionFailedError: Did not find expected message in log
	at org.apache.maven.surefire.its.JUnitPlatformIT.testJupiterEngineWithDisplayNames(JUnitPlatformIT.java:55)




Build log:
[...truncated 44210 lines...]
[2019-04-04T02:17:52.194Z]     at java.lang.reflect.Method.invoke (Method.java:498)
[2019-04-04T02:17:52.194Z]     at org.codehaus.plexus.classworlds.launcher.Launcher.launchEnhanced (Launcher.java:289)
[2019-04-04T02:17:52.194Z]     at org.codehaus.plexus.classworlds.launcher.Launcher.launch (Launcher.java:229)
[2019-04-04T02:17:52.194Z]     at org.codehaus.plexus.classworlds.launcher.Launcher.mainWithExitCode (Launcher.java:415)
[2019-04-04T02:17:52.194Z]     at org.codehaus.plexus.classworlds.launcher.Launcher.main (Launcher.java:356)
[2019-04-04T02:17:52.194Z] Caused by: org.apache.maven.plugin.MojoFailureException: There are test failures.
[2019-04-04T02:17:52.194Z] 
[2019-04-04T02:17:52.194Z] Please refer to C:\Users\jenkins\AppData\Local\Temp\2\jenkins-maven-box-maven-surefire-1546-1222-7@2\surefire-its\target\failsafe-reports for the individual test results.
[2019-04-04T02:17:52.194Z] Please refer to dump files (if any exist) [date].dump, [date]-jvmRun[N].dump and [date].dumpstream.
[2019-04-04T02:17:52.194Z]     at org.apache.maven.plugin.surefire.SurefireHelper.throwException (SurefireHelper.java:271)
[2019-04-04T02:17:52.194Z]     at org.apache.maven.plugin.surefire.SurefireHelper.reportExecution (SurefireHelper.java:159)
[2019-04-04T02:17:52.194Z]     at org.apache.maven.plugin.failsafe.VerifyMojo.execute (VerifyMojo.java:192)
[2019-04-04T02:17:52.194Z]     at org.apache.maven.plugin.DefaultBuildPluginManager.executeMojo (DefaultBuildPluginManager.java:137)
[2019-04-04T02:17:52.194Z]     at org.apache.maven.lifecycle.internal.MojoExecutor.execute (MojoExecutor.java:210)
[2019-04-04T02:17:52.194Z]     at org.apache.maven.lifecycle.internal.MojoExecutor.execute (MojoExecutor.java:156)
[2019-04-04T02:17:52.194Z]     at org.apache.maven.lifecycle.internal.MojoExecutor.execute (MojoExecutor.java:148)
[2019-04-04T02:17:52.194Z]     at org.apache.maven.lifecycle.internal.LifecycleModuleBuilder.buildProject (LifecycleModuleBuilder.java:117)
[2019-04-04T02:17:52.194Z]     at org.apache.maven.lifecycle.internal.LifecycleModuleBuilder.buildProject (LifecycleModuleBuilder.java:81)
[2019-04-04T02:17:52.194Z]     at org.apache.maven.lifecycle.internal.builder.singlethreaded.SingleThreadedBuilder.build (SingleThreadedBuilder.java:56)
[2019-04-04T02:17:52.194Z]     at org.apache.maven.lifecycle.internal.LifecycleStarter.execute (LifecycleStarter.java:128)
[2019-04-04T02:17:52.194Z]     at org.apache.maven.DefaultMaven.doExecute (DefaultMaven.java:305)
[2019-04-04T02:17:52.194Z]     at org.apache.maven.DefaultMaven.doExecute (DefaultMaven.java:192)
[2019-04-04T02:17:52.194Z]     at org.apache.maven.DefaultMaven.execute (DefaultMaven.java:105)
[2019-04-04T02:17:52.194Z]     at org.apache.maven.cli.MavenCli.execute (MavenCli.java:956)
[2019-04-04T02:17:52.194Z]     at org.apache.maven.cli.MavenCli.doMain (MavenCli.java:288)
[2019-04-04T02:17:52.194Z]     at org.apache.maven.cli.MavenCli.main (MavenCli.java:192)
[2019-04-04T02:17:52.194Z]     at sun.reflect.NativeMethodAccessorImpl.invoke0 (Native Method)
[2019-04-04T02:17:52.194Z]     at sun.reflect.NativeMethodAccessorImpl.invoke (NativeMethodAccessorImpl.java:62)
[2019-04-04T02:17:52.194Z]     at sun.reflect.DelegatingMethodAccessorImpl.invoke (DelegatingMethodAccessorImpl.java:43)
[2019-04-04T02:17:52.194Z]     at java.lang.reflect.Method.invoke (Method.java:498)
[2019-04-04T02:17:52.194Z]     at org.codehaus.plexus.classworlds.launcher.Launcher.launchEnhanced (Launcher.java:289)
[2019-04-04T02:17:52.194Z]     at org.codehaus.plexus.classworlds.launcher.Launcher.launch (Launcher.java:229)
[2019-04-04T02:17:52.194Z]     at org.codehaus.plexus.classworlds.launcher.Launcher.mainWithExitCode (Launcher.java:415)
[2019-04-04T02:17:52.194Z]     at org.codehaus.plexus.classworlds.launcher.Launcher.main (Launcher.java:356)
[2019-04-04T02:17:52.194Z] [ERROR] 
[2019-04-04T02:17:52.194Z] [ERROR] Re-run Maven using the -X switch to enable full debug logging.
[2019-04-04T02:17:52.194Z] [ERROR] 
[2019-04-04T02:17:52.194Z] [ERROR] For more information about the errors and possible solutions, please read the following articles:
[2019-04-04T02:17:52.194Z] [ERROR] [Help 1] http://cwiki.apache.org/confluence/display/MAVEN/MojoFailureException
[2019-04-04T02:17:52.194Z] [ERROR] 
[2019-04-04T02:17:52.194Z] [ERROR] After correcting the problems, you can resume the build with the command
[2019-04-04T02:17:52.194Z] [ERROR]   mvn <goals> -rf :surefire-its
[Pipeline] zip
[Pipeline] }
[Pipeline] // withEnv
[Pipeline] }
[2019-04-04T02:17:53.149Z] Writing zip file of C:\Users\jenkins\AppData\Local\Temp\2\jenkins-maven-box-maven-surefire-1546-1222-7\maven-failsafe-plugin\target\it to C:\Users\jenkins\AppData\Local\Temp\2\jenkins-maven-box-maven-surefire-1546-1222-7\maven-failsafe-plugin--windows-jdk12-maven3.6.x.zip
[Pipeline] // stage
[Pipeline] fileExists
[2019-04-04T02:17:53.308Z] Zipped 78 entries.
[2019-04-04T02:17:53.309Z] Archiving C:\Users\jenkins\AppData\Local\Temp\2\jenkins-maven-box-maven-surefire-1546-1222-7\maven-failsafe-plugin--windows-jdk12-maven3.6.x.zip
[2019-04-04T02:17:53.309Z] [Fast Archiver] No prior successful build to compare, so performing full copy of artifacts
[Pipeline] fileExists
[Pipeline] zip
[Pipeline] zip
[2019-04-04T02:17:54.023Z] Writing zip file of C:\Users\jenkins\AppData\Local\Temp\2\jenkins-maven-box-maven-surefire-1546-1222-7@2\maven-failsafe-plugin\target\it to C:\Users\jenkins\AppData\Local\Temp\2\jenkins-maven-box-maven-surefire-1546-1222-7@2\maven-failsafe-plugin--windows-jdk11-maven3.6.x.zip
[2019-04-04T02:17:54.053Z] Writing zip file of C:\Users\jenkins\AppData\Local\Temp\2\jenkins-maven-box-maven-surefire-1546-1222-7\surefire-its\target to C:\Users\jenkins\AppData\Local\Temp\2\jenkins-maven-box-maven-surefire-1546-1222-7\surefire-its--windows-jdk12-maven3.6.x.zip
[2019-04-04T02:17:54.193Z] Zipped 80 entries.
[2019-04-04T02:17:54.193Z] Archiving C:\Users\jenkins\AppData\Local\Temp\2\jenkins-maven-box-maven-surefire-1546-1222-7@2\maven-failsafe-plugin--windows-jdk11-maven3.6.x.zip
[2019-04-04T02:17:54.194Z] [Fast Archiver] No prior successful build to compare, so performing full copy of artifacts
[Pipeline] fileExists
[Pipeline] zip
[2019-04-04T02:17:54.329Z] Writing zip file of C:\Users\jenkins\AppData\Local\Temp\2\jenkins-maven-box-maven-surefire-1546-1222-7@2\surefire-its\target to C:\Users\jenkins\AppData\Local\Temp\2\jenkins-maven-box-maven-surefire-1546-1222-7@2\surefire-its--windows-jdk11-maven3.6.x.zip
[2019-04-04T02:17:56.752Z] Zipped 1963 entries.
[2019-04-04T02:17:56.752Z] Archiving C:\Users\jenkins\AppData\Local\Temp\2\jenkins-maven-box-maven-surefire-1546-1222-7\surefire-its--windows-jdk12-maven3.6.x.zip
[2019-04-04T02:17:56.753Z] [Fast Archiver] No prior successful build to compare, so performing full copy of artifacts
[2019-04-04T02:17:57.072Z] Zipped 1963 entries.
[2019-04-04T02:17:57.072Z] Archiving C:\Users\jenkins\AppData\Local\Temp\2\jenkins-maven-box-maven-surefire-1546-1222-7@2\surefire-its--windows-jdk11-maven3.6.x.zip
[2019-04-04T02:17:57.073Z] [Fast Archiver] No prior successful build to compare, so performing full copy of artifacts
[Pipeline] archiveArtifacts
[2019-04-04T02:17:57.171Z] Archiving artifacts
[2019-04-04T02:17:57.204Z] [Fast Archiver] No prior successful build to compare, so performing full copy of artifacts
[Pipeline] archiveArtifacts
[2019-04-04T02:17:57.544Z] Archiving artifacts
[2019-04-04T02:17:57.599Z] [Fast Archiver] No prior successful build to compare, so performing full copy of artifacts
[Pipeline] cleanWs
[2019-04-04T02:17:57.741Z] [WS-CLEANUP] Deleting project workspace...
[2019-04-04T02:17:57.741Z] [WS-CLEANUP] Deferred wipeout is used...
[2019-04-04T02:17:57.836Z] [WS-CLEANUP] done
[Pipeline] }
[Pipeline] // ws
[Pipeline] }
[Pipeline] // timestamps
[Pipeline] }
[Pipeline] // node
[Pipeline] }
[Pipeline] cleanWs
[2019-04-04T02:17:58.057Z] [WS-CLEANUP] Deleting project workspace...
[2019-04-04T02:17:58.057Z] [WS-CLEANUP] Deferred wipeout is used...
[2019-04-04T02:17:58.142Z] [WS-CLEANUP] done
[Pipeline] }
[Pipeline] // ws
[Pipeline] }
[Pipeline] // timestamps
[Pipeline] }
[Pipeline] // node
[Pipeline] }
[2019-04-04T02:18:16.006Z] [ERROR] Tests run: 6, Failures: 1, Errors: 0, Skipped: 0, Time elapsed: 74.05 s <<< FAILURE! - in org.apache.maven.surefire.its.JUnitPlatformIT
[2019-04-04T02:18:16.006Z] [ERROR] testJupiterEngineWithDisplayNames(org.apache.maven.surefire.its.JUnitPlatformIT)  Time elapsed: 9.275 s  <<< FAILURE!
[2019-04-04T02:18:16.006Z] junit.framework.AssertionFailedError: Did not find expected message in log
[2019-04-04T02:18:16.006Z] 	at org.apache.maven.surefire.its.JUnitPlatformIT.testJupiterEngineWithDisplayNames(JUnitPlatformIT.java:55)
[2019-04-04T02:18:16.006Z] 
[2019-04-04T02:18:16.006Z] [INFO] 
[2019-04-04T02:18:16.006Z] [INFO] Results:
[2019-04-04T02:18:16.006Z] [INFO] 
[2019-04-04T02:18:16.006Z] [ERROR] Failures: 
[2019-04-04T02:18:16.006Z] [ERROR]   JUnitPlatformIT.testJupiterEngineWithDisplayNames:55 Did not find expected message in log
[2019-04-04T02:18:16.006Z] [INFO] 
[2019-04-04T02:18:16.006Z] [ERROR] Tests run: 6, Failures: 1, Errors: 0, Skipped: 0
[2019-04-04T02:18:16.006Z] [INFO] 
[2019-04-04T02:18:16.006Z] [INFO] 
[2019-04-04T02:18:16.006Z] [INFO] --- maven-checkstyle-plugin:3.0.0:check (checkstyle-check) @ surefire-its ---
[2019-04-04T02:18:16.006Z] [INFO] 
[2019-04-04T02:18:16.006Z] [INFO] --- maven-failsafe-plugin:3.0.0-M3:verify (default) @ surefire-its ---
[2019-04-04T02:18:16.006Z] [INFO] Failsafe report directory: C:\Users\jenkins\AppData\Local\Temp\2\jenkins-maven-box-maven-surefire-1546-1222-7\surefire-its\target\failsafe-reports
[2019-04-04T02:18:16.006Z] [INFO] ------------------------------------------------------------------------
[2019-04-04T02:18:16.006Z] [INFO] Reactor Summary for Apache Maven Surefire 3.0.0-SNAPSHOT:
[2019-04-04T02:18:16.006Z] [INFO] 
[2019-04-04T02:18:16.006Z] [INFO] Apache Maven Surefire .............................. SUCCESS [01:26 min]
[2019-04-04T02:18:16.006Z] [INFO] SureFire Logger API ................................ SUCCESS [ 19.861 s]
[2019-04-04T02:18:16.006Z] [INFO] SureFire API ....................................... SUCCESS [ 23.852 s]
[2019-04-04T02:18:16.006Z] [INFO] SureFire Booter .................................... SUCCESS [ 22.509 s]
[2019-04-04T02:18:16.006Z] [INFO] Maven Surefire Test-Grouping Support ............... SUCCESS [ 14.002 s]
[2019-04-04T02:18:16.006Z] [INFO] SureFire Providers ................................. SUCCESS [  1.839 s]
[2019-04-04T02:18:16.006Z] [INFO] Shared JUnit3 Provider Code ........................ SUCCESS [  7.078 s]
[2019-04-04T02:18:16.006Z] [INFO] Shared Java 5 Provider Base ........................ SUCCESS [  9.322 s]
[2019-04-04T02:18:16.006Z] [INFO] Shared JUnit4 Provider Code ........................ SUCCESS [  9.285 s]
[2019-04-04T02:18:16.006Z] [INFO] Shared JUnit48 Provider Code ....................... SUCCESS [ 10.106 s]
[2019-04-04T02:18:16.006Z] [INFO] SureFire JUnit Runner .............................. SUCCESS [  7.530 s]
[2019-04-04T02:18:16.006Z] [INFO] SureFire JUnit4 Runner ............................. SUCCESS [ 37.879 s]
[2019-04-04T02:18:16.006Z] [INFO] Maven Surefire Common .............................. SUCCESS [ 38.807 s]
[2019-04-04T02:18:16.006Z] [INFO] SureFire JUnitCore Runner .......................... SUCCESS [02:26 min]
[2019-04-04T02:18:16.006Z] [INFO] SureFire JUnit Platform Runner ..................... SUCCESS [ 15.063 s]
[2019-04-04T02:18:16.006Z] [INFO] SureFire TestNG Utils .............................. SUCCESS [  7.898 s]
[2019-04-04T02:18:16.006Z] [INFO] SureFire TestNG Runner ............................. SUCCESS [  7.942 s]
[2019-04-04T02:18:16.006Z] [INFO] ShadeFire JUnit3 Provider .......................... SUCCESS [  2.878 s]
[2019-04-04T02:18:16.006Z] [INFO] Surefire Report Parser ............................. SUCCESS [ 10.355 s]
[2019-04-04T02:18:16.006Z] [INFO] Maven Surefire Plugin .............................. SUCCESS [ 20.574 s]
[2019-04-04T02:18:16.006Z] [INFO] Maven Failsafe Plugin .............................. SUCCESS [02:12 min]
[2019-04-04T02:18:16.006Z] [INFO] Maven Surefire Report Plugin ....................... SUCCESS [ 24.692 s]
[2019-04-04T02:18:16.006Z] [INFO] Maven Surefire Integration Tests ................... FAILURE [01:59 min]
[2019-04-04T02:18:16.006Z] [INFO] ------------------------------------------------------------------------
[2019-04-04T02:18:16.006Z] [INFO] BUILD FAILURE
[2019-04-04T02:18:16.006Z] [INFO] ------------------------------------------------------------------------
[2019-04-04T02:18:16.006Z] [INFO] Total time:  13:01 min
[2019-04-04T02:18:16.006Z] [INFO] Finished at: 2019-04-03T19:18:07-07:00
[2019-04-04T02:18:16.006Z] [INFO] ------------------------------------------------------------------------
[2019-04-04T02:18:16.006Z] [ERROR] Failed to execute goal org.apache.maven.plugins:maven-failsafe-plugin:3.0.0-M3:verify (default) on project surefire-its: There are test failures.
[2019-04-04T02:18:16.006Z] [ERROR] 
[2019-04-04T02:18:16.006Z] [ERROR] Please refer to C:\Users\jenkins\AppData\Local\Temp\2\jenkins-maven-box-maven-surefire-1546-1222-7\surefire-its\target\failsafe-reports for the individual test results.
[2019-04-04T02:18:16.006Z] [ERROR] Please refer to dump files (if any exist) [date].dump, [date]-jvmRun[N].dump and [date].dumpstream.
[2019-04-04T02:18:16.006Z] [ERROR] -> [Help 1]
[2019-04-04T02:18:16.006Z] org.apache.maven.lifecycle.LifecycleExecutionException: Failed to execute goal org.apache.maven.plugins:maven-failsafe-plugin:3.0.0-M3:verify (default) on project surefire-its: There are test failures.
[2019-04-04T02:18:16.006Z] 
[2019-04-04T02:18:16.006Z] Please refer to C:\Users\jenkins\AppData\Local\Temp\2\jenkins-maven-box-maven-surefire-1546-1222-7\surefire-its\target\failsafe-reports for the individual test results.
[2019-04-04T02:18:16.006Z] Please refer to dump files (if any exist) [date].dump, [date]-jvmRun[N].dump and [date].dumpstream.
[2019-04-04T02:18:16.006Z]     at org.apache.maven.lifecycle.internal.MojoExecutor.execute (MojoExecutor.java:215)
[2019-04-04T02:18:16.006Z]     at org.apache.maven.lifecycle.internal.MojoExecutor.execute (MojoExecutor.java:156)
[2019-04-04T02:18:16.006Z]     at org.apache.maven.lifecycle.internal.MojoExecutor.execute (MojoExecutor.java:148)
[2019-04-04T02:18:16.006Z]     at org.apache.maven.lifecycle.internal.LifecycleModuleBuilder.buildProject (LifecycleModuleBuilder.java:117)
[2019-04-04T02:18:16.007Z]     at org.apache.maven.lifecycle.internal.LifecycleModuleBuilder.buildProject (LifecycleModuleBuilder.java:81)
[2019-04-04T02:18:16.007Z]     at org.apache.maven.lifecycle.internal.builder.singlethreaded.SingleThreadedBuilder.build (SingleThreadedBuilder.java:56)
[2019-04-04T02:18:16.007Z]     at org.apache.maven.lifecycle.internal.LifecycleStarter.execute (LifecycleStarter.java:128)
[2019-04-04T02:18:16.007Z]     at org.apache.maven.DefaultMaven.doExecute (DefaultMaven.java:305)
[2019-04-04T02:18:16.007Z]     at org.apache.maven.DefaultMaven.doExecute (DefaultMaven.java:192)
[2019-04-04T02:18:16.007Z]     at org.apache.maven.DefaultMaven.execute (DefaultMaven.java:105)
[2019-04-04T02:18:16.007Z]     at org.apache.maven.cli.MavenCli.execute (MavenCli.java:956)
[2019-04-04T02:18:16.007Z]     at org.apache.maven.cli.MavenCli.doMain (MavenCli.java:288)
[2019-04-04T02:18:16.007Z]     at org.apache.maven.cli.MavenCli.main (MavenCli.java:192)
[2019-04-04T02:18:16.007Z]     at sun.reflect.NativeMethodAccessorImpl.invoke0 (Native Method)
[2019-04-04T02:18:16.007Z]     at sun.reflect.NativeMethodAccessorImpl.invoke (NativeMethodAccessorImpl.java:62)
[2019-04-04T02:18:16.007Z]     at sun.reflect.DelegatingMethodAccessorImpl.invoke (DelegatingMethodAccessorImpl.java:43)
[2019-04-04T02:18:16.007Z]     at java.lang.reflect.Method.invoke (Method.java:498)
[2019-04-04T02:18:16.007Z]     at org.codehaus.plexus.classworlds.launcher.Launcher.launchEnhanced (Launcher.java:289)
[2019-04-04T02:18:16.007Z]     at org.codehaus.plexus.classworlds.launcher.Launcher.launch (Launcher.java:229)
[2019-04-04T02:18:16.007Z]     at org.codehaus.plexus.classworlds.launcher.Launcher.mainWithExitCode (Launcher.java:415)
[2019-04-04T02:18:16.007Z]     at org.codehaus.plexus.classworlds.launcher.Launcher.main (Launcher.java:356)
[2019-04-04T02:18:16.007Z] Caused by: org.apache.maven.plugin.MojoFailureException: There are test failures.
[2019-04-04T02:18:16.007Z] 
[2019-04-04T02:18:16.007Z] Please refer to C:\Users\jenkins\AppData\Local\Temp\2\jenkins-maven-box-maven-surefire-1546-1222-7\surefire-its\target\failsafe-reports for the individual test results.
[2019-04-04T02:18:16.007Z] Please refer to dump files (if any exist) [date].dump, [date]-jvmRun[N].dump and [date].dumpstream.
[2019-04-04T02:18:16.007Z]     at org.apache.maven.plugin.surefire.SurefireHelper.throwException (SurefireHelper.java:271)
[2019-04-04T02:18:16.007Z]     at org.apache.maven.plugin.surefire.SurefireHelper.reportExecution (SurefireHelper.java:159)
[2019-04-04T02:18:16.007Z]     at org.apache.maven.plugin.failsafe.VerifyMojo.execute (VerifyMojo.java:192)
[2019-04-04T02:18:16.007Z]     at org.apache.maven.plugin.DefaultBuildPluginManager.executeMojo (DefaultBuildPluginManager.java:137)
[2019-04-04T02:18:16.007Z]     at org.apache.maven.lifecycle.internal.MojoExecutor.execute (MojoExecutor.java:210)
[2019-04-04T02:18:16.007Z]     at org.apache.maven.lifecycle.internal.MojoExecutor.execute (MojoExecutor.java:156)
[2019-04-04T02:18:16.007Z]     at org.apache.maven.lifecycle.internal.MojoExecutor.execute (MojoExecutor.java:148)
[2019-04-04T02:18:16.007Z]     at org.apache.maven.lifecycle.internal.LifecycleModuleBuilder.buildProject (LifecycleModuleBuilder.java:117)
[2019-04-04T02:18:16.007Z]     at org.apache.maven.lifecycle.internal.LifecycleModuleBuilder.buildProject (LifecycleModuleBuilder.java:81)
[2019-04-04T02:18:16.007Z]     at org.apache.maven.lifecycle.internal.builder.singlethreaded.SingleThreadedBuilder.build (SingleThreadedBuilder.java:56)
[2019-04-04T02:18:16.007Z]     at org.apache.maven.lifecycle.internal.LifecycleStarter.execute (LifecycleStarter.java:128)
[2019-04-04T02:18:16.007Z]     at org.apache.maven.DefaultMaven.doExecute (DefaultMaven.java:305)
[2019-04-04T02:18:16.007Z]     at org.apache.maven.DefaultMaven.doExecute (DefaultMaven.java:192)
[2019-04-04T02:18:16.007Z]     at org.apache.maven.DefaultMaven.execute (DefaultMaven.java:105)
[2019-04-04T02:18:16.007Z]     at org.apache.maven.cli.MavenCli.execute (MavenCli.java:956)
[2019-04-04T02:18:16.007Z]     at org.apache.maven.cli.MavenCli.doMain (MavenCli.java:288)
[2019-04-04T02:18:16.007Z]     at org.apache.maven.cli.MavenCli.main (MavenCli.java:192)
[2019-04-04T02:18:16.007Z]     at sun.reflect.NativeMethodAccessorImpl.invoke0 (Native Method)
[2019-04-04T02:18:16.007Z]     at sun.reflect.NativeMethodAccessorImpl.invoke (NativeMethodAccessorImpl.java:62)
[2019-04-04T02:18:16.007Z]     at sun.reflect.DelegatingMethodAccessorImpl.invoke (DelegatingMethodAccessorImpl.java:43)
[2019-04-04T02:18:16.007Z]     at java.lang.reflect.Method.invoke (Method.java:498)
[2019-04-04T02:18:16.007Z]     at org.codehaus.plexus.classworlds.launcher.Launcher.launchEnhanced (Launcher.java:289)
[2019-04-04T02:18:16.007Z]     at org.codehaus.plexus.classworlds.launcher.Launcher.launch (Launcher.java:229)
[2019-04-04T02:18:16.007Z]     at org.codehaus.plexus.classworlds.launcher.Launcher.mainWithExitCode (Launcher.java:415)
[2019-04-04T02:18:16.007Z]     at org.codehaus.plexus.classworlds.launcher.Launcher.main (Launcher.java:356)
[2019-04-04T02:18:16.007Z] [ERROR] 
[2019-04-04T02:18:16.007Z] [ERROR] Re-run Maven using the -X switch to enable full debug logging.
[2019-04-04T02:18:16.007Z] [ERROR] 
[2019-04-04T02:18:16.007Z] [ERROR] For more information about the errors and possible solutions, please read the following articles:
[2019-04-04T02:18:16.007Z] [ERROR] [Help 1] http://cwiki.apache.org/confluence/display/MAVEN/MojoFailureException
[2019-04-04T02:18:16.007Z] [ERROR] 
[2019-04-04T02:18:16.007Z] [ERROR] After correcting the problems, you can resume the build with the command
[2019-04-04T02:18:16.007Z] [ERROR]   mvn <goals> -rf :surefire-its
[Pipeline] }
[Pipeline] // withEnv
[Pipeline] }
[Pipeline] // stage
[Pipeline] fileExists
[Pipeline] zip
[2019-04-04T02:18:16.220Z] Writing zip file of C:\Users\jenkins\AppData\Local\Temp\2\jenkins-maven-box-maven-surefire-1546-1222-7\maven-failsafe-plugin\target\it to C:\Users\jenkins\AppData\Local\Temp\2\jenkins-maven-box-maven-surefire-1546-1222-7\maven-failsafe-plugin--windows-jdk8-maven3.6.x.zip
[2019-04-04T02:18:16.363Z] Zipped 78 entries.
[2019-04-04T02:18:16.364Z] Archiving C:\Users\jenkins\AppData\Local\Temp\2\jenkins-maven-box-maven-surefire-1546-1222-7\maven-failsafe-plugin--windows-jdk8-maven3.6.x.zip
[2019-04-04T02:18:16.364Z] [Fast Archiver] No prior successful build to compare, so performing full copy of artifacts
[Pipeline] fileExists
[Pipeline] zip
[2019-04-04T02:18:16.508Z] Writing zip file of C:\Users\jenkins\AppData\Local\Temp\2\jenkins-maven-box-maven-surefire-1546-1222-7\surefire-its\target to C:\Users\jenkins\AppData\Local\Temp\2\jenkins-maven-box-maven-surefire-1546-1222-7\surefire-its--windows-jdk8-maven3.6.x.zip
[2019-04-04T02:18:18.896Z] Zipped 1963 entries.
[2019-04-04T02:18:18.896Z] Archiving C:\Users\jenkins\AppData\Local\Temp\2\jenkins-maven-box-maven-surefire-1546-1222-7\surefire-its--windows-jdk8-maven3.6.x.zip
[2019-04-04T02:18:18.896Z] [Fast Archiver] No prior successful build to compare, so performing full copy of artifacts
[Pipeline] archiveArtifacts
[2019-04-04T02:18:19.258Z] Archiving artifacts
[2019-04-04T02:18:19.280Z] [Fast Archiver] No prior successful build to compare, so performing full copy of artifacts
[Pipeline] cleanWs
[2019-04-04T02:18:19.818Z] [WS-CLEANUP] Deleting project workspace...
[2019-04-04T02:18:19.818Z] [WS-CLEANUP] Deferred wipeout is used...
[2019-04-04T02:18:19.900Z] [WS-CLEANUP] done
[Pipeline] }
[Pipeline] // ws
[Pipeline] }
[Pipeline] // timestamps
[Pipeline] }
[Pipeline] // node
[Pipeline] }
[Pipeline] // parallel
[Pipeline] echo
Build result: FAILURE
[Pipeline] jiraIssueSelector
[Pipeline] emailext

Build failed in Jenkins: Maven TLP » maven-surefire » 1546-1222 #6

Posted by Apache Jenkins Server <je...@builds.apache.org>.
See https://builds.apache.org/job/maven-box/job/maven-surefire/job/1546-1222/6/

Changes:

* saved network traffic
* saved network traffic
* saved network traffic
* saved network traffic
* saved network traffic
* saved network traffic
* saved network traffic
* saved network traffic

1 tests failed.
FAILED:  org.apache.maven.surefire.its.JUnitPlatformIT.testJupiterEngineWithDisplayNames

Error Message:
Did not find expected message in log

Stack Trace:
junit.framework.AssertionFailedError: Did not find expected message in log
	at org.apache.maven.surefire.its.JUnitPlatformIT.testJupiterEngineWithDisplayNames(JUnitPlatformIT.java:55)




Build log:
[...truncated 44210 lines...]
[2019-04-03T23:29:43.026Z] [ERROR] Failed to execute goal org.apache.maven.plugins:maven-failsafe-plugin:3.0.0-M3:verify (default) on project surefire-its: There are test failures.
[2019-04-03T23:29:43.026Z] [ERROR] 
[2019-04-03T23:29:43.026Z] [ERROR] Please refer to C:\Users\jenkins\AppData\Local\Temp\2\jenkins-maven-box-maven-surefire-1546-1222-6@2\surefire-its\target\failsafe-reports for the individual test results.
[2019-04-03T23:29:43.026Z] [ERROR] Please refer to dump files (if any exist) [date].dump, [date]-jvmRun[N].dump and [date].dumpstream.
[2019-04-03T23:29:43.026Z] [ERROR] -> [Help 1]
[2019-04-03T23:29:43.026Z] org.apache.maven.lifecycle.LifecycleExecutionException: Failed to execute goal org.apache.maven.plugins:maven-failsafe-plugin:3.0.0-M3:verify (default) on project surefire-its: There are test failures.
[2019-04-03T23:29:43.026Z] 
[2019-04-03T23:29:43.026Z] Please refer to C:\Users\jenkins\AppData\Local\Temp\2\jenkins-maven-box-maven-surefire-1546-1222-6@2\surefire-its\target\failsafe-reports for the individual test results.
[2019-04-03T23:29:43.026Z] Please refer to dump files (if any exist) [date].dump, [date]-jvmRun[N].dump and [date].dumpstream.
[2019-04-03T23:29:43.026Z]     at org.apache.maven.lifecycle.internal.MojoExecutor.execute (MojoExecutor.java:215)
[2019-04-03T23:29:43.026Z]     at org.apache.maven.lifecycle.internal.MojoExecutor.execute (MojoExecutor.java:156)
[2019-04-03T23:29:43.026Z]     at org.apache.maven.lifecycle.internal.MojoExecutor.execute (MojoExecutor.java:148)
[2019-04-03T23:29:43.026Z]     at org.apache.maven.lifecycle.internal.LifecycleModuleBuilder.buildProject (LifecycleModuleBuilder.java:117)
[2019-04-03T23:29:43.026Z]     at org.apache.maven.lifecycle.internal.LifecycleModuleBuilder.buildProject (LifecycleModuleBuilder.java:81)
[2019-04-03T23:29:43.026Z]     at org.apache.maven.lifecycle.internal.builder.singlethreaded.SingleThreadedBuilder.build (SingleThreadedBuilder.java:56)
[2019-04-03T23:29:43.027Z]     at org.apache.maven.lifecycle.internal.LifecycleStarter.execute (LifecycleStarter.java:128)
[2019-04-03T23:29:43.027Z]     at org.apache.maven.DefaultMaven.doExecute (DefaultMaven.java:305)
[2019-04-03T23:29:43.027Z]     at org.apache.maven.DefaultMaven.doExecute (DefaultMaven.java:192)
[2019-04-03T23:29:43.027Z]     at org.apache.maven.DefaultMaven.execute (DefaultMaven.java:105)
[2019-04-03T23:29:43.027Z]     at org.apache.maven.cli.MavenCli.execute (MavenCli.java:956)
[2019-04-03T23:29:43.027Z]     at org.apache.maven.cli.MavenCli.doMain (MavenCli.java:288)
[2019-04-03T23:29:43.027Z]     at org.apache.maven.cli.MavenCli.main (MavenCli.java:192)
[2019-04-03T23:29:43.027Z]     at sun.reflect.NativeMethodAccessorImpl.invoke0 (Native Method)
[2019-04-03T23:29:43.027Z]     at sun.reflect.NativeMethodAccessorImpl.invoke (NativeMethodAccessorImpl.java:62)
[2019-04-03T23:29:43.027Z]     at sun.reflect.DelegatingMethodAccessorImpl.invoke (DelegatingMethodAccessorImpl.java:43)
[2019-04-03T23:29:43.027Z]     at java.lang.reflect.Method.invoke (Method.java:498)
[2019-04-03T23:29:43.027Z]     at org.codehaus.plexus.classworlds.launcher.Launcher.launchEnhanced (Launcher.java:289)
[2019-04-03T23:29:43.027Z]     at org.codehaus.plexus.classworlds.launcher.Launcher.launch (Launcher.java:229)
[2019-04-03T23:29:43.027Z]     at org.codehaus.plexus.classworlds.launcher.Launcher.mainWithExitCode (Launcher.java:415)
[2019-04-03T23:29:43.027Z]     at org.codehaus.plexus.classworlds.launcher.Launcher.main (Launcher.java:356)
[2019-04-03T23:29:43.027Z] Caused by: org.apache.maven.plugin.MojoFailureException: There are test failures.
[2019-04-03T23:29:43.027Z] 
[2019-04-03T23:29:43.027Z] Please refer to C:\Users\jenkins\AppData\Local\Temp\2\jenkins-maven-box-maven-surefire-1546-1222-6@2\surefire-its\target\failsafe-reports for the individual test results.
[2019-04-03T23:29:43.027Z] Please refer to dump files (if any exist) [date].dump, [date]-jvmRun[N].dump and [date].dumpstream.
[2019-04-03T23:29:43.027Z]     at org.apache.maven.plugin.surefire.SurefireHelper.throwException (SurefireHelper.java:271)
[2019-04-03T23:29:43.027Z]     at org.apache.maven.plugin.surefire.SurefireHelper.reportExecution (SurefireHelper.java:159)
[2019-04-03T23:29:43.027Z]     at org.apache.maven.plugin.failsafe.VerifyMojo.execute (VerifyMojo.java:192)
[2019-04-03T23:29:43.027Z]     at org.apache.maven.plugin.DefaultBuildPluginManager.executeMojo (DefaultBuildPluginManager.java:137)
[2019-04-03T23:29:43.027Z]     at org.apache.maven.lifecycle.internal.MojoExecutor.execute (MojoExecutor.java:210)
[2019-04-03T23:29:43.027Z]     at org.apache.maven.lifecycle.internal.MojoExecutor.execute (MojoExecutor.java:156)
[2019-04-03T23:29:43.027Z]     at org.apache.maven.lifecycle.internal.MojoExecutor.execute (MojoExecutor.java:148)
[2019-04-03T23:29:43.027Z]     at org.apache.maven.lifecycle.internal.LifecycleModuleBuilder.buildProject (LifecycleModuleBuilder.java:117)
[2019-04-03T23:29:43.027Z]     at org.apache.maven.lifecycle.internal.LifecycleModuleBuilder.buildProject (LifecycleModuleBuilder.java:81)
[2019-04-03T23:29:43.027Z]     at org.apache.maven.lifecycle.internal.builder.singlethreaded.SingleThreadedBuilder.build (SingleThreadedBuilder.java:56)
[2019-04-03T23:29:43.027Z]     at org.apache.maven.lifecycle.internal.LifecycleStarter.execute (LifecycleStarter.java:128)
[2019-04-03T23:29:43.027Z]     at org.apache.maven.DefaultMaven.doExecute (DefaultMaven.java:305)
[2019-04-03T23:29:43.027Z]     at org.apache.maven.DefaultMaven.doExecute (DefaultMaven.java:192)
[2019-04-03T23:29:43.027Z]     at org.apache.maven.DefaultMaven.execute (DefaultMaven.java:105)
[2019-04-03T23:29:43.027Z]     at org.apache.maven.cli.MavenCli.execute (MavenCli.java:956)
[2019-04-03T23:29:43.027Z]     at org.apache.maven.cli.MavenCli.doMain (MavenCli.java:288)
[2019-04-03T23:29:43.027Z]     at org.apache.maven.cli.MavenCli.main (MavenCli.java:192)
[2019-04-03T23:29:43.027Z]     at sun.reflect.NativeMethodAccessorImpl.invoke0 (Native Method)
[2019-04-03T23:29:43.027Z]     at sun.reflect.NativeMethodAccessorImpl.invoke (NativeMethodAccessorImpl.java:62)
[2019-04-03T23:29:43.027Z]     at sun.reflect.DelegatingMethodAccessorImpl.invoke (DelegatingMethodAccessorImpl.java:43)
[2019-04-03T23:29:43.027Z]     at java.lang.reflect.Method.invoke (Method.java:498)
[2019-04-03T23:29:43.027Z]     at org.codehaus.plexus.classworlds.launcher.Launcher.launchEnhanced (Launcher.java:289)
[2019-04-03T23:29:43.027Z]     at org.codehaus.plexus.classworlds.launcher.Launcher.launch (Launcher.java:229)
[2019-04-03T23:29:43.027Z] [ERROR] Tests run: 6, Failures: 1, Errors: 0, Skipped: 0, Time elapsed: 67.805 s <<< FAILURE! - in org.apache.maven.surefire.its.JUnitPlatformIT
[2019-04-03T23:29:43.027Z]     at org.codehaus.plexus.classworlds.launcher.Launcher.mainWithExitCode (Launcher.java:415)
[2019-04-03T23:29:43.027Z]     at org.codehaus.plexus.classworlds.launcher.Launcher.main (Launcher.java:356)
[2019-04-03T23:29:43.027Z] [ERROR] testJupiterEngineWithDisplayNames(org.apache.maven.surefire.its.JUnitPlatformIT)  Time elapsed: 8.712 s  <<< FAILURE!
[2019-04-03T23:29:43.027Z] [ERROR] 
[2019-04-03T23:29:43.028Z] junit.framework.AssertionFailedError: Did not find expected message in log
[2019-04-03T23:29:43.028Z] [ERROR] Re-run Maven using the -X switch to enable full debug logging.
[2019-04-03T23:29:43.028Z] [ERROR] 
[2019-04-03T23:29:43.028Z] 	at org.apache.maven.surefire.its.JUnitPlatformIT.testJupiterEngineWithDisplayNames(JUnitPlatformIT.java:55)
[2019-04-03T23:29:43.028Z] 
[2019-04-03T23:29:43.028Z] [ERROR] For more information about the errors and possible solutions, please read the following articles:
[2019-04-03T23:29:43.028Z] [INFO] 
[2019-04-03T23:29:43.028Z] [INFO] Results:
[2019-04-03T23:29:43.028Z] [ERROR] [Help 1] http://cwiki.apache.org/confluence/display/MAVEN/MojoFailureException
[2019-04-03T23:29:43.028Z] [ERROR] 
[2019-04-03T23:29:43.028Z] [INFO] 
[2019-04-03T23:29:43.028Z] [ERROR] Failures: 
[2019-04-03T23:29:43.028Z] [ERROR] After correcting the problems, you can resume the build with the command
[2019-04-03T23:29:43.028Z] [ERROR]   mvn <goals> -rf :surefire-its
[2019-04-03T23:29:43.028Z] [ERROR]   JUnitPlatformIT.testJupiterEngineWithDisplayNames:55 Did not find expected message in log
[2019-04-03T23:29:43.028Z] [INFO] 
[2019-04-03T23:29:43.028Z] [ERROR] Tests run: 6, Failures: 1, Errors: 0, Skipped: 0
[2019-04-03T23:29:43.028Z] [INFO] 
[2019-04-03T23:29:43.028Z] [INFO] 
[2019-04-03T23:29:43.028Z] [INFO] --- maven-checkstyle-plugin:3.0.0:check (checkstyle-check) @ surefire-its ---
[2019-04-03T23:29:43.028Z] [INFO] 
[2019-04-03T23:29:43.028Z] [INFO] --- maven-failsafe-plugin:3.0.0-M3:verify (default) @ surefire-its ---
[2019-04-03T23:29:43.028Z] [INFO] Failsafe report directory: C:\Users\jenkins\AppData\Local\Temp\2\jenkins-maven-box-maven-surefire-1546-1222-6\surefire-its\target\failsafe-reports
[2019-04-03T23:29:43.028Z] [INFO] ------------------------------------------------------------------------
[2019-04-03T23:29:43.028Z] [INFO] Reactor Summary for Apache Maven Surefire 3.0.0-SNAPSHOT:
[2019-04-03T23:29:43.028Z] [INFO] 
[2019-04-03T23:29:43.028Z] [INFO] Apache Maven Surefire .............................. SUCCESS [01:04 min]
[2019-04-03T23:29:43.028Z] [INFO] SureFire Logger API ................................ SUCCESS [ 12.392 s]
[2019-04-03T23:29:43.028Z] [INFO] SureFire API ....................................... SUCCESS [ 23.974 s]
[2019-04-03T23:29:43.028Z] [INFO] SureFire Booter .................................... SUCCESS [ 24.448 s]
[2019-04-03T23:29:43.028Z] [INFO] Maven Surefire Test-Grouping Support ............... SUCCESS [ 14.357 s]
[2019-04-03T23:29:43.028Z] [INFO] SureFire Providers ................................. SUCCESS [  1.624 s]
[2019-04-03T23:29:43.028Z] [INFO] Shared JUnit3 Provider Code ........................ SUCCESS [  7.804 s]
[2019-04-03T23:29:43.028Z] [INFO] Shared Java 5 Provider Base ........................ SUCCESS [  9.824 s]
[2019-04-03T23:29:43.028Z] [INFO] Shared JUnit4 Provider Code ........................ SUCCESS [  9.386 s]
[2019-04-03T23:29:43.028Z] [INFO] Shared JUnit48 Provider Code ....................... SUCCESS [ 10.468 s]
[2019-04-03T23:29:43.028Z] [INFO] SureFire JUnit Runner .............................. SUCCESS [  7.852 s]
[2019-04-03T23:29:43.028Z] [INFO] SureFire JUnit4 Runner ............................. SUCCESS [  8.100 s]
[2019-04-03T23:29:43.028Z] [INFO] Maven Surefire Common .............................. SUCCESS [ 48.354 s]
[2019-04-03T23:29:43.028Z] [INFO] SureFire JUnitCore Runner .......................... SUCCESS [02:23 min]
[2019-04-03T23:29:43.028Z] [INFO] SureFire JUnit Platform Runner ..................... SUCCESS [ 16.518 s]
[2019-04-03T23:29:43.028Z] [INFO] SureFire TestNG Utils .............................. SUCCESS [  8.735 s]
[2019-04-03T23:29:43.028Z] [INFO] SureFire TestNG Runner ............................. SUCCESS [  9.908 s]
[2019-04-03T23:29:43.028Z] [INFO] ShadeFire JUnit3 Provider .......................... SUCCESS [  2.849 s]
[2019-04-03T23:29:43.028Z] [INFO] Surefire Report Parser ............................. SUCCESS [ 12.074 s]
[2019-04-03T23:29:43.028Z] [INFO] Maven Surefire Plugin .............................. SUCCESS [ 20.579 s]
[2019-04-03T23:29:43.028Z] [INFO] Maven Failsafe Plugin .............................. SUCCESS [02:21 min]
[2019-04-03T23:29:43.028Z] [INFO] Maven Surefire Report Plugin ....................... SUCCESS [ 24.088 s]
[2019-04-03T23:29:43.028Z] [INFO] Maven Surefire Integration Tests ................... FAILURE [01:53 min]
[2019-04-03T23:29:43.028Z] [INFO] ------------------------------------------------------------------------
[2019-04-03T23:29:43.028Z] [INFO] BUILD FAILURE
[2019-04-03T23:29:43.028Z] [INFO] ------------------------------------------------------------------------
[2019-04-03T23:29:43.028Z] [INFO] Total time:  12:18 min
[2019-04-03T23:29:43.028Z] [INFO] Finished at: 2019-04-03T16:29:41-07:00
[2019-04-03T23:29:43.028Z] [INFO] ------------------------------------------------------------------------
[2019-04-03T23:29:43.028Z] [ERROR] Failed to execute goal org.apache.maven.plugins:maven-failsafe-plugin:3.0.0-M3:verify (default) on project surefire-its: There are test failures.
[2019-04-03T23:29:43.028Z] [ERROR] 
[2019-04-03T23:29:43.028Z] [ERROR] Please refer to C:\Users\jenkins\AppData\Local\Temp\2\jenkins-maven-box-maven-surefire-1546-1222-6\surefire-its\target\failsafe-reports for the individual test results.
[2019-04-03T23:29:43.028Z] [ERROR] Please refer to dump files (if any exist) [date].dump, [date]-jvmRun[N].dump and [date].dumpstream.
[2019-04-03T23:29:43.028Z] [ERROR] -> [Help 1]
[2019-04-03T23:29:43.028Z] org.apache.maven.lifecycle.LifecycleExecutionException: Failed to execute goal org.apache.maven.plugins:maven-failsafe-plugin:3.0.0-M3:verify (default) on project surefire-its: There are test failures.
[2019-04-03T23:29:43.028Z] 
[2019-04-03T23:29:43.028Z] Please refer to C:\Users\jenkins\AppData\Local\Temp\2\jenkins-maven-box-maven-surefire-1546-1222-6\surefire-its\target\failsafe-reports for the individual test results.
[2019-04-03T23:29:43.028Z] Please refer to dump files (if any exist) [date].dump, [date]-jvmRun[N].dump and [date].dumpstream.
[2019-04-03T23:29:43.028Z]     at org.apache.maven.lifecycle.internal.MojoExecutor.execute (MojoExecutor.java:215)
[2019-04-03T23:29:43.028Z]     at org.apache.maven.lifecycle.internal.MojoExecutor.execute (MojoExecutor.java:156)
[2019-04-03T23:29:43.028Z]     at org.apache.maven.lifecycle.internal.MojoExecutor.execute (MojoExecutor.java:148)
[2019-04-03T23:29:43.028Z]     at org.apache.maven.lifecycle.internal.LifecycleModuleBuilder.buildProject (LifecycleModuleBuilder.java:117)
[2019-04-03T23:29:43.028Z]     at org.apache.maven.lifecycle.internal.LifecycleModuleBuilder.buildProject (LifecycleModuleBuilder.java:81)
[2019-04-03T23:29:43.029Z]     at org.apache.maven.lifecycle.internal.builder.singlethreaded.SingleThreadedBuilder.build (SingleThreadedBuilder.java:56)
[2019-04-03T23:29:43.029Z]     at org.apache.maven.lifecycle.internal.LifecycleStarter.execute (LifecycleStarter.java:128)
[2019-04-03T23:29:43.029Z]     at org.apache.maven.DefaultMaven.doExecute (DefaultMaven.java:305)
[2019-04-03T23:29:43.029Z]     at org.apache.maven.DefaultMaven.doExecute (DefaultMaven.java:192)
[2019-04-03T23:29:43.029Z]     at org.apache.maven.DefaultMaven.execute (DefaultMaven.java:105)
[2019-04-03T23:29:43.029Z]     at org.apache.maven.cli.MavenCli.execute (MavenCli.java:956)
[2019-04-03T23:29:43.029Z]     at org.apache.maven.cli.MavenCli.doMain (MavenCli.java:288)
[2019-04-03T23:29:43.029Z]     at org.apache.maven.cli.MavenCli.main (MavenCli.java:192)
[2019-04-03T23:29:43.029Z]     at sun.reflect.NativeMethodAccessorImpl.invoke0 (Native Method)
[2019-04-03T23:29:43.029Z]     at sun.reflect.NativeMethodAccessorImpl.invoke (NativeMethodAccessorImpl.java:62)
[2019-04-03T23:29:43.029Z]     at sun.reflect.DelegatingMethodAccessorImpl.invoke (DelegatingMethodAccessorImpl.java:43)
[2019-04-03T23:29:43.029Z]     at java.lang.reflect.Method.invoke (Method.java:498)
[2019-04-03T23:29:43.029Z]     at org.codehaus.plexus.classworlds.launcher.Launcher.launchEnhanced (Launcher.java:289)
[2019-04-03T23:29:43.029Z]     at org.codehaus.plexus.classworlds.launcher.Launcher.launch (Launcher.java:229)
[2019-04-03T23:29:43.029Z]     at org.codehaus.plexus.classworlds.launcher.Launcher.mainWithExitCode (Launcher.java:415)
[2019-04-03T23:29:43.029Z]     at org.codehaus.plexus.classworlds.launcher.Launcher.main (Launcher.java:356)
[2019-04-03T23:29:43.029Z] Caused by: org.apache.maven.plugin.MojoFailureException: There are test failures.
[2019-04-03T23:29:43.029Z] 
[2019-04-03T23:29:43.029Z] Please refer to C:\Users\jenkins\AppData\Local\Temp\2\jenkins-maven-box-maven-surefire-1546-1222-6\surefire-its\target\failsafe-reports for the individual test results.
[2019-04-03T23:29:43.029Z] Please refer to dump files (if any exist) [date].dump, [date]-jvmRun[N].dump and [date].dumpstream.
[2019-04-03T23:29:43.029Z]     at org.apache.maven.plugin.surefire.SurefireHelper.throwException (SurefireHelper.java:271)
[2019-04-03T23:29:43.029Z]     at org.apache.maven.plugin.surefire.SurefireHelper.reportExecution (SurefireHelper.java:159)
[2019-04-03T23:29:43.029Z]     at org.apache.maven.plugin.failsafe.VerifyMojo.execute (VerifyMojo.java:192)
[2019-04-03T23:29:43.029Z]     at org.apache.maven.plugin.DefaultBuildPluginManager.executeMojo (DefaultBuildPluginManager.java:137)
[2019-04-03T23:29:43.029Z]     at org.apache.maven.lifecycle.internal.MojoExecutor.execute (MojoExecutor.java:210)
[2019-04-03T23:29:43.029Z]     at org.apache.maven.lifecycle.internal.MojoExecutor.execute (MojoExecutor.java:156)
[2019-04-03T23:29:43.029Z]     at org.apache.maven.lifecycle.internal.MojoExecutor.execute (MojoExecutor.java:148)
[2019-04-03T23:29:43.029Z]     at org.apache.maven.lifecycle.internal.LifecycleModuleBuilder.buildProject (LifecycleModuleBuilder.java:117)
[2019-04-03T23:29:43.029Z]     at org.apache.maven.lifecycle.internal.LifecycleModuleBuilder.buildProject (LifecycleModuleBuilder.java:81)
[2019-04-03T23:29:43.029Z]     at org.apache.maven.lifecycle.internal.builder.singlethreaded.SingleThreadedBuilder.build (SingleThreadedBuilder.java:56)
[2019-04-03T23:29:43.029Z]     at org.apache.maven.lifecycle.internal.LifecycleStarter.execute (LifecycleStarter.java:128)
[2019-04-03T23:29:43.029Z]     at org.apache.maven.DefaultMaven.doExecute (DefaultMaven.java:305)
[2019-04-03T23:29:43.029Z]     at org.apache.maven.DefaultMaven.doExecute (DefaultMaven.java:192)
[2019-04-03T23:29:43.029Z]     at org.apache.maven.DefaultMaven.execute (DefaultMaven.java:105)
[2019-04-03T23:29:43.029Z]     at org.apache.maven.cli.MavenCli.execute (MavenCli.java:956)
[2019-04-03T23:29:43.029Z]     at org.apache.maven.cli.MavenCli.doMain (MavenCli.java:288)
[2019-04-03T23:29:43.029Z]     at org.apache.maven.cli.MavenCli.main (MavenCli.java:192)
[2019-04-03T23:29:43.029Z]     at sun.reflect.NativeMethodAccessorImpl.invoke0 (Native Method)
[2019-04-03T23:29:43.029Z]     at sun.reflect.NativeMethodAccessorImpl.invoke (NativeMethodAccessorImpl.java:62)
[2019-04-03T23:29:43.029Z]     at sun.reflect.DelegatingMethodAccessorImpl.invoke (DelegatingMethodAccessorImpl.java:43)
[2019-04-03T23:29:43.029Z]     at java.lang.reflect.Method.invoke (Method.java:498)
[2019-04-03T23:29:43.029Z]     at org.codehaus.plexus.classworlds.launcher.Launcher.launchEnhanced (Launcher.java:289)
[2019-04-03T23:29:43.029Z]     at org.codehaus.plexus.classworlds.launcher.Launcher.launch (Launcher.java:229)
[2019-04-03T23:29:43.029Z]     at org.codehaus.plexus.classworlds.launcher.Launcher.mainWithExitCode (Launcher.java:415)
[2019-04-03T23:29:43.029Z]     at org.codehaus.plexus.classworlds.launcher.Launcher.main (Launcher.java:356)
[2019-04-03T23:29:43.029Z] [ERROR] 
[2019-04-03T23:29:43.029Z] [ERROR] Re-run Maven using the -X switch to enable full debug logging.
[2019-04-03T23:29:43.029Z] [ERROR] 
[2019-04-03T23:29:43.029Z] [ERROR] For more information about the errors and possible solutions, please read the following articles:
[2019-04-03T23:29:43.029Z] [ERROR] [Help 1] http://cwiki.apache.org/confluence/display/MAVEN/MojoFailureException
[2019-04-03T23:29:43.029Z] [ERROR] 
[2019-04-03T23:29:43.029Z] [ERROR] After correcting the problems, you can resume the build with the command
[2019-04-03T23:29:43.029Z] [ERROR]   mvn <goals> -rf :surefire-its
[Pipeline] }
[Pipeline] // withEnv
[Pipeline] }
[Pipeline] }
[Pipeline] // stage
[Pipeline] // withEnv
[Pipeline] fileExists
[Pipeline] }
[Pipeline] // stage
[Pipeline] fileExists
[Pipeline] zip
[Pipeline] zip
[2019-04-03T23:29:43.374Z] Writing zip file of C:\Users\jenkins\AppData\Local\Temp\2\jenkins-maven-box-maven-surefire-1546-1222-6@2\maven-failsafe-plugin\target\it to C:\Users\jenkins\AppData\Local\Temp\2\jenkins-maven-box-maven-surefire-1546-1222-6@2\maven-failsafe-plugin--windows-jdk11-maven3.6.x.zip
[2019-04-03T23:29:43.402Z] Writing zip file of C:\Users\jenkins\AppData\Local\Temp\2\jenkins-maven-box-maven-surefire-1546-1222-6\maven-failsafe-plugin\target\it to C:\Users\jenkins\AppData\Local\Temp\2\jenkins-maven-box-maven-surefire-1546-1222-6\maven-failsafe-plugin--windows-jdk12-maven3.6.x.zip
[2019-04-03T23:29:43.543Z] Zipped 79 entries.
[2019-04-03T23:29:43.543Z] Archiving C:\Users\jenkins\AppData\Local\Temp\2\jenkins-maven-box-maven-surefire-1546-1222-6@2\maven-failsafe-plugin--windows-jdk11-maven3.6.x.zip
[2019-04-03T23:29:43.543Z] [Fast Archiver] No prior successful build to compare, so performing full copy of artifacts
[2019-04-03T23:29:43.548Z] Zipped 79 entries.
[2019-04-03T23:29:43.549Z] Archiving C:\Users\jenkins\AppData\Local\Temp\2\jenkins-maven-box-maven-surefire-1546-1222-6\maven-failsafe-plugin--windows-jdk12-maven3.6.x.zip
[2019-04-03T23:29:43.549Z] [Fast Archiver] No prior successful build to compare, so performing full copy of artifacts
[Pipeline] fileExists
[Pipeline] fileExists
[Pipeline] zip
[Pipeline] zip
[2019-04-03T23:29:43.678Z] Writing zip file of C:\Users\jenkins\AppData\Local\Temp\2\jenkins-maven-box-maven-surefire-1546-1222-6\surefire-its\target to C:\Users\jenkins\AppData\Local\Temp\2\jenkins-maven-box-maven-surefire-1546-1222-6\surefire-its--windows-jdk12-maven3.6.x.zip
[2019-04-03T23:29:43.711Z] Writing zip file of C:\Users\jenkins\AppData\Local\Temp\2\jenkins-maven-box-maven-surefire-1546-1222-6@2\surefire-its\target to C:\Users\jenkins\AppData\Local\Temp\2\jenkins-maven-box-maven-surefire-1546-1222-6@2\surefire-its--windows-jdk11-maven3.6.x.zip
[2019-04-03T23:29:46.401Z] Zipped 1963 entries.
[2019-04-03T23:29:46.401Z] Archiving C:\Users\jenkins\AppData\Local\Temp\2\jenkins-maven-box-maven-surefire-1546-1222-6\surefire-its--windows-jdk12-maven3.6.x.zip
[2019-04-03T23:29:46.402Z] [Fast Archiver] No prior successful build to compare, so performing full copy of artifacts
[2019-04-03T23:29:46.471Z] Zipped 1963 entries.
[2019-04-03T23:29:46.471Z] Archiving C:\Users\jenkins\AppData\Local\Temp\2\jenkins-maven-box-maven-surefire-1546-1222-6@2\surefire-its--windows-jdk11-maven3.6.x.zip
[2019-04-03T23:29:46.471Z] [Fast Archiver] No prior successful build to compare, so performing full copy of artifacts
[Pipeline] archiveArtifacts
[2019-04-03T23:29:46.938Z] Archiving artifacts
[2019-04-03T23:29:47.024Z] [Fast Archiver] No prior successful build to compare, so performing full copy of artifacts
[Pipeline] archiveArtifacts
[2019-04-03T23:29:47.080Z] Archiving artifacts
[2019-04-03T23:29:47.164Z] [Fast Archiver] No prior successful build to compare, so performing full copy of artifacts
[Pipeline] cleanWs
[2019-04-03T23:29:47.433Z] [WS-CLEANUP] Deleting project workspace...
[2019-04-03T23:29:47.433Z] [WS-CLEANUP] Deferred wipeout is used...
[2019-04-03T23:29:47.510Z] [WS-CLEANUP] done
[Pipeline] }
[Pipeline] // ws
[Pipeline] }
[Pipeline] cleanWs
[2019-04-03T23:29:47.600Z] [WS-CLEANUP] Deleting project workspace...
[2019-04-03T23:29:47.600Z] [WS-CLEANUP] Deferred wipeout is used...
[Pipeline] // timestamps
[Pipeline] }
[2019-04-03T23:29:47.681Z] [WS-CLEANUP] done
[Pipeline] // node
[Pipeline] }
[Pipeline] }
[Pipeline] // ws
[Pipeline] }
[Pipeline] // timestamps
[Pipeline] }
[Pipeline] // node
[Pipeline] }
[Pipeline] // parallel
[Pipeline] echo
Build result: FAILURE
[Pipeline] jiraIssueSelector
[Pipeline] emailext

Build failed in Jenkins: Maven TLP » maven-surefire » 1546-1222 #5

Posted by Apache Jenkins Server <je...@builds.apache.org>.
See https://builds.apache.org/job/maven-box/job/maven-surefire/job/1546-1222/5/

Changes:

* covered ForkedChannelDecoder and ForkedChannelEncoder
* covered ForkedChannelDecoder and ForkedChannelEncoder
* covered ForkedChannelDecoder and ForkedChannelEncoder
* covered ForkedChannelDecoder and ForkedChannelEncoder
* covered ForkedChannelDecoder and ForkedChannelEncoder
* covered ForkedChannelDecoder and ForkedChannelEncoder
* covered ForkedChannelDecoder and ForkedChannelEncoder
* covered ForkedChannelDecoder and ForkedChannelEncoder

1 tests failed.
FAILED:  org.apache.maven.surefire.its.JUnitPlatformIT.testJupiterEngineWithDisplayNames

Error Message:
Did not find expected message in log

Stack Trace:
junit.framework.AssertionFailedError: Did not find expected message in log
	at org.apache.maven.surefire.its.JUnitPlatformIT.testJupiterEngineWithDisplayNames(JUnitPlatformIT.java:55)




Build log:
[...truncated 44211 lines...]
[2019-04-03T22:50:40.156Z] [ERROR] Failed to execute goal org.apache.maven.plugins:maven-failsafe-plugin:3.0.0-M3:verify (default) on project surefire-its: There are test failures.
[2019-04-03T22:50:40.156Z] [ERROR] 
[2019-04-03T22:50:40.156Z] [ERROR] Please refer to C:\Users\jenkins\AppData\Local\Temp\2\jenkins-maven-box-maven-surefire-1546-1222-5@2\surefire-its\target\failsafe-reports for the individual test results.
[2019-04-03T22:50:40.156Z] [ERROR] Please refer to dump files (if any exist) [date].dump, [date]-jvmRun[N].dump and [date].dumpstream.
[2019-04-03T22:50:40.156Z] [ERROR] -> [Help 1]
[2019-04-03T22:50:40.156Z] org.apache.maven.lifecycle.LifecycleExecutionException: Failed to execute goal org.apache.maven.plugins:maven-failsafe-plugin:3.0.0-M3:verify (default) on project surefire-its: There are test failures.
[2019-04-03T22:50:40.156Z] 
[2019-04-03T22:50:40.156Z] Please refer to C:\Users\jenkins\AppData\Local\Temp\2\jenkins-maven-box-maven-surefire-1546-1222-5@2\surefire-its\target\failsafe-reports for the individual test results.
[2019-04-03T22:50:40.156Z] Please refer to dump files (if any exist) [date].dump, [date]-jvmRun[N].dump and [date].dumpstream.
[2019-04-03T22:50:40.156Z]     at org.apache.maven.lifecycle.internal.MojoExecutor.execute (MojoExecutor.java:215)
[2019-04-03T22:50:40.156Z]     at org.apache.maven.lifecycle.internal.MojoExecutor.execute (MojoExecutor.java:156)
[2019-04-03T22:50:40.156Z]     at org.apache.maven.lifecycle.internal.MojoExecutor.execute (MojoExecutor.java:148)
[2019-04-03T22:50:40.156Z]     at org.apache.maven.lifecycle.internal.LifecycleModuleBuilder.buildProject (LifecycleModuleBuilder.java:117)
[2019-04-03T22:50:40.156Z]     at org.apache.maven.lifecycle.internal.LifecycleModuleBuilder.buildProject (LifecycleModuleBuilder.java:81)
[2019-04-03T22:50:40.156Z]     at org.apache.maven.lifecycle.internal.builder.singlethreaded.SingleThreadedBuilder.build (SingleThreadedBuilder.java:56)
[2019-04-03T22:50:40.156Z]     at org.apache.maven.lifecycle.internal.LifecycleStarter.execute (LifecycleStarter.java:128)
[2019-04-03T22:50:40.156Z]     at org.apache.maven.DefaultMaven.doExecute (DefaultMaven.java:305)
[2019-04-03T22:50:40.156Z]     at org.apache.maven.DefaultMaven.doExecute (DefaultMaven.java:192)
[2019-04-03T22:50:40.156Z]     at org.apache.maven.DefaultMaven.execute (DefaultMaven.java:105)
[2019-04-03T22:50:40.156Z]     at org.apache.maven.cli.MavenCli.execute (MavenCli.java:956)
[2019-04-03T22:50:40.156Z]     at org.apache.maven.cli.MavenCli.doMain (MavenCli.java:288)
[2019-04-03T22:50:40.156Z]     at org.apache.maven.cli.MavenCli.main (MavenCli.java:192)
[2019-04-03T22:50:40.156Z]     at sun.reflect.NativeMethodAccessorImpl.invoke0 (Native Method)
[2019-04-03T22:50:40.156Z]     at sun.reflect.NativeMethodAccessorImpl.invoke (NativeMethodAccessorImpl.java:62)
[2019-04-03T22:50:40.156Z]     at sun.reflect.DelegatingMethodAccessorImpl.invoke (DelegatingMethodAccessorImpl.java:43)
[2019-04-03T22:50:40.156Z]     at java.lang.reflect.Method.invoke (Method.java:498)
[2019-04-03T22:50:40.156Z]     at org.codehaus.plexus.classworlds.launcher.Launcher.launchEnhanced (Launcher.java:289)
[2019-04-03T22:50:40.156Z]     at org.codehaus.plexus.classworlds.launcher.Launcher.launch (Launcher.java:229)
[2019-04-03T22:50:40.156Z]     at org.codehaus.plexus.classworlds.launcher.Launcher.mainWithExitCode (Launcher.java:415)
[2019-04-03T22:50:40.156Z]     at org.codehaus.plexus.classworlds.launcher.Launcher.main (Launcher.java:356)
[2019-04-03T22:50:40.157Z] Caused by: org.apache.maven.plugin.MojoFailureException: There are test failures.
[2019-04-03T22:50:40.157Z] 
[2019-04-03T22:50:40.157Z] Please refer to C:\Users\jenkins\AppData\Local\Temp\2\jenkins-maven-box-maven-surefire-1546-1222-5@2\surefire-its\target\failsafe-reports for the individual test results.
[2019-04-03T22:50:40.157Z] Please refer to dump files (if any exist) [date].dump, [date]-jvmRun[N].dump and [date].dumpstream.
[2019-04-03T22:50:40.157Z]     at org.apache.maven.plugin.surefire.SurefireHelper.throwException (SurefireHelper.java:271)
[2019-04-03T22:50:40.157Z]     at org.apache.maven.plugin.surefire.SurefireHelper.reportExecution (SurefireHelper.java:159)
[2019-04-03T22:50:40.157Z]     at org.apache.maven.plugin.failsafe.VerifyMojo.execute (VerifyMojo.java:192)
[2019-04-03T22:50:40.157Z]     at org.apache.maven.plugin.DefaultBuildPluginManager.executeMojo (DefaultBuildPluginManager.java:137)
[2019-04-03T22:50:40.157Z]     at org.apache.maven.lifecycle.internal.MojoExecutor.execute (MojoExecutor.java:210)
[2019-04-03T22:50:40.157Z]     at org.apache.maven.lifecycle.internal.MojoExecutor.execute (MojoExecutor.java:156)
[2019-04-03T22:50:40.157Z]     at org.apache.maven.lifecycle.internal.MojoExecutor.execute (MojoExecutor.java:148)
[2019-04-03T22:50:40.157Z]     at org.apache.maven.lifecycle.internal.LifecycleModuleBuilder.buildProject (LifecycleModuleBuilder.java:117)
[2019-04-03T22:50:40.157Z]     at org.apache.maven.lifecycle.internal.LifecycleModuleBuilder.buildProject (LifecycleModuleBuilder.java:81)
[2019-04-03T22:50:40.157Z]     at org.apache.maven.lifecycle.internal.builder.singlethreaded.SingleThreadedBuilder.build (SingleThreadedBuilder.java:56)
[2019-04-03T22:50:40.157Z]     at org.apache.maven.lifecycle.internal.LifecycleStarter.execute (LifecycleStarter.java:128)
[2019-04-03T22:50:40.157Z]     at org.apache.maven.DefaultMaven.doExecute (DefaultMaven.java:305)
[2019-04-03T22:50:40.157Z]     at org.apache.maven.DefaultMaven.doExecute (DefaultMaven.java:192)
[2019-04-03T22:50:40.157Z]     at org.apache.maven.DefaultMaven.execute (DefaultMaven.java:105)
[2019-04-03T22:50:40.157Z]     at org.apache.maven.cli.MavenCli.execute (MavenCli.java:956)
[2019-04-03T22:50:40.157Z]     at org.apache.maven.cli.MavenCli.doMain (MavenCli.java:288)
[2019-04-03T22:50:40.157Z]     at org.apache.maven.cli.MavenCli.main (MavenCli.java:192)
[2019-04-03T22:50:40.157Z]     at sun.reflect.NativeMethodAccessorImpl.invoke0 (Native Method)
[2019-04-03T22:50:40.157Z]     at sun.reflect.NativeMethodAccessorImpl.invoke (NativeMethodAccessorImpl.java:62)
[2019-04-03T22:50:40.157Z]     at sun.reflect.DelegatingMethodAccessorImpl.invoke (DelegatingMethodAccessorImpl.java:43)
[2019-04-03T22:50:40.157Z]     at java.lang.reflect.Method.invoke (Method.java:498)
[2019-04-03T22:50:40.157Z]     at org.codehaus.plexus.classworlds.launcher.Launcher.launchEnhanced (Launcher.java:289)
[2019-04-03T22:50:40.157Z]     at org.codehaus.plexus.classworlds.launcher.Launcher.launch (Launcher.java:229)
[2019-04-03T22:50:40.157Z]     at org.codehaus.plexus.classworlds.launcher.Launcher.mainWithExitCode (Launcher.java:415)
[2019-04-03T22:50:40.157Z]     at org.codehaus.plexus.classworlds.launcher.Launcher.main (Launcher.java:356)
[2019-04-03T22:50:40.157Z] [ERROR] 
[2019-04-03T22:50:40.157Z] [ERROR] Re-run Maven using the -X switch to enable full debug logging.
[2019-04-03T22:50:40.157Z] [ERROR] 
[2019-04-03T22:50:40.157Z] [ERROR] For more information about the errors and possible solutions, please read the following articles:
[2019-04-03T22:50:40.157Z] [ERROR] [Help 1] http://cwiki.apache.org/confluence/display/MAVEN/MojoFailureException
[2019-04-03T22:50:40.157Z] [ERROR] 
[2019-04-03T22:50:40.157Z] [ERROR] After correcting the problems, you can resume the build with the command
[2019-04-03T22:50:40.157Z] [ERROR]   mvn <goals> -rf :surefire-its
[2019-04-03T22:50:40.162Z] [ERROR] Tests run: 6, Failures: 1, Errors: 0, Skipped: 0, Time elapsed: 69.181 s <<< FAILURE! - in org.apache.maven.surefire.its.JUnitPlatformIT
[2019-04-03T22:50:40.162Z] [ERROR] testJupiterEngineWithDisplayNames(org.apache.maven.surefire.its.JUnitPlatformIT)  Time elapsed: 8.723 s  <<< FAILURE!
[2019-04-03T22:50:40.162Z] junit.framework.AssertionFailedError: Did not find expected message in log
[2019-04-03T22:50:40.162Z] 	at org.apache.maven.surefire.its.JUnitPlatformIT.testJupiterEngineWithDisplayNames(JUnitPlatformIT.java:55)
[2019-04-03T22:50:40.162Z] 
[2019-04-03T22:50:40.162Z] [INFO] 
[2019-04-03T22:50:40.162Z] [INFO] Results:
[2019-04-03T22:50:40.162Z] [INFO] 
[2019-04-03T22:50:40.162Z] [ERROR] Failures: 
[2019-04-03T22:50:40.162Z] [ERROR]   JUnitPlatformIT.testJupiterEngineWithDisplayNames:55 Did not find expected message in log
[2019-04-03T22:50:40.162Z] [INFO] 
[2019-04-03T22:50:40.162Z] [ERROR] Tests run: 6, Failures: 1, Errors: 0, Skipped: 0
[2019-04-03T22:50:40.162Z] [INFO] 
[2019-04-03T22:50:40.162Z] [INFO] 
[2019-04-03T22:50:40.162Z] [INFO] --- maven-checkstyle-plugin:3.0.0:check (checkstyle-check) @ surefire-its ---
[2019-04-03T22:50:40.162Z] [INFO] 
[2019-04-03T22:50:40.162Z] [INFO] --- maven-failsafe-plugin:3.0.0-M3:verify (default) @ surefire-its ---
[2019-04-03T22:50:40.162Z] [INFO] Failsafe report directory: C:\Users\jenkins\AppData\Local\Temp\2\jenkins-maven-box-maven-surefire-1546-1222-5\surefire-its\target\failsafe-reports
[2019-04-03T22:50:40.162Z] [INFO] ------------------------------------------------------------------------
[2019-04-03T22:50:40.162Z] [INFO] Reactor Summary for Apache Maven Surefire 3.0.0-SNAPSHOT:
[2019-04-03T22:50:40.162Z] [INFO] 
[2019-04-03T22:50:40.162Z] [INFO] Apache Maven Surefire .............................. SUCCESS [01:10 min]
[2019-04-03T22:50:40.162Z] [INFO] SureFire Logger API ................................ SUCCESS [ 14.647 s]
[2019-04-03T22:50:40.162Z] [INFO] SureFire API ....................................... SUCCESS [ 27.583 s]
[2019-04-03T22:50:40.162Z] [INFO] SureFire Booter .................................... SUCCESS [ 23.774 s]
[2019-04-03T22:50:40.162Z] [INFO] Maven Surefire Test-Grouping Support ............... SUCCESS [ 14.833 s]
[2019-04-03T22:50:40.162Z] [INFO] SureFire Providers ................................. SUCCESS [  1.725 s]
[2019-04-03T22:50:40.162Z] [INFO] Shared JUnit3 Provider Code ........................ SUCCESS [  7.409 s]
[2019-04-03T22:50:40.162Z] [INFO] Shared Java 5 Provider Base ........................ SUCCESS [  9.032 s]
[2019-04-03T22:50:40.162Z] [INFO] Shared JUnit4 Provider Code ........................ SUCCESS [  9.249 s]
[2019-04-03T22:50:40.162Z] [INFO] Shared JUnit48 Provider Code ....................... SUCCESS [ 10.841 s]
[2019-04-03T22:50:40.162Z] [INFO] SureFire JUnit Runner .............................. SUCCESS [  8.178 s]
[2019-04-03T22:50:40.162Z] [INFO] SureFire JUnit4 Runner ............................. SUCCESS [  8.043 s]
[2019-04-03T22:50:40.162Z] [INFO] Maven Surefire Common .............................. SUCCESS [ 51.059 s]
[2019-04-03T22:50:40.162Z] [INFO] SureFire JUnitCore Runner .......................... SUCCESS [02:29 min]
[2019-04-03T22:50:40.162Z] [INFO] SureFire JUnit Platform Runner ..................... SUCCESS [ 17.482 s]
[2019-04-03T22:50:40.162Z] [INFO] SureFire TestNG Utils .............................. SUCCESS [  8.159 s]
[2019-04-03T22:50:40.162Z] [INFO] SureFire TestNG Runner ............................. SUCCESS [  9.284 s]
[2019-04-03T22:50:40.162Z] [INFO] ShadeFire JUnit3 Provider .......................... SUCCESS [  3.382 s]
[2019-04-03T22:50:40.162Z] [INFO] Surefire Report Parser ............................. SUCCESS [ 11.484 s]
[2019-04-03T22:50:40.162Z] [INFO] Maven Surefire Plugin .............................. SUCCESS [ 21.713 s]
[2019-04-03T22:50:40.162Z] [INFO] Maven Failsafe Plugin .............................. SUCCESS [02:21 min]
[2019-04-03T22:50:40.162Z] [INFO] Maven Surefire Report Plugin ....................... SUCCESS [ 26.225 s]
[2019-04-03T22:50:40.162Z] [INFO] Maven Surefire Integration Tests ................... FAILURE [01:55 min]
[2019-04-03T22:50:40.162Z] [INFO] ------------------------------------------------------------------------
[2019-04-03T22:50:40.162Z] [INFO] BUILD FAILURE
[2019-04-03T22:50:40.162Z] [INFO] ------------------------------------------------------------------------
[2019-04-03T22:50:40.163Z] [INFO] Total time:  12:44 min
[2019-04-03T22:50:40.163Z] [INFO] Finished at: 2019-04-03T15:50:34-07:00
[2019-04-03T22:50:40.163Z] [INFO] ------------------------------------------------------------------------
[2019-04-03T22:50:40.163Z] [ERROR] Failed to execute goal org.apache.maven.plugins:maven-failsafe-plugin:3.0.0-M3:verify (default) on project surefire-its: There are test failures.
[2019-04-03T22:50:40.163Z] [ERROR] 
[2019-04-03T22:50:40.163Z] [ERROR] Please refer to C:\Users\jenkins\AppData\Local\Temp\2\jenkins-maven-box-maven-surefire-1546-1222-5\surefire-its\target\failsafe-reports for the individual test results.
[2019-04-03T22:50:40.163Z] [ERROR] Please refer to dump files (if any exist) [date].dump, [date]-jvmRun[N].dump and [date].dumpstream.
[2019-04-03T22:50:40.163Z] [ERROR] -> [Help 1]
[2019-04-03T22:50:40.163Z] org.apache.maven.lifecycle.LifecycleExecutionException: Failed to execute goal org.apache.maven.plugins:maven-failsafe-plugin:3.0.0-M3:verify (default) on project surefire-its: There are test failures.
[2019-04-03T22:50:40.163Z] 
[2019-04-03T22:50:40.163Z] Please refer to C:\Users\jenkins\AppData\Local\Temp\2\jenkins-maven-box-maven-surefire-1546-1222-5\surefire-its\target\failsafe-reports for the individual test results.
[2019-04-03T22:50:40.163Z] Please refer to dump files (if any exist) [date].dump, [date]-jvmRun[N].dump and [date].dumpstream.
[2019-04-03T22:50:40.163Z]     at org.apache.maven.lifecycle.internal.MojoExecutor.execute (MojoExecutor.java:215)
[2019-04-03T22:50:40.163Z]     at org.apache.maven.lifecycle.internal.MojoExecutor.execute (MojoExecutor.java:156)
[2019-04-03T22:50:40.163Z]     at org.apache.maven.lifecycle.internal.MojoExecutor.execute (MojoExecutor.java:148)
[2019-04-03T22:50:40.163Z]     at org.apache.maven.lifecycle.internal.LifecycleModuleBuilder.buildProject (LifecycleModuleBuilder.java:117)
[2019-04-03T22:50:40.163Z]     at org.apache.maven.lifecycle.internal.LifecycleModuleBuilder.buildProject (LifecycleModuleBuilder.java:81)
[2019-04-03T22:50:40.163Z]     at org.apache.maven.lifecycle.internal.builder.singlethreaded.SingleThreadedBuilder.build (SingleThreadedBuilder.java:56)
[2019-04-03T22:50:40.163Z]     at org.apache.maven.lifecycle.internal.LifecycleStarter.execute (LifecycleStarter.java:128)
[2019-04-03T22:50:40.163Z]     at org.apache.maven.DefaultMaven.doExecute (DefaultMaven.java:305)
[2019-04-03T22:50:40.163Z]     at org.apache.maven.DefaultMaven.doExecute (DefaultMaven.java:192)
[2019-04-03T22:50:40.163Z]     at org.apache.maven.DefaultMaven.execute (DefaultMaven.java:105)
[2019-04-03T22:50:40.163Z]     at org.apache.maven.cli.MavenCli.execute (MavenCli.java:956)
[2019-04-03T22:50:40.163Z]     at org.apache.maven.cli.MavenCli.doMain (MavenCli.java:288)
[2019-04-03T22:50:40.163Z]     at org.apache.maven.cli.MavenCli.main (MavenCli.java:192)
[2019-04-03T22:50:40.163Z]     at sun.reflect.NativeMethodAccessorImpl.invoke0 (Native Method)
[2019-04-03T22:50:40.163Z]     at sun.reflect.NativeMethodAccessorImpl.invoke (NativeMethodAccessorImpl.java:62)
[2019-04-03T22:50:40.163Z]     at sun.reflect.DelegatingMethodAccessorImpl.invoke (DelegatingMethodAccessorImpl.java:43)
[2019-04-03T22:50:40.163Z]     at java.lang.reflect.Method.invoke (Method.java:498)
[2019-04-03T22:50:40.163Z]     at org.codehaus.plexus.classworlds.launcher.Launcher.launchEnhanced (Launcher.java:289)
[2019-04-03T22:50:40.163Z]     at org.codehaus.plexus.classworlds.launcher.Launcher.launch (Launcher.java:229)
[2019-04-03T22:50:40.163Z]     at org.codehaus.plexus.classworlds.launcher.Launcher.mainWithExitCode (Launcher.java:415)
[2019-04-03T22:50:40.163Z]     at org.codehaus.plexus.classworlds.launcher.Launcher.main (Launcher.java:356)
[2019-04-03T22:50:40.163Z] Caused by: org.apache.maven.plugin.MojoFailureException: There are test failures.
[2019-04-03T22:50:40.163Z] 
[2019-04-03T22:50:40.163Z] Please refer to C:\Users\jenkins\AppData\Local\Temp\2\jenkins-maven-box-maven-surefire-1546-1222-5\surefire-its\target\failsafe-reports for the individual test results.
[2019-04-03T22:50:40.163Z] Please refer to dump files (if any exist) [date].dump, [date]-jvmRun[N].dump and [date].dumpstream.
[2019-04-03T22:50:40.163Z]     at org.apache.maven.plugin.surefire.SurefireHelper.throwException (SurefireHelper.java:271)
[2019-04-03T22:50:40.163Z]     at org.apache.maven.plugin.surefire.SurefireHelper.reportExecution (SurefireHelper.java:159)
[2019-04-03T22:50:40.163Z]     at org.apache.maven.plugin.failsafe.VerifyMojo.execute (VerifyMojo.java:192)
[2019-04-03T22:50:40.163Z]     at org.apache.maven.plugin.DefaultBuildPluginManager.executeMojo (DefaultBuildPluginManager.java:137)
[2019-04-03T22:50:40.163Z]     at org.apache.maven.lifecycle.internal.MojoExecutor.execute (MojoExecutor.java:210)
[2019-04-03T22:50:40.163Z]     at org.apache.maven.lifecycle.internal.MojoExecutor.execute (MojoExecutor.java:156)
[2019-04-03T22:50:40.163Z]     at org.apache.maven.lifecycle.internal.MojoExecutor.execute (MojoExecutor.java:148)
[2019-04-03T22:50:40.163Z]     at org.apache.maven.lifecycle.internal.LifecycleModuleBuilder.buildProject (LifecycleModuleBuilder.java:117)
[2019-04-03T22:50:40.163Z]     at org.apache.maven.lifecycle.internal.LifecycleModuleBuilder.buildProject (LifecycleModuleBuilder.java:81)
[2019-04-03T22:50:40.163Z]     at org.apache.maven.lifecycle.internal.builder.singlethreaded.SingleThreadedBuilder.build (SingleThreadedBuilder.java:56)
[2019-04-03T22:50:40.163Z]     at org.apache.maven.lifecycle.internal.LifecycleStarter.execute (LifecycleStarter.java:128)
[2019-04-03T22:50:40.163Z]     at org.apache.maven.DefaultMaven.doExecute (DefaultMaven.java:305)
[2019-04-03T22:50:40.163Z]     at org.apache.maven.DefaultMaven.doExecute (DefaultMaven.java:192)
[2019-04-03T22:50:40.163Z]     at org.apache.maven.DefaultMaven.execute (DefaultMaven.java:105)
[2019-04-03T22:50:40.163Z]     at org.apache.maven.cli.MavenCli.execute (MavenCli.java:956)
[2019-04-03T22:50:40.163Z]     at org.apache.maven.cli.MavenCli.doMain (MavenCli.java:288)
[2019-04-03T22:50:40.163Z]     at org.apache.maven.cli.MavenCli.main (MavenCli.java:192)
[2019-04-03T22:50:40.163Z]     at sun.reflect.NativeMethodAccessorImpl.invoke0 (Native Method)
[2019-04-03T22:50:40.163Z]     at sun.reflect.NativeMethodAccessorImpl.invoke (NativeMethodAccessorImpl.java:62)
[2019-04-03T22:50:40.163Z]     at sun.reflect.DelegatingMethodAccessorImpl.invoke (DelegatingMethodAccessorImpl.java:43)
[2019-04-03T22:50:40.163Z]     at java.lang.reflect.Method.invoke (Method.java:498)
[2019-04-03T22:50:40.163Z]     at org.codehaus.plexus.classworlds.launcher.Launcher.launchEnhanced (Launcher.java:289)
[2019-04-03T22:50:40.163Z]     at org.codehaus.plexus.classworlds.launcher.Launcher.launch (Launcher.java:229)
[2019-04-03T22:50:40.163Z]     at org.codehaus.plexus.classworlds.launcher.Launcher.mainWithExitCode (Launcher.java:415)
[2019-04-03T22:50:40.163Z]     at org.codehaus.plexus.classworlds.launcher.Launcher.main (Launcher.java:356)
[2019-04-03T22:50:40.163Z] [ERROR] 
[2019-04-03T22:50:40.163Z] [ERROR] Re-run Maven using the -X switch to enable full debug logging.
[2019-04-03T22:50:40.163Z] [ERROR] 
[2019-04-03T22:50:40.163Z] [ERROR] For more information about the errors and possible solutions, please read the following articles:
[2019-04-03T22:50:40.163Z] [ERROR] [Help 1] http://cwiki.apache.org/confluence/display/MAVEN/MojoFailureException
[2019-04-03T22:50:40.163Z] [ERROR] 
[2019-04-03T22:50:40.163Z] [ERROR] After correcting the problems, you can resume the build with the command
[2019-04-03T22:50:40.163Z] [ERROR]   mvn <goals> -rf :surefire-its
[Pipeline] }
[Pipeline] }
[Pipeline] // withEnv
[Pipeline] // withEnv
[Pipeline] }
[Pipeline] }
[Pipeline] // stage
[Pipeline] // stage
[Pipeline] fileExists
[Pipeline] fileExists
[Pipeline] zip
[Pipeline] zip
[2019-04-03T22:50:40.389Z] Writing zip file of C:\Users\jenkins\AppData\Local\Temp\2\jenkins-maven-box-maven-surefire-1546-1222-5\maven-failsafe-plugin\target\it to C:\Users\jenkins\AppData\Local\Temp\2\jenkins-maven-box-maven-surefire-1546-1222-5\maven-failsafe-plugin--windows-jdk12-maven3.6.x.zip
[2019-04-03T22:50:40.413Z] Writing zip file of C:\Users\jenkins\AppData\Local\Temp\2\jenkins-maven-box-maven-surefire-1546-1222-5@2\maven-failsafe-plugin\target\it to C:\Users\jenkins\AppData\Local\Temp\2\jenkins-maven-box-maven-surefire-1546-1222-5@2\maven-failsafe-plugin--windows-jdk11-maven3.6.x.zip
[2019-04-03T22:50:40.522Z] Zipped 78 entries.
[2019-04-03T22:50:40.522Z] Archiving C:\Users\jenkins\AppData\Local\Temp\2\jenkins-maven-box-maven-surefire-1546-1222-5\maven-failsafe-plugin--windows-jdk12-maven3.6.x.zip
[2019-04-03T22:50:40.523Z] [Fast Archiver] No prior successful build to compare, so performing full copy of artifacts
[2019-04-03T22:50:40.533Z] Zipped 78 entries.
[2019-04-03T22:50:40.533Z] Archiving C:\Users\jenkins\AppData\Local\Temp\2\jenkins-maven-box-maven-surefire-1546-1222-5@2\maven-failsafe-plugin--windows-jdk11-maven3.6.x.zip
[2019-04-03T22:50:40.534Z] [Fast Archiver] No prior successful build to compare, so performing full copy of artifacts
[Pipeline] fileExists
[Pipeline] fileExists
[Pipeline] zip
[Pipeline] zip
[2019-04-03T22:50:40.655Z] Writing zip file of C:\Users\jenkins\AppData\Local\Temp\2\jenkins-maven-box-maven-surefire-1546-1222-5\surefire-its\target to C:\Users\jenkins\AppData\Local\Temp\2\jenkins-maven-box-maven-surefire-1546-1222-5\surefire-its--windows-jdk12-maven3.6.x.zip
[2019-04-03T22:50:40.673Z] Writing zip file of C:\Users\jenkins\AppData\Local\Temp\2\jenkins-maven-box-maven-surefire-1546-1222-5@2\surefire-its\target to C:\Users\jenkins\AppData\Local\Temp\2\jenkins-maven-box-maven-surefire-1546-1222-5@2\surefire-its--windows-jdk11-maven3.6.x.zip
[2019-04-03T22:50:50.202Z] Zipped 1963 entries.
[2019-04-03T22:50:50.202Z] Archiving C:\Users\jenkins\AppData\Local\Temp\2\jenkins-maven-box-maven-surefire-1546-1222-5\surefire-its--windows-jdk12-maven3.6.x.zip
[2019-04-03T22:50:50.202Z] Zipped 1963 entries.
[2019-04-03T22:50:50.203Z] [Fast Archiver] No prior successful build to compare, so performing full copy of artifacts
[2019-04-03T22:50:50.203Z] Archiving C:\Users\jenkins\AppData\Local\Temp\2\jenkins-maven-box-maven-surefire-1546-1222-5@2\surefire-its--windows-jdk11-maven3.6.x.zip
[2019-04-03T22:50:50.203Z] [Fast Archiver] No prior successful build to compare, so performing full copy of artifacts
[Pipeline] archiveArtifacts
[2019-04-03T22:50:50.656Z] Archiving artifacts
[2019-04-03T22:50:50.696Z] [Fast Archiver] No prior successful build to compare, so performing full copy of artifacts
[Pipeline] archiveArtifacts
[2019-04-03T22:50:50.884Z] Archiving artifacts
[2019-04-03T22:50:50.927Z] [Fast Archiver] No prior successful build to compare, so performing full copy of artifacts
[Pipeline] cleanWs
[2019-04-03T22:50:51.291Z] [WS-CLEANUP] Deleting project workspace...
[2019-04-03T22:50:51.291Z] [WS-CLEANUP] Deferred wipeout is used...
[2019-04-03T22:50:51.405Z] [WS-CLEANUP] done
[Pipeline] }
[Pipeline] // ws
[Pipeline] }
[Pipeline] // timestamps
[Pipeline] }
[Pipeline] // node
[Pipeline] }
[Pipeline] cleanWs
[2019-04-03T22:50:51.611Z] [WS-CLEANUP] Deleting project workspace...
[2019-04-03T22:50:51.611Z] [WS-CLEANUP] Deferred wipeout is used...
[2019-04-03T22:50:51.703Z] [WS-CLEANUP] done
[Pipeline] }
[Pipeline] // ws
[Pipeline] }
[Pipeline] // timestamps
[Pipeline] }
[Pipeline] // node
[Pipeline] }
[Pipeline] // parallel
[Pipeline] echo
Build result: FAILURE
[Pipeline] jiraIssueSelector
[Pipeline] emailext

Build failed in Jenkins: Maven TLP » maven-surefire » 1546-1222 #4

Posted by Apache Jenkins Server <je...@builds.apache.org>.
See https://builds.apache.org/job/maven-box/job/maven-surefire/job/1546-1222/4/

Changes:

* tests with display name
* tests with display name
* tests with display name
* tests with display name
* tests with display name
* tests with display name
* tests with display name
* tests with display name

1 tests failed.
FAILED:  org.apache.maven.surefire.its.JUnitPlatformIT.testJupiterEngineWithDisplayNames

Error Message:
Did not find expected message in log

Stack Trace:
junit.framework.AssertionFailedError: Did not find expected message in log
	at org.apache.maven.surefire.its.JUnitPlatformIT.testJupiterEngineWithDisplayNames(JUnitPlatformIT.java:55)




Build log:
[...truncated 44211 lines...]
[2019-04-03T17:41:05.928Z] [ERROR] Failed to execute goal org.apache.maven.plugins:maven-failsafe-plugin:3.0.0-M3:verify (default) on project surefire-its: There are test failures.
[2019-04-03T17:41:05.928Z] [ERROR] 
[2019-04-03T17:41:05.928Z] [ERROR] Please refer to C:\Users\jenkins\AppData\Local\Temp\2\jenkins-maven-box-maven-surefire-1546-1222-4@2\surefire-its\target\failsafe-reports for the individual test results.
[2019-04-03T17:41:05.928Z] [ERROR] Please refer to dump files (if any exist) [date].dump, [date]-jvmRun[N].dump and [date].dumpstream.
[2019-04-03T17:41:05.928Z] [ERROR] -> [Help 1]
[2019-04-03T17:41:05.928Z] org.apache.maven.lifecycle.LifecycleExecutionException: Failed to execute goal org.apache.maven.plugins:maven-failsafe-plugin:3.0.0-M3:verify (default) on project surefire-its: There are test failures.
[2019-04-03T17:41:05.928Z] 
[2019-04-03T17:41:05.928Z] Please refer to C:\Users\jenkins\AppData\Local\Temp\2\jenkins-maven-box-maven-surefire-1546-1222-4@2\surefire-its\target\failsafe-reports for the individual test results.
[2019-04-03T17:41:05.928Z] Please refer to dump files (if any exist) [date].dump, [date]-jvmRun[N].dump and [date].dumpstream.
[2019-04-03T17:41:05.928Z]     at org.apache.maven.lifecycle.internal.MojoExecutor.execute (MojoExecutor.java:215)
[2019-04-03T17:41:05.928Z]     at org.apache.maven.lifecycle.internal.MojoExecutor.execute (MojoExecutor.java:156)
[2019-04-03T17:41:05.928Z]     at org.apache.maven.lifecycle.internal.MojoExecutor.execute (MojoExecutor.java:148)
[2019-04-03T17:41:05.928Z]     at org.apache.maven.lifecycle.internal.LifecycleModuleBuilder.buildProject (LifecycleModuleBuilder.java:117)
[2019-04-03T17:41:05.928Z]     at org.apache.maven.lifecycle.internal.LifecycleModuleBuilder.buildProject (LifecycleModuleBuilder.java:81)
[2019-04-03T17:41:05.928Z]     at org.apache.maven.lifecycle.internal.builder.singlethreaded.SingleThreadedBuilder.build (SingleThreadedBuilder.java:56)
[2019-04-03T17:41:05.928Z]     at org.apache.maven.lifecycle.internal.LifecycleStarter.execute (LifecycleStarter.java:128)
[2019-04-03T17:41:05.928Z]     at org.apache.maven.DefaultMaven.doExecute (DefaultMaven.java:305)
[2019-04-03T17:41:05.928Z]     at org.apache.maven.DefaultMaven.doExecute (DefaultMaven.java:192)
[2019-04-03T17:41:05.928Z]     at org.apache.maven.DefaultMaven.execute (DefaultMaven.java:105)
[2019-04-03T17:41:05.928Z]     at org.apache.maven.cli.MavenCli.execute (MavenCli.java:956)
[2019-04-03T17:41:05.928Z]     at org.apache.maven.cli.MavenCli.doMain (MavenCli.java:288)
[2019-04-03T17:41:05.928Z]     at org.apache.maven.cli.MavenCli.main (MavenCli.java:192)
[2019-04-03T17:41:05.928Z]     at sun.reflect.NativeMethodAccessorImpl.invoke0 (Native Method)
[2019-04-03T17:41:05.928Z]     at sun.reflect.NativeMethodAccessorImpl.invoke (NativeMethodAccessorImpl.java:62)
[2019-04-03T17:41:05.928Z]     at sun.reflect.DelegatingMethodAccessorImpl.invoke (DelegatingMethodAccessorImpl.java:43)
[2019-04-03T17:41:05.928Z]     at java.lang.reflect.Method.invoke (Method.java:498)
[2019-04-03T17:41:05.928Z]     at org.codehaus.plexus.classworlds.launcher.Launcher.launchEnhanced (Launcher.java:289)
[2019-04-03T17:41:05.928Z]     at org.codehaus.plexus.classworlds.launcher.Launcher.launch (Launcher.java:229)
[2019-04-03T17:41:05.928Z]     at org.codehaus.plexus.classworlds.launcher.Launcher.mainWithExitCode (Launcher.java:415)
[2019-04-03T17:41:05.928Z]     at org.codehaus.plexus.classworlds.launcher.Launcher.main (Launcher.java:356)
[2019-04-03T17:41:05.928Z] Caused by: org.apache.maven.plugin.MojoFailureException: There are test failures.
[2019-04-03T17:41:05.928Z] 
[2019-04-03T17:41:05.928Z] Please refer to C:\Users\jenkins\AppData\Local\Temp\2\jenkins-maven-box-maven-surefire-1546-1222-4@2\surefire-its\target\failsafe-reports for the individual test results.
[2019-04-03T17:41:05.928Z] Please refer to dump files (if any exist) [date].dump, [date]-jvmRun[N].dump and [date].dumpstream.
[2019-04-03T17:41:05.928Z]     at org.apache.maven.plugin.surefire.SurefireHelper.throwException (SurefireHelper.java:271)
[2019-04-03T17:41:05.928Z]     at org.apache.maven.plugin.surefire.SurefireHelper.reportExecution (SurefireHelper.java:159)
[2019-04-03T17:41:05.928Z]     at org.apache.maven.plugin.failsafe.VerifyMojo.execute (VerifyMojo.java:192)
[2019-04-03T17:41:05.928Z]     at org.apache.maven.plugin.DefaultBuildPluginManager.executeMojo (DefaultBuildPluginManager.java:137)
[2019-04-03T17:41:05.928Z]     at org.apache.maven.lifecycle.internal.MojoExecutor.execute (MojoExecutor.java:210)
[2019-04-03T17:41:05.928Z]     at org.apache.maven.lifecycle.internal.MojoExecutor.execute (MojoExecutor.java:156)
[2019-04-03T17:41:05.928Z]     at org.apache.maven.lifecycle.internal.MojoExecutor.execute (MojoExecutor.java:148)
[2019-04-03T17:41:05.928Z]     at org.apache.maven.lifecycle.internal.LifecycleModuleBuilder.buildProject (LifecycleModuleBuilder.java:117)
[2019-04-03T17:41:05.928Z]     at org.apache.maven.lifecycle.internal.LifecycleModuleBuilder.buildProject (LifecycleModuleBuilder.java:81)
[2019-04-03T17:41:05.928Z]     at org.apache.maven.lifecycle.internal.builder.singlethreaded.SingleThreadedBuilder.build (SingleThreadedBuilder.java:56)
[2019-04-03T17:41:05.928Z]     at org.apache.maven.lifecycle.internal.LifecycleStarter.execute (LifecycleStarter.java:128)
[2019-04-03T17:41:05.928Z]     at org.apache.maven.DefaultMaven.doExecute (DefaultMaven.java:305)
[2019-04-03T17:41:05.928Z]     at org.apache.maven.DefaultMaven.doExecute (DefaultMaven.java:192)
[2019-04-03T17:41:05.928Z]     at org.apache.maven.DefaultMaven.execute (DefaultMaven.java:105)
[2019-04-03T17:41:05.928Z]     at org.apache.maven.cli.MavenCli.execute (MavenCli.java:956)
[2019-04-03T17:41:05.928Z]     at org.apache.maven.cli.MavenCli.doMain (MavenCli.java:288)
[2019-04-03T17:41:05.928Z]     at org.apache.maven.cli.MavenCli.main (MavenCli.java:192)
[2019-04-03T17:41:05.928Z]     at sun.reflect.NativeMethodAccessorImpl.invoke0 (Native Method)
[2019-04-03T17:41:05.928Z]     at sun.reflect.NativeMethodAccessorImpl.invoke (NativeMethodAccessorImpl.java:62)
[2019-04-03T17:41:05.928Z]     at sun.reflect.DelegatingMethodAccessorImpl.invoke (DelegatingMethodAccessorImpl.java:43)
[2019-04-03T17:41:05.929Z]     at java.lang.reflect.Method.invoke (Method.java:498)
[2019-04-03T17:41:05.929Z]     at org.codehaus.plexus.classworlds.launcher.Launcher.launchEnhanced (Launcher.java:289)
[2019-04-03T17:41:05.929Z]     at org.codehaus.plexus.classworlds.launcher.Launcher.launch (Launcher.java:229)
[2019-04-03T17:41:05.929Z]     at org.codehaus.plexus.classworlds.launcher.Launcher.mainWithExitCode (Launcher.java:415)
[2019-04-03T17:41:05.929Z]     at org.codehaus.plexus.classworlds.launcher.Launcher.main (Launcher.java:356)
[2019-04-03T17:41:05.929Z] [ERROR] 
[2019-04-03T17:41:05.929Z] [ERROR] Re-run Maven using the -X switch to enable full debug logging.
[2019-04-03T17:41:05.929Z] [ERROR] 
[2019-04-03T17:41:05.929Z] [ERROR] For more information about the errors and possible solutions, please read the following articles:
[2019-04-03T17:41:05.929Z] [ERROR] [Help 1] http://cwiki.apache.org/confluence/display/MAVEN/MojoFailureException
[2019-04-03T17:41:05.929Z] [ERROR] 
[2019-04-03T17:41:05.929Z] [ERROR] After correcting the problems, you can resume the build with the command
[2019-04-03T17:41:05.929Z] [ERROR]   mvn <goals> -rf :surefire-its
[Pipeline] }
[Pipeline] // withEnv
[Pipeline] }
[Pipeline] // stage
[Pipeline] fileExists
[Pipeline] zip
[2019-04-03T17:41:06.729Z] Writing zip file of C:\Users\jenkins\AppData\Local\Temp\2\jenkins-maven-box-maven-surefire-1546-1222-4@2\maven-failsafe-plugin\target\it to C:\Users\jenkins\AppData\Local\Temp\2\jenkins-maven-box-maven-surefire-1546-1222-4@2\maven-failsafe-plugin--windows-jdk11-maven3.6.x.zip
[2019-04-03T17:41:06.929Z] Zipped 78 entries.
[2019-04-03T17:41:06.930Z] Archiving C:\Users\jenkins\AppData\Local\Temp\2\jenkins-maven-box-maven-surefire-1546-1222-4@2\maven-failsafe-plugin--windows-jdk11-maven3.6.x.zip
[2019-04-03T17:41:06.930Z] [Fast Archiver] No prior successful build to compare, so performing full copy of artifacts
[Pipeline] fileExists
[Pipeline] zip
[2019-04-03T17:41:07.085Z] Writing zip file of C:\Users\jenkins\AppData\Local\Temp\2\jenkins-maven-box-maven-surefire-1546-1222-4@2\surefire-its\target to C:\Users\jenkins\AppData\Local\Temp\2\jenkins-maven-box-maven-surefire-1546-1222-4@2\surefire-its--windows-jdk11-maven3.6.x.zip
[2019-04-03T17:41:09.777Z] Zipped 1964 entries.
[2019-04-03T17:41:09.777Z] Archiving C:\Users\jenkins\AppData\Local\Temp\2\jenkins-maven-box-maven-surefire-1546-1222-4@2\surefire-its--windows-jdk11-maven3.6.x.zip
[2019-04-03T17:41:09.777Z] [Fast Archiver] No prior successful build to compare, so performing full copy of artifacts
[Pipeline] archiveArtifacts
[2019-04-03T17:41:10.103Z] Archiving artifacts
[2019-04-03T17:41:10.229Z] [Fast Archiver] No prior successful build to compare, so performing full copy of artifacts
[Pipeline] cleanWs
[2019-04-03T17:41:10.649Z] [WS-CLEANUP] Deleting project workspace...
[2019-04-03T17:41:10.650Z] [WS-CLEANUP] Deferred wipeout is used...
[2019-04-03T17:41:10.728Z] [WS-CLEANUP] done
[Pipeline] }
[Pipeline] // ws
[Pipeline] }
[Pipeline] // timestamps
[Pipeline] }
[Pipeline] // node
[Pipeline] }
[2019-04-03T17:41:40.902Z] [ERROR] Tests run: 6, Failures: 1, Errors: 0, Skipped: 0, Time elapsed: 77.27 s <<< FAILURE! - in org.apache.maven.surefire.its.JUnitPlatformIT
[2019-04-03T17:41:40.902Z] [ERROR] testJupiterEngineWithDisplayNames(org.apache.maven.surefire.its.JUnitPlatformIT)  Time elapsed: 9.597 s  <<< FAILURE!
[2019-04-03T17:41:40.902Z] junit.framework.AssertionFailedError: Did not find expected message in log
[2019-04-03T17:41:40.902Z] 	at org.apache.maven.surefire.its.JUnitPlatformIT.testJupiterEngineWithDisplayNames(JUnitPlatformIT.java:55)
[2019-04-03T17:41:40.902Z] 
[2019-04-03T17:41:40.902Z] [INFO] 
[2019-04-03T17:41:40.902Z] [INFO] Results:
[2019-04-03T17:41:40.902Z] [INFO] 
[2019-04-03T17:41:40.902Z] [ERROR] Failures: 
[2019-04-03T17:41:40.902Z] [ERROR]   JUnitPlatformIT.testJupiterEngineWithDisplayNames:55 Did not find expected message in log
[2019-04-03T17:41:40.902Z] [INFO] 
[2019-04-03T17:41:40.902Z] [ERROR] Tests run: 6, Failures: 1, Errors: 0, Skipped: 0
[2019-04-03T17:41:40.902Z] [INFO] 
[2019-04-03T17:41:40.902Z] [INFO] 
[2019-04-03T17:41:40.902Z] [INFO] --- maven-checkstyle-plugin:3.0.0:check (checkstyle-check) @ surefire-its ---
[2019-04-03T17:41:40.902Z] [INFO] 
[2019-04-03T17:41:40.902Z] [INFO] --- maven-failsafe-plugin:3.0.0-M3:verify (default) @ surefire-its ---
[2019-04-03T17:41:40.902Z] [INFO] Failsafe report directory: C:\Users\jenkins\AppData\Local\Temp\2\jenkins-maven-box-maven-surefire-1546-1222-4\surefire-its\target\failsafe-reports
[2019-04-03T17:41:40.902Z] [INFO] ------------------------------------------------------------------------
[2019-04-03T17:41:40.902Z] [INFO] Reactor Summary for Apache Maven Surefire 3.0.0-SNAPSHOT:
[2019-04-03T17:41:40.902Z] [INFO] 
[2019-04-03T17:41:40.902Z] [INFO] Apache Maven Surefire .............................. SUCCESS [01:16 min]
[2019-04-03T17:41:40.902Z] [INFO] SureFire Logger API ................................ SUCCESS [ 18.103 s]
[2019-04-03T17:41:40.902Z] [INFO] SureFire API ....................................... SUCCESS [ 24.352 s]
[2019-04-03T17:41:40.902Z] [INFO] SureFire Booter .................................... SUCCESS [ 25.010 s]
[2019-04-03T17:41:40.902Z] [INFO] Maven Surefire Test-Grouping Support ............... SUCCESS [ 14.959 s]
[2019-04-03T17:41:40.902Z] [INFO] SureFire Providers ................................. SUCCESS [  1.801 s]
[2019-04-03T17:41:40.902Z] [INFO] Shared JUnit3 Provider Code ........................ SUCCESS [  7.614 s]
[2019-04-03T17:41:40.902Z] [INFO] Shared Java 5 Provider Base ........................ SUCCESS [  9.051 s]
[2019-04-03T17:41:40.902Z] [INFO] Shared JUnit4 Provider Code ........................ SUCCESS [  9.134 s]
[2019-04-03T17:41:40.902Z] [INFO] Shared JUnit48 Provider Code ....................... SUCCESS [ 10.068 s]
[2019-04-03T17:41:40.902Z] [INFO] SureFire JUnit Runner .............................. SUCCESS [  7.941 s]
[2019-04-03T17:41:40.902Z] [INFO] SureFire JUnit4 Runner ............................. SUCCESS [ 37.885 s]
[2019-04-03T17:41:40.902Z] [INFO] Maven Surefire Common .............................. SUCCESS [ 40.838 s]
[2019-04-03T17:41:40.902Z] [INFO] SureFire JUnitCore Runner .......................... SUCCESS [02:28 min]
[2019-04-03T17:41:40.902Z] [INFO] SureFire JUnit Platform Runner ..................... SUCCESS [ 17.464 s]
[2019-04-03T17:41:40.902Z] [INFO] SureFire TestNG Utils .............................. SUCCESS [  8.730 s]
[2019-04-03T17:41:40.902Z] [INFO] SureFire TestNG Runner ............................. SUCCESS [  9.044 s]
[2019-04-03T17:41:40.902Z] [INFO] ShadeFire JUnit3 Provider .......................... SUCCESS [  2.834 s]
[2019-04-03T17:41:40.902Z] [INFO] Surefire Report Parser ............................. SUCCESS [ 10.935 s]
[2019-04-03T17:41:40.902Z] [INFO] Maven Surefire Plugin .............................. SUCCESS [ 21.616 s]
[2019-04-03T17:41:40.902Z] [INFO] Maven Failsafe Plugin .............................. SUCCESS [02:32 min]
[2019-04-03T17:41:40.902Z] [INFO] Maven Surefire Report Plugin ....................... SUCCESS [ 25.185 s]
[2019-04-03T17:41:40.902Z] [INFO] Maven Surefire Integration Tests ................... FAILURE [02:06 min]
[2019-04-03T17:41:40.902Z] [INFO] ------------------------------------------------------------------------
[2019-04-03T17:41:40.902Z] [INFO] BUILD FAILURE
[2019-04-03T17:41:40.902Z] [INFO] ------------------------------------------------------------------------
[2019-04-03T17:41:40.902Z] [INFO] Total time:  13:32 min
[2019-04-03T17:41:40.902Z] [INFO] Finished at: 2019-04-03T10:41:37-07:00
[2019-04-03T17:41:40.902Z] [INFO] ------------------------------------------------------------------------
[2019-04-03T17:41:40.902Z] [ERROR] Failed to execute goal org.apache.maven.plugins:maven-failsafe-plugin:3.0.0-M3:verify (default) on project surefire-its: There are test failures.
[2019-04-03T17:41:40.902Z] [ERROR] 
[2019-04-03T17:41:40.902Z] [ERROR] Please refer to C:\Users\jenkins\AppData\Local\Temp\2\jenkins-maven-box-maven-surefire-1546-1222-4\surefire-its\target\failsafe-reports for the individual test results.
[2019-04-03T17:41:40.902Z] [ERROR] Please refer to dump files (if any exist) [date].dump, [date]-jvmRun[N].dump and [date].dumpstream.
[2019-04-03T17:41:40.902Z] [ERROR] -> [Help 1]
[2019-04-03T17:41:40.902Z] org.apache.maven.lifecycle.LifecycleExecutionException: Failed to execute goal org.apache.maven.plugins:maven-failsafe-plugin:3.0.0-M3:verify (default) on project surefire-its: There are test failures.
[2019-04-03T17:41:40.902Z] 
[2019-04-03T17:41:40.903Z] Please refer to C:\Users\jenkins\AppData\Local\Temp\2\jenkins-maven-box-maven-surefire-1546-1222-4\surefire-its\target\failsafe-reports for the individual test results.
[2019-04-03T17:41:40.903Z] Please refer to dump files (if any exist) [date].dump, [date]-jvmRun[N].dump and [date].dumpstream.
[2019-04-03T17:41:40.903Z]     at org.apache.maven.lifecycle.internal.MojoExecutor.execute (MojoExecutor.java:215)
[2019-04-03T17:41:40.903Z]     at org.apache.maven.lifecycle.internal.MojoExecutor.execute (MojoExecutor.java:156)
[2019-04-03T17:41:40.903Z]     at org.apache.maven.lifecycle.internal.MojoExecutor.execute (MojoExecutor.java:148)
[2019-04-03T17:41:40.903Z]     at org.apache.maven.lifecycle.internal.LifecycleModuleBuilder.buildProject (LifecycleModuleBuilder.java:117)
[2019-04-03T17:41:40.903Z]     at org.apache.maven.lifecycle.internal.LifecycleModuleBuilder.buildProject (LifecycleModuleBuilder.java:81)
[2019-04-03T17:41:40.903Z]     at org.apache.maven.lifecycle.internal.builder.singlethreaded.SingleThreadedBuilder.build (SingleThreadedBuilder.java:56)
[2019-04-03T17:41:40.903Z]     at org.apache.maven.lifecycle.internal.LifecycleStarter.execute (LifecycleStarter.java:128)
[2019-04-03T17:41:40.903Z]     at org.apache.maven.DefaultMaven.doExecute (DefaultMaven.java:305)
[2019-04-03T17:41:40.903Z]     at org.apache.maven.DefaultMaven.doExecute (DefaultMaven.java:192)
[2019-04-03T17:41:40.903Z]     at org.apache.maven.DefaultMaven.execute (DefaultMaven.java:105)
[2019-04-03T17:41:40.903Z]     at org.apache.maven.cli.MavenCli.execute (MavenCli.java:956)
[2019-04-03T17:41:40.903Z]     at org.apache.maven.cli.MavenCli.doMain (MavenCli.java:288)
[2019-04-03T17:41:40.903Z]     at org.apache.maven.cli.MavenCli.main (MavenCli.java:192)
[2019-04-03T17:41:40.903Z]     at sun.reflect.NativeMethodAccessorImpl.invoke0 (Native Method)
[2019-04-03T17:41:40.903Z]     at sun.reflect.NativeMethodAccessorImpl.invoke (NativeMethodAccessorImpl.java:62)
[2019-04-03T17:41:40.903Z]     at sun.reflect.DelegatingMethodAccessorImpl.invoke (DelegatingMethodAccessorImpl.java:43)
[2019-04-03T17:41:40.903Z]     at java.lang.reflect.Method.invoke (Method.java:498)
[2019-04-03T17:41:40.903Z]     at org.codehaus.plexus.classworlds.launcher.Launcher.launchEnhanced (Launcher.java:289)
[2019-04-03T17:41:40.903Z]     at org.codehaus.plexus.classworlds.launcher.Launcher.launch (Launcher.java:229)
[2019-04-03T17:41:40.903Z]     at org.codehaus.plexus.classworlds.launcher.Launcher.mainWithExitCode (Launcher.java:415)
[2019-04-03T17:41:40.903Z]     at org.codehaus.plexus.classworlds.launcher.Launcher.main (Launcher.java:356)
[2019-04-03T17:41:40.903Z] Caused by: org.apache.maven.plugin.MojoFailureException: There are test failures.
[2019-04-03T17:41:40.903Z] 
[2019-04-03T17:41:40.903Z] Please refer to C:\Users\jenkins\AppData\Local\Temp\2\jenkins-maven-box-maven-surefire-1546-1222-4\surefire-its\target\failsafe-reports for the individual test results.
[2019-04-03T17:41:40.903Z] Please refer to dump files (if any exist) [date].dump, [date]-jvmRun[N].dump and [date].dumpstream.
[2019-04-03T17:41:40.903Z]     at org.apache.maven.plugin.surefire.SurefireHelper.throwException (SurefireHelper.java:271)
[2019-04-03T17:41:40.903Z]     at org.apache.maven.plugin.surefire.SurefireHelper.reportExecution (SurefireHelper.java:159)
[2019-04-03T17:41:40.903Z]     at org.apache.maven.plugin.failsafe.VerifyMojo.execute (VerifyMojo.java:192)
[2019-04-03T17:41:40.903Z]     at org.apache.maven.plugin.DefaultBuildPluginManager.executeMojo (DefaultBuildPluginManager.java:137)
[2019-04-03T17:41:40.903Z]     at org.apache.maven.lifecycle.internal.MojoExecutor.execute (MojoExecutor.java:210)
[2019-04-03T17:41:40.903Z]     at org.apache.maven.lifecycle.internal.MojoExecutor.execute (MojoExecutor.java:156)
[2019-04-03T17:41:40.903Z]     at org.apache.maven.lifecycle.internal.MojoExecutor.execute (MojoExecutor.java:148)
[2019-04-03T17:41:40.903Z]     at org.apache.maven.lifecycle.internal.LifecycleModuleBuilder.buildProject (LifecycleModuleBuilder.java:117)
[2019-04-03T17:41:40.903Z]     at org.apache.maven.lifecycle.internal.LifecycleModuleBuilder.buildProject (LifecycleModuleBuilder.java:81)
[2019-04-03T17:41:40.903Z]     at org.apache.maven.lifecycle.internal.builder.singlethreaded.SingleThreadedBuilder.build (SingleThreadedBuilder.java:56)
[2019-04-03T17:41:40.903Z]     at org.apache.maven.lifecycle.internal.LifecycleStarter.execute (LifecycleStarter.java:128)
[2019-04-03T17:41:40.903Z]     at org.apache.maven.DefaultMaven.doExecute (DefaultMaven.java:305)
[2019-04-03T17:41:40.903Z]     at org.apache.maven.DefaultMaven.doExecute (DefaultMaven.java:192)
[2019-04-03T17:41:40.903Z]     at org.apache.maven.DefaultMaven.execute (DefaultMaven.java:105)
[2019-04-03T17:41:40.903Z]     at org.apache.maven.cli.MavenCli.execute (MavenCli.java:956)
[2019-04-03T17:41:40.903Z]     at org.apache.maven.cli.MavenCli.doMain (MavenCli.java:288)
[2019-04-03T17:41:40.903Z]     at org.apache.maven.cli.MavenCli.main (MavenCli.java:192)
[2019-04-03T17:41:40.903Z]     at sun.reflect.NativeMethodAccessorImpl.invoke0 (Native Method)
[2019-04-03T17:41:40.903Z]     at sun.reflect.NativeMethodAccessorImpl.invoke (NativeMethodAccessorImpl.java:62)
[2019-04-03T17:41:40.903Z]     at sun.reflect.DelegatingMethodAccessorImpl.invoke (DelegatingMethodAccessorImpl.java:43)
[2019-04-03T17:41:40.903Z]     at java.lang.reflect.Method.invoke (Method.java:498)
[2019-04-03T17:41:40.903Z]     at org.codehaus.plexus.classworlds.launcher.Launcher.launchEnhanced (Launcher.java:289)
[2019-04-03T17:41:40.903Z]     at org.codehaus.plexus.classworlds.launcher.Launcher.launch (Launcher.java:229)
[2019-04-03T17:41:40.903Z]     at org.codehaus.plexus.classworlds.launcher.Launcher.mainWithExitCode (Launcher.java:415)
[2019-04-03T17:41:40.903Z]     at org.codehaus.plexus.classworlds.launcher.Launcher.main (Launcher.java:356)
[2019-04-03T17:41:40.903Z] [ERROR] 
[2019-04-03T17:41:40.903Z] [ERROR] Re-run Maven using the -X switch to enable full debug logging.
[2019-04-03T17:41:40.903Z] [ERROR] 
[2019-04-03T17:41:40.903Z] [ERROR] For more information about the errors and possible solutions, please read the following articles:
[2019-04-03T17:41:40.903Z] [ERROR] [Help 1] http://cwiki.apache.org/confluence/display/MAVEN/MojoFailureException
[2019-04-03T17:41:40.903Z] [ERROR] 
[2019-04-03T17:41:40.903Z] [ERROR] After correcting the problems, you can resume the build with the command
[2019-04-03T17:41:40.903Z] [ERROR]   mvn <goals> -rf :surefire-its
[Pipeline] }
[Pipeline] // withEnv
[Pipeline] }
[Pipeline] // stage
[Pipeline] fileExists
[Pipeline] zip
[2019-04-03T17:41:41.120Z] Writing zip file of C:\Users\jenkins\AppData\Local\Temp\2\jenkins-maven-box-maven-surefire-1546-1222-4\maven-failsafe-plugin\target\it to C:\Users\jenkins\AppData\Local\Temp\2\jenkins-maven-box-maven-surefire-1546-1222-4\maven-failsafe-plugin--windows-jdk8-maven3.6.x.zip
[2019-04-03T17:41:41.289Z] Zipped 78 entries.
[2019-04-03T17:41:41.289Z] Archiving C:\Users\jenkins\AppData\Local\Temp\2\jenkins-maven-box-maven-surefire-1546-1222-4\maven-failsafe-plugin--windows-jdk8-maven3.6.x.zip
[2019-04-03T17:41:41.290Z] [Fast Archiver] No prior successful build to compare, so performing full copy of artifacts
[Pipeline] fileExists
[Pipeline] zip
[2019-04-03T17:41:41.409Z] Writing zip file of C:\Users\jenkins\AppData\Local\Temp\2\jenkins-maven-box-maven-surefire-1546-1222-4\surefire-its\target to C:\Users\jenkins\AppData\Local\Temp\2\jenkins-maven-box-maven-surefire-1546-1222-4\surefire-its--windows-jdk8-maven3.6.x.zip
[2019-04-03T17:41:43.728Z] Zipped 1965 entries.
[2019-04-03T17:41:43.728Z] Archiving C:\Users\jenkins\AppData\Local\Temp\2\jenkins-maven-box-maven-surefire-1546-1222-4\surefire-its--windows-jdk8-maven3.6.x.zip
[2019-04-03T17:41:43.728Z] [Fast Archiver] No prior successful build to compare, so performing full copy of artifacts
[Pipeline] archiveArtifacts
[2019-04-03T17:41:44.151Z] Archiving artifacts
[2019-04-03T17:41:44.173Z] [Fast Archiver] No prior successful build to compare, so performing full copy of artifacts
[Pipeline] cleanWs
[2019-04-03T17:41:44.614Z] [WS-CLEANUP] Deleting project workspace...
[2019-04-03T17:41:44.614Z] [WS-CLEANUP] Deferred wipeout is used...
[2019-04-03T17:41:44.701Z] [WS-CLEANUP] done
[Pipeline] }
[Pipeline] // ws
[Pipeline] }
[Pipeline] // timestamps
[Pipeline] }
[Pipeline] // node
[Pipeline] }
[Pipeline] // parallel
[Pipeline] echo
Build result: FAILURE
[Pipeline] jiraIssueSelector
[Pipeline] emailext

Build failed in Jenkins: Maven TLP » maven-surefire » 1546-1222 #3

Posted by Apache Jenkins Server <je...@builds.apache.org>.
See https://builds.apache.org/job/maven-box/job/maven-surefire/job/1546-1222/3/

Changes:

* finished subtypes of RunEntry
* finished subtypes of RunEntry
* finished subtypes of RunEntry
* finished subtypes of RunEntry
* finished subtypes of RunEntry
* finished subtypes of RunEntry
* finished subtypes of RunEntry
* finished subtypes of RunEntry

2 tests failed.
FAILED:  org.apache.maven.surefire.its.JUnitPlatformIT.testJupiterEngine

Error Message:
wrong number of tests expected:<5> but was:<7>

Stack Trace:
junit.framework.AssertionFailedError: wrong number of tests expected:<5> but was:<7>
	at org.apache.maven.surefire.its.JUnitPlatformIT.testJupiterEngine(JUnitPlatformIT.java:43)


FAILED:  org.apache.maven.surefire.its.JUnitPlatformIT.testJupiterEngineWithDisplayNames

Error Message:
Did not find expected message in log

Stack Trace:
junit.framework.AssertionFailedError: Did not find expected message in log
	at org.apache.maven.surefire.its.JUnitPlatformIT.testJupiterEngineWithDisplayNames(JUnitPlatformIT.java:60)




Build log:
[...truncated 47615 lines...]
[2019-04-02T20:40:25.041Z] [INFO] Tests run: 2, Failures: 0, Errors: 0, Skipped: 0, Time elapsed: 24.19 s - in org.apache.maven.surefire.its.jiras.Surefire377TestNgAndJUnitTogetherIT
[2019-04-02T20:40:25.041Z] [INFO] Running org.apache.maven.surefire.its.jiras.Surefire408ManualProviderSelectionIT
[2019-04-02T20:40:33.239Z] [INFO] Tests run: 1, Failures: 0, Errors: 0, Skipped: 0, Time elapsed: 11.792 s - in org.apache.maven.surefire.its.jiras.Surefire408ManualProviderSelectionIT
[2019-04-02T20:40:33.239Z] [INFO] Running org.apache.maven.surefire.its.jiras.Surefire42NotExtendingTestCaseIT
[2019-04-02T20:40:46.087Z] [INFO] Tests run: 1, Failures: 0, Errors: 0, Skipped: 0, Time elapsed: 11.433 s - in org.apache.maven.surefire.its.jiras.Surefire42NotExtendingTestCaseIT
[2019-04-02T20:40:46.087Z] [INFO] Running org.apache.maven.surefire.its.jiras.Surefire44InnerClassTestIT
[2019-04-02T20:40:56.684Z] [INFO] Tests run: 1, Failures: 0, Errors: 0, Skipped: 0, Time elapsed: 11.214 s - in org.apache.maven.surefire.its.jiras.Surefire44InnerClassTestIT
[2019-04-02T20:40:56.684Z] [INFO] Running org.apache.maven.surefire.its.jiras.Surefire500PuzzlingErrorIT
[2019-04-02T20:41:09.444Z] [INFO] Tests run: 1, Failures: 0, Errors: 0, Skipped: 0, Time elapsed: 12.515 s - in org.apache.maven.surefire.its.jiras.Surefire500PuzzlingErrorIT
[2019-04-02T20:41:09.444Z] [INFO] Running org.apache.maven.surefire.its.jiras.Surefire510TestClassPathForkModesIT
[2019-04-02T20:41:33.621Z] [INFO] Tests run: 2, Failures: 0, Errors: 0, Skipped: 0, Time elapsed: 23.198 s - in org.apache.maven.surefire.its.jiras.Surefire510TestClassPathForkModesIT
[2019-04-02T20:41:33.621Z] [INFO] Running org.apache.maven.surefire.its.jiras.Surefire569RunTestFromDependencyJarsIT
[2019-04-02T20:41:42.388Z] [INFO] Tests run: 1, Failures: 0, Errors: 0, Skipped: 0, Time elapsed: 11.164 s - in org.apache.maven.surefire.its.jiras.Surefire569RunTestFromDependencyJarsIT
[2019-04-02T20:41:42.388Z] [INFO] Running org.apache.maven.surefire.its.jiras.Surefire570MultipleReportDirectoriesIT
[2019-04-02T20:42:44.120Z] [INFO] Tests run: 2, Failures: 0, Errors: 0, Skipped: 0, Time elapsed: 60.512 s - in org.apache.maven.surefire.its.jiras.Surefire570MultipleReportDirectoriesIT
[2019-04-02T20:42:44.120Z] [INFO] Running org.apache.maven.surefire.its.jiras.Surefire613TestCountInParallelIT
[2019-04-02T20:42:54.705Z] [INFO] Tests run: 1, Failures: 0, Errors: 0, Skipped: 0, Time elapsed: 11.747 s - in org.apache.maven.surefire.its.jiras.Surefire613TestCountInParallelIT
[2019-04-02T20:42:54.705Z] [INFO] Running org.apache.maven.surefire.its.jiras.Surefire621TestCountingJunit3InParallelIT
[2019-04-02T20:44:03.846Z] [INFO] Tests run: 5, Failures: 0, Errors: 0, Skipped: 0, Time elapsed: 65.087 s - in org.apache.maven.surefire.its.jiras.Surefire621TestCountingJunit3InParallelIT
[2019-04-02T20:44:03.846Z] [INFO] Running org.apache.maven.surefire.its.jiras.Surefire628ConsoleOutputBeforeAndAfterClassIT
[2019-04-02T20:44:14.562Z] [INFO] Tests run: 1, Failures: 0, Errors: 0, Skipped: 0, Time elapsed: 13.299 s - in org.apache.maven.surefire.its.jiras.Surefire628ConsoleOutputBeforeAndAfterClassIT
[2019-04-02T20:44:14.562Z] [INFO] Running org.apache.maven.surefire.its.jiras.Surefire634UnsettableSystemPropertiesWarningIT
[2019-04-02T20:44:25.001Z] [INFO] Tests run: 1, Failures: 0, Errors: 0, Skipped: 0, Time elapsed: 11.424 s - in org.apache.maven.surefire.its.jiras.Surefire634UnsettableSystemPropertiesWarningIT
[2019-04-02T20:44:25.001Z] [INFO] Running org.apache.maven.surefire.its.jiras.Surefire649EmptyStringSystemPropertiesIT
[2019-04-02T20:44:45.137Z] [INFO] Tests run: 2, Failures: 0, Errors: 0, Skipped: 0, Time elapsed: 20.073 s - in org.apache.maven.surefire.its.jiras.Surefire649EmptyStringSystemPropertiesIT
[2019-04-02T20:44:45.137Z] [INFO] Running org.apache.maven.surefire.its.jiras.Surefire673MockitoIT
[2019-04-02T20:45:00.594Z] [INFO] Tests run: 1, Failures: 0, Errors: 0, Skipped: 0, Time elapsed: 13.804 s - in org.apache.maven.surefire.its.jiras.Surefire673MockitoIT
[2019-04-02T20:45:00.594Z] [INFO] Running org.apache.maven.surefire.its.jiras.Surefire674BuildFailingWhenErrorsIT
[2019-04-02T20:45:11.385Z] [INFO] Tests run: 1, Failures: 0, Errors: 0, Skipped: 0, Time elapsed: 13.049 s - in org.apache.maven.surefire.its.jiras.Surefire674BuildFailingWhenErrorsIT
[2019-04-02T20:45:11.385Z] [INFO] Running org.apache.maven.surefire.its.jiras.Surefire674BuildFailingWhenFailsafeErrorsIT
[2019-04-02T20:45:33.270Z] [INFO] Tests run: 1, Failures: 0, Errors: 0, Skipped: 0, Time elapsed: 18.483 s - in org.apache.maven.surefire.its.jiras.Surefire674BuildFailingWhenFailsafeErrorsIT
[2019-04-02T20:45:33.270Z] [INFO] Running org.apache.maven.surefire.its.jiras.Surefire685CommaSeparatedIncludesIT
[2019-04-02T20:45:44.410Z] [INFO] Tests run: 1, Failures: 0, Errors: 0, Skipped: 0, Time elapsed: 13.621 s - in org.apache.maven.surefire.its.jiras.Surefire685CommaSeparatedIncludesIT
[2019-04-02T20:45:44.410Z] [INFO] Running org.apache.maven.surefire.its.jiras.Surefire697NiceSummaryIT
[2019-04-02T20:45:57.282Z] [INFO] Tests run: 1, Failures: 0, Errors: 0, Skipped: 0, Time elapsed: 13.042 s - in org.apache.maven.surefire.its.jiras.Surefire697NiceSummaryIT
[2019-04-02T20:45:57.282Z] [INFO] Running org.apache.maven.surefire.its.jiras.Surefire705ParallelForkTimeoutIT
[2019-04-02T20:46:16.782Z] [INFO] Tests run: 1, Failures: 0, Errors: 0, Skipped: 0, Time elapsed: 18.128 s - in org.apache.maven.surefire.its.jiras.Surefire705ParallelForkTimeoutIT
[2019-04-02T20:46:16.782Z] [INFO] Running org.apache.maven.surefire.its.jiras.Surefire733AllOverrridesCapturedIT
[2019-04-02T20:46:33.093Z] [INFO] Tests run: 1, Failures: 0, Errors: 0, Skipped: 0, Time elapsed: 13.392 s - in org.apache.maven.surefire.its.jiras.Surefire733AllOverrridesCapturedIT
[2019-04-02T20:46:33.093Z] [INFO] Running org.apache.maven.surefire.its.jiras.Surefire735ForkFailWithRedirectConsoleOutputIT
[2019-04-02T20:46:52.354Z] [INFO] Tests run: 2, Failures: 0, Errors: 0, Skipped: 0, Time elapsed: 23.447 s - in org.apache.maven.surefire.its.jiras.Surefire735ForkFailWithRedirectConsoleOutputIT
[2019-04-02T20:46:52.354Z] [INFO] Running org.apache.maven.surefire.its.jiras.Surefire740TruncatedCommaIT
[2019-04-02T20:47:03.885Z] [INFO] Tests run: 1, Failures: 0, Errors: 0, Skipped: 0, Time elapsed: 11.893 s - in org.apache.maven.surefire.its.jiras.Surefire740TruncatedCommaIT
[2019-04-02T20:47:03.885Z] [INFO] Running org.apache.maven.surefire.its.jiras.Surefire747MethodParallelWithSuiteCountIT
[2019-04-02T20:47:46.474Z] [INFO] Tests run: 2, Failures: 0, Errors: 0, Skipped: 0, Time elapsed: 37.865 s - in org.apache.maven.surefire.its.jiras.Surefire747MethodParallelWithSuiteCountIT
[2019-04-02T20:47:46.474Z] [INFO] Running org.apache.maven.surefire.its.jiras.Surefire772BothReportsIT
[2019-04-02T20:48:05.397Z] [INFO] Tests run: 3, Failures: 0, Errors: 0, Skipped: 0, Time elapsed: 22.969 s - in org.apache.maven.surefire.its.jiras.Surefire772BothReportsIT
[2019-04-02T20:48:05.397Z] [INFO] Running org.apache.maven.surefire.its.jiras.Surefire772NoFailsafeReportsIT
[2019-04-02T20:48:37.721Z] [INFO] Tests run: 4, Failures: 0, Errors: 0, Skipped: 0, Time elapsed: 31.595 s - in org.apache.maven.surefire.its.jiras.Surefire772NoFailsafeReportsIT
[2019-04-02T20:48:37.721Z] [INFO] Running org.apache.maven.surefire.its.jiras.Surefire772NoSurefireReportsIT
[2019-04-02T20:49:10.796Z] [INFO] Tests run: 4, Failures: 0, Errors: 0, Skipped: 0, Time elapsed: 30.758 s - in org.apache.maven.surefire.its.jiras.Surefire772NoSurefireReportsIT
[2019-04-02T20:49:10.796Z] [INFO] Running org.apache.maven.surefire.its.jiras.Surefire772SpecifiedReportsIT
[2019-04-02T20:49:33.922Z] [INFO] Tests run: 3, Failures: 0, Errors: 0, Skipped: 0, Time elapsed: 23.13 s - in org.apache.maven.surefire.its.jiras.Surefire772SpecifiedReportsIT
[2019-04-02T20:49:33.922Z] [INFO] Running org.apache.maven.surefire.its.jiras.Surefire801ForkModeNoneClassLoaderIT
[2019-04-02T20:49:39.535Z] [INFO] Tests run: 1, Failures: 0, Errors: 0, Skipped: 0, Time elapsed: 9.554 s - in org.apache.maven.surefire.its.jiras.Surefire801ForkModeNoneClassLoaderIT
[2019-04-02T20:49:39.535Z] [INFO] Running org.apache.maven.surefire.its.jiras.Surefire803MultiFailsafeExecsIT
[2019-04-02T20:50:27.489Z] [INFO] Tests run: 2, Failures: 0, Errors: 0, Skipped: 0, Time elapsed: 41.375 s - in org.apache.maven.surefire.its.jiras.Surefire803MultiFailsafeExecsIT
[2019-04-02T20:50:27.489Z] [INFO] Running org.apache.maven.surefire.its.jiras.Surefire806SpecifiedTestControlsIT
[2019-04-02T20:50:32.649Z] [WARNING] Tests run: 3, Failures: 0, Errors: 0, Skipped: 2, Time elapsed: 11.855 s - in org.apache.maven.surefire.its.jiras.Surefire806SpecifiedTestControlsIT
[2019-04-02T20:50:32.649Z] [INFO] Running org.apache.maven.surefire.its.jiras.Surefire809GroupExpressionsIT
[2019-04-02T20:51:58.820Z] [INFO] Tests run: 6, Failures: 0, Errors: 0, Skipped: 0, Time elapsed: 73.286 s - in org.apache.maven.surefire.its.jiras.Surefire809GroupExpressionsIT
[2019-04-02T20:51:58.820Z] [INFO] Running org.apache.maven.surefire.its.jiras.Surefire812Log4JClassLoaderIT
[2019-04-02T20:51:59.994Z] [INFO] Tests run: 1, Failures: 0, Errors: 0, Skipped: 0, Time elapsed: 14.029 s - in org.apache.maven.surefire.its.jiras.Surefire812Log4JClassLoaderIT
[2019-04-02T20:51:59.995Z] [INFO] Running org.apache.maven.surefire.its.jiras.Surefire817SystemExitIT
[2019-04-02T20:52:15.502Z] [INFO] Tests run: 1, Failures: 0, Errors: 0, Skipped: 0, Time elapsed: 13.36 s - in org.apache.maven.surefire.its.jiras.Surefire817SystemExitIT
[2019-04-02T20:52:15.502Z] [INFO] Running org.apache.maven.surefire.its.jiras.Surefire818NpeIgnoresTestsIT
[2019-04-02T20:52:33.196Z] [INFO] Tests run: 1, Failures: 0, Errors: 0, Skipped: 0, Time elapsed: 14.665 s - in org.apache.maven.surefire.its.jiras.Surefire818NpeIgnoresTestsIT
[2019-04-02T20:52:33.196Z] [INFO] Running org.apache.maven.surefire.its.jiras.Surefire828EmptyGroupExprIT
[2019-04-02T20:53:21.345Z] [INFO] Tests run: 4, Failures: 0, Errors: 0, Skipped: 0, Time elapsed: 50.387 s - in org.apache.maven.surefire.its.jiras.Surefire828EmptyGroupExprIT
[2019-04-02T20:53:21.345Z] [INFO] Running org.apache.maven.surefire.its.jiras.Surefire832ProviderSelectionIT
[2019-04-02T20:53:34.590Z] [INFO] Tests run: 1, Failures: 0, Errors: 0, Skipped: 0, Time elapsed: 12.851 s - in org.apache.maven.surefire.its.jiras.Surefire832ProviderSelectionIT
[2019-04-02T20:53:34.590Z] [INFO] Running org.apache.maven.surefire.its.jiras.Surefire839TestWithoutCategoriesIT
[2019-04-02T20:53:59.623Z] [INFO] Tests run: 2, Failures: 0, Errors: 0, Skipped: 0, Time elapsed: 27.13 s - in org.apache.maven.surefire.its.jiras.Surefire839TestWithoutCategoriesIT
[2019-04-02T20:53:59.623Z] [INFO] Running org.apache.maven.surefire.its.jiras.Surefire847AdditionalFailureIT
[2019-04-02T20:54:13.029Z] [INFO] Tests run: 1, Failures: 0, Errors: 0, Skipped: 0, Time elapsed: 14.772 s - in org.apache.maven.surefire.its.jiras.Surefire847AdditionalFailureIT
[2019-04-02T20:54:13.029Z] [INFO] Running org.apache.maven.surefire.its.jiras.Surefire855AllowFailsafeUseArtifactFileIT
[2019-04-02T20:55:55.677Z] [INFO] Tests run: 4, Failures: 0, Errors: 0, Skipped: 0, Time elapsed: 92.412 s - in org.apache.maven.surefire.its.jiras.Surefire855AllowFailsafeUseArtifactFileIT
[2019-04-02T20:55:55.677Z] [INFO] Running org.apache.maven.surefire.its.jiras.Surefire901MIssingResultfileWhenNoTestsIT
[2019-04-02T20:55:55.974Z] [INFO] Tests run: 1, Failures: 0, Errors: 0, Skipped: 0, Time elapsed: 10.322 s - in org.apache.maven.surefire.its.jiras.Surefire901MIssingResultfileWhenNoTestsIT
[2019-04-02T20:55:55.974Z] [INFO] Running org.apache.maven.surefire.its.jiras.Surefire907PerThreadWithoutThreadCountIT
[2019-04-02T20:56:07.059Z] [INFO] Tests run: 1, Failures: 0, Errors: 0, Skipped: 0, Time elapsed: 9.982 s - in org.apache.maven.surefire.its.jiras.Surefire907PerThreadWithoutThreadCountIT
[2019-04-02T20:56:07.060Z] [INFO] Running org.apache.maven.surefire.its.jiras.Surefire920TestFailureIgnoreWithTimeoutIT
[2019-04-02T20:56:42.407Z] [INFO] Tests run: 2, Failures: 0, Errors: 0, Skipped: 0, Time elapsed: 33.983 s - in org.apache.maven.surefire.its.jiras.Surefire920TestFailureIgnoreWithTimeoutIT
[2019-04-02T20:56:42.407Z] [INFO] Running org.apache.maven.surefire.its.jiras.Surefire926FailureWith2ProvidersIT
[2019-04-02T20:57:01.511Z] [INFO] Tests run: 1, Failures: 0, Errors: 0, Skipped: 0, Time elapsed: 18.697 s - in org.apache.maven.surefire.its.jiras.Surefire926FailureWith2ProvidersIT
[2019-04-02T20:57:01.512Z] [INFO] Running org.apache.maven.surefire.its.jiras.Surefire930TestNgSuiteXmlIT
[2019-04-02T20:57:19.385Z] [INFO] Tests run: 1, Failures: 0, Errors: 0, Skipped: 0, Time elapsed: 19.117 s - in org.apache.maven.surefire.its.jiras.Surefire930TestNgSuiteXmlIT
[2019-04-02T20:57:19.385Z] [INFO] Running org.apache.maven.surefire.its.jiras.Surefire943ReportContentIT
[2019-04-02T20:58:14.122Z] [INFO] Tests run: 2, Failures: 0, Errors: 0, Skipped: 0, Time elapsed: 50.45 s - in org.apache.maven.surefire.its.jiras.Surefire943ReportContentIT
[2019-04-02T20:58:14.122Z] [INFO] Running org.apache.maven.surefire.its.jiras.Surefire946KillMainProcessInReusableForkIT
[2019-04-02T20:58:46.211Z] [INFO] Tests run: 3, Failures: 0, Errors: 0, Skipped: 0, Time elapsed: 36.768 s - in org.apache.maven.surefire.its.jiras.Surefire946KillMainProcessInReusableForkIT
[2019-04-02T20:58:46.211Z] [INFO] Running org.apache.maven.surefire.its.jiras.Surefire972BizarreNoClassDefIT
[2019-04-02T20:59:05.093Z] [INFO] Tests run: 1, Failures: 0, Errors: 0, Skipped: 0, Time elapsed: 19.645 s - in org.apache.maven.surefire.its.jiras.Surefire972BizarreNoClassDefIT
[2019-04-02T20:59:05.093Z] [INFO] Running org.apache.maven.surefire.its.jiras.Surefire975DefaultVMEncodingIT
[2019-04-02T20:59:18.378Z] [INFO] Tests run: 1, Failures: 0, Errors: 0, Skipped: 0, Time elapsed: 12.998 s - in org.apache.maven.surefire.its.jiras.Surefire975DefaultVMEncodingIT
[2019-04-02T20:59:18.378Z] [INFO] Running org.apache.maven.surefire.its.jiras.Surefire979WrongClassLoaderIT
[2019-04-02T20:59:33.438Z] [INFO] Tests run: 1, Failures: 0, Errors: 0, Skipped: 0, Time elapsed: 13.379 s - in org.apache.maven.surefire.its.jiras.Surefire979WrongClassLoaderIT
[2019-04-02T20:59:33.438Z] [INFO] Running org.apache.maven.surefire.its.jiras.Surefire985ParameterizedRunnerAndCategoriesIT
[2019-04-02T20:59:42.019Z] [INFO] Tests run: 1, Failures: 0, Errors: 0, Skipped: 0, Time elapsed: 10.454 s - in org.apache.maven.surefire.its.jiras.Surefire985ParameterizedRunnerAndCategoriesIT
[2019-04-02T20:59:42.019Z] [INFO] Running org.apache.maven.surefire.its.jiras.Surefire995CategoryInheritanceIT
[2019-04-02T21:00:43.325Z] [INFO] Tests run: 5, Failures: 0, Errors: 0, Skipped: 0, Time elapsed: 57.085 s - in org.apache.maven.surefire.its.jiras.Surefire995CategoryInheritanceIT
[2019-04-02T21:00:43.325Z] [INFO] 
[2019-04-02T21:00:43.325Z] [INFO] Results:
[2019-04-02T21:00:43.325Z] [INFO] 
[2019-04-02T21:00:43.325Z] [ERROR] Failures: 
[2019-04-02T21:00:43.325Z] [ERROR]   JUnitPlatformIT.testJupiterEngine:43 wrong number of tests expected:<5> but was:<7>
[2019-04-02T21:00:43.325Z] [ERROR]   JUnitPlatformIT.testJupiterEngineWithDisplayNames:60 Did not find expected message in log
[2019-04-02T21:00:43.325Z] [INFO] 
[2019-04-02T21:00:43.325Z] [ERROR] Tests run: 792, Failures: 2, Errors: 0, Skipped: 150
[2019-04-02T21:00:43.325Z] [INFO] 
[2019-04-02T21:00:43.325Z] [INFO] 
[2019-04-02T21:00:43.325Z] [INFO] --- maven-checkstyle-plugin:3.0.0:check (checkstyle-check) @ surefire-its ---
[2019-04-02T21:00:43.325Z] [INFO] 
[2019-04-02T21:00:43.325Z] [INFO] --- maven-failsafe-plugin:3.0.0-M3:verify (default) @ surefire-its ---
[2019-04-02T21:00:43.325Z] [INFO] Failsafe report directory: C:\Users\jenkins\AppData\Local\Temp\2\jenkins-maven-box-maven-surefire-1546-1222-3\surefire-its\target\failsafe-reports
[2019-04-02T21:00:43.325Z] [INFO] ------------------------------------------------------------------------
[2019-04-02T21:00:43.325Z] [INFO] Reactor Summary for Apache Maven Surefire 3.0.0-SNAPSHOT:
[2019-04-02T21:00:43.325Z] [INFO] 
[2019-04-02T21:00:43.325Z] [INFO] Apache Maven Surefire .............................. SUCCESS [ 49.989 s]
[2019-04-02T21:00:43.325Z] [INFO] SureFire Logger API ................................ SUCCESS [ 12.999 s]
[2019-04-02T21:00:43.325Z] [INFO] SureFire API ....................................... SUCCESS [ 23.136 s]
[2019-04-02T21:00:43.325Z] [INFO] SureFire Booter .................................... SUCCESS [ 27.648 s]
[2019-04-02T21:00:43.325Z] [INFO] Maven Surefire Test-Grouping Support ............... SUCCESS [ 19.089 s]
[2019-04-02T21:00:43.325Z] [INFO] SureFire Providers ................................. SUCCESS [  2.476 s]
[2019-04-02T21:00:43.325Z] [INFO] Shared JUnit3 Provider Code ........................ SUCCESS [  9.130 s]
[2019-04-02T21:00:43.325Z] [INFO] Shared Java 5 Provider Base ........................ SUCCESS [ 10.739 s]
[2019-04-02T21:00:43.325Z] [INFO] Shared JUnit4 Provider Code ........................ SUCCESS [ 10.802 s]
[2019-04-02T21:00:43.325Z] [INFO] Shared JUnit48 Provider Code ....................... SUCCESS [ 13.080 s]
[2019-04-02T21:00:43.325Z] [INFO] SureFire JUnit Runner .............................. SUCCESS [ 10.270 s]
[2019-04-02T21:00:43.325Z] [INFO] SureFire JUnit4 Runner ............................. SUCCESS [ 40.166 s]
[2019-04-02T21:00:43.325Z] [INFO] Maven Surefire Common .............................. SUCCESS [ 52.837 s]
[2019-04-02T21:00:43.325Z] [INFO] SureFire JUnitCore Runner .......................... SUCCESS [02:23 min]
[2019-04-02T21:00:43.325Z] [INFO] SureFire JUnit Platform Runner ..................... SUCCESS [ 22.887 s]
[2019-04-02T21:00:43.326Z] [INFO] SureFire TestNG Utils .............................. SUCCESS [ 11.132 s]
[2019-04-02T21:00:43.326Z] [INFO] SureFire TestNG Runner ............................. SUCCESS [ 12.146 s]
[2019-04-02T21:00:43.326Z] [INFO] ShadeFire JUnit3 Provider .......................... SUCCESS [  3.681 s]
[2019-04-02T21:00:43.326Z] [INFO] Surefire Report Parser ............................. SUCCESS [ 12.953 s]
[2019-04-02T21:00:43.326Z] [INFO] Maven Surefire Plugin .............................. SUCCESS [ 22.704 s]
[2019-04-02T21:00:43.326Z] [INFO] Maven Failsafe Plugin .............................. SUCCESS [02:07 min]
[2019-04-02T21:00:43.326Z] [INFO] Maven Surefire Report Plugin ....................... SUCCESS [ 28.137 s]
[2019-04-02T21:00:43.326Z] [INFO] Maven Surefire Integration Tests ................... FAILURE [  02:26 h]
[2019-04-02T21:00:43.326Z] [INFO] ------------------------------------------------------------------------
[2019-04-02T21:00:43.326Z] [INFO] BUILD FAILURE
[2019-04-02T21:00:43.326Z] [INFO] ------------------------------------------------------------------------
[2019-04-02T21:00:43.326Z] [INFO] Total time:  02:37 h
[2019-04-02T21:00:43.326Z] [INFO] Finished at: 2019-04-02T21:00:40Z
[2019-04-02T21:00:43.326Z] [INFO] ------------------------------------------------------------------------
[2019-04-02T21:00:43.326Z] [ERROR] Failed to execute goal org.apache.maven.plugins:maven-failsafe-plugin:3.0.0-M3:verify (default) on project surefire-its: There are test failures.
[2019-04-02T21:00:43.326Z] [ERROR] 
[2019-04-02T21:00:43.326Z] [ERROR] Please refer to C:\Users\jenkins\AppData\Local\Temp\2\jenkins-maven-box-maven-surefire-1546-1222-3\surefire-its\target\failsafe-reports for the individual test results.
[2019-04-02T21:00:43.326Z] [ERROR] Please refer to dump files (if any exist) [date].dump, [date]-jvmRun[N].dump and [date].dumpstream.
[2019-04-02T21:00:43.326Z] [ERROR] -> [Help 1]
[2019-04-02T21:00:43.326Z] org.apache.maven.lifecycle.LifecycleExecutionException: Failed to execute goal org.apache.maven.plugins:maven-failsafe-plugin:3.0.0-M3:verify (default) on project surefire-its: There are test failures.
[2019-04-02T21:00:43.326Z] 
[2019-04-02T21:00:43.326Z] Please refer to C:\Users\jenkins\AppData\Local\Temp\2\jenkins-maven-box-maven-surefire-1546-1222-3\surefire-its\target\failsafe-reports for the individual test results.
[2019-04-02T21:00:43.326Z] Please refer to dump files (if any exist) [date].dump, [date]-jvmRun[N].dump and [date].dumpstream.
[2019-04-02T21:00:43.326Z]     at org.apache.maven.lifecycle.internal.MojoExecutor.execute (MojoExecutor.java:215)
[2019-04-02T21:00:43.326Z]     at org.apache.maven.lifecycle.internal.MojoExecutor.execute (MojoExecutor.java:156)
[2019-04-02T21:00:43.326Z]     at org.apache.maven.lifecycle.internal.MojoExecutor.execute (MojoExecutor.java:148)
[2019-04-02T21:00:43.326Z]     at org.apache.maven.lifecycle.internal.LifecycleModuleBuilder.buildProject (LifecycleModuleBuilder.java:117)
[2019-04-02T21:00:43.326Z]     at org.apache.maven.lifecycle.internal.LifecycleModuleBuilder.buildProject (LifecycleModuleBuilder.java:81)
[2019-04-02T21:00:43.326Z]     at org.apache.maven.lifecycle.internal.builder.singlethreaded.SingleThreadedBuilder.build (SingleThreadedBuilder.java:56)
[2019-04-02T21:00:43.326Z]     at org.apache.maven.lifecycle.internal.LifecycleStarter.execute (LifecycleStarter.java:128)
[2019-04-02T21:00:43.326Z]     at org.apache.maven.DefaultMaven.doExecute (DefaultMaven.java:305)
[2019-04-02T21:00:43.326Z]     at org.apache.maven.DefaultMaven.doExecute (DefaultMaven.java:192)
[2019-04-02T21:00:43.326Z]     at org.apache.maven.DefaultMaven.execute (DefaultMaven.java:105)
[2019-04-02T21:00:43.326Z]     at org.apache.maven.cli.MavenCli.execute (MavenCli.java:956)
[2019-04-02T21:00:43.326Z]     at org.apache.maven.cli.MavenCli.doMain (MavenCli.java:288)
[2019-04-02T21:00:43.326Z]     at org.apache.maven.cli.MavenCli.main (MavenCli.java:192)
[2019-04-02T21:00:43.326Z]     at sun.reflect.NativeMethodAccessorImpl.invoke0 (Native Method)
[2019-04-02T21:00:43.326Z]     at sun.reflect.NativeMethodAccessorImpl.invoke (NativeMethodAccessorImpl.java:62)
[2019-04-02T21:00:43.326Z]     at sun.reflect.DelegatingMethodAccessorImpl.invoke (DelegatingMethodAccessorImpl.java:43)
[2019-04-02T21:00:43.326Z]     at java.lang.reflect.Method.invoke (Method.java:498)
[2019-04-02T21:00:43.326Z]     at org.codehaus.plexus.classworlds.launcher.Launcher.launchEnhanced (Launcher.java:289)
[2019-04-02T21:00:43.326Z]     at org.codehaus.plexus.classworlds.launcher.Launcher.launch (Launcher.java:229)
[2019-04-02T21:00:43.326Z]     at org.codehaus.plexus.classworlds.launcher.Launcher.mainWithExitCode (Launcher.java:415)
[2019-04-02T21:00:43.326Z]     at org.codehaus.plexus.classworlds.launcher.Launcher.main (Launcher.java:356)
[2019-04-02T21:00:43.326Z] Caused by: org.apache.maven.plugin.MojoFailureException: There are test failures.
[2019-04-02T21:00:43.326Z] 
[2019-04-02T21:00:43.326Z] Please refer to C:\Users\jenkins\AppData\Local\Temp\2\jenkins-maven-box-maven-surefire-1546-1222-3\surefire-its\target\failsafe-reports for the individual test results.
[2019-04-02T21:00:43.326Z] Please refer to dump files (if any exist) [date].dump, [date]-jvmRun[N].dump and [date].dumpstream.
[2019-04-02T21:00:43.326Z]     at org.apache.maven.plugin.surefire.SurefireHelper.throwException (SurefireHelper.java:271)
[2019-04-02T21:00:43.326Z]     at org.apache.maven.plugin.surefire.SurefireHelper.reportExecution (SurefireHelper.java:159)
[2019-04-02T21:00:43.326Z]     at org.apache.maven.plugin.failsafe.VerifyMojo.execute (VerifyMojo.java:192)
[2019-04-02T21:00:43.326Z]     at org.apache.maven.plugin.DefaultBuildPluginManager.executeMojo (DefaultBuildPluginManager.java:137)
[2019-04-02T21:00:43.326Z]     at org.apache.maven.lifecycle.internal.MojoExecutor.execute (MojoExecutor.java:210)
[2019-04-02T21:00:43.326Z]     at org.apache.maven.lifecycle.internal.MojoExecutor.execute (MojoExecutor.java:156)
[2019-04-02T21:00:43.326Z]     at org.apache.maven.lifecycle.internal.MojoExecutor.execute (MojoExecutor.java:148)
[2019-04-02T21:00:43.326Z]     at org.apache.maven.lifecycle.internal.LifecycleModuleBuilder.buildProject (LifecycleModuleBuilder.java:117)
[2019-04-02T21:00:43.326Z]     at org.apache.maven.lifecycle.internal.LifecycleModuleBuilder.buildProject (LifecycleModuleBuilder.java:81)
[2019-04-02T21:00:43.326Z]     at org.apache.maven.lifecycle.internal.builder.singlethreaded.SingleThreadedBuilder.build (SingleThreadedBuilder.java:56)
[2019-04-02T21:00:43.326Z]     at org.apache.maven.lifecycle.internal.LifecycleStarter.execute (LifecycleStarter.java:128)
[2019-04-02T21:00:43.326Z]     at org.apache.maven.DefaultMaven.doExecute (DefaultMaven.java:305)
[2019-04-02T21:00:43.326Z]     at org.apache.maven.DefaultMaven.doExecute (DefaultMaven.java:192)
[2019-04-02T21:00:43.326Z]     at org.apache.maven.DefaultMaven.execute (DefaultMaven.java:105)
[2019-04-02T21:00:43.326Z]     at org.apache.maven.cli.MavenCli.execute (MavenCli.java:956)
[2019-04-02T21:00:43.326Z]     at org.apache.maven.cli.MavenCli.doMain (MavenCli.java:288)
[2019-04-02T21:00:43.326Z]     at org.apache.maven.cli.MavenCli.main (MavenCli.java:192)
[2019-04-02T21:00:43.326Z]     at sun.reflect.NativeMethodAccessorImpl.invoke0 (Native Method)
[2019-04-02T21:00:43.326Z]     at sun.reflect.NativeMethodAccessorImpl.invoke (NativeMethodAccessorImpl.java:62)
[2019-04-02T21:00:43.326Z]     at sun.reflect.DelegatingMethodAccessorImpl.invoke (DelegatingMethodAccessorImpl.java:43)
[2019-04-02T21:00:43.326Z]     at java.lang.reflect.Method.invoke (Method.java:498)
[2019-04-02T21:00:43.326Z]     at org.codehaus.plexus.classworlds.launcher.Launcher.launchEnhanced (Launcher.java:289)
[2019-04-02T21:00:43.326Z]     at org.codehaus.plexus.classworlds.launcher.Launcher.launch (Launcher.java:229)
[2019-04-02T21:00:43.326Z]     at org.codehaus.plexus.classworlds.launcher.Launcher.mainWithExitCode (Launcher.java:415)
[2019-04-02T21:00:43.326Z]     at org.codehaus.plexus.classworlds.launcher.Launcher.main (Launcher.java:356)
[2019-04-02T21:00:43.327Z] [ERROR] 
[2019-04-02T21:00:43.327Z] [ERROR] Re-run Maven using the -X switch to enable full debug logging.
[2019-04-02T21:00:43.327Z] [ERROR] 
[2019-04-02T21:00:43.327Z] [ERROR] For more information about the errors and possible solutions, please read the following articles:
[2019-04-02T21:00:43.327Z] [ERROR] [Help 1] http://cwiki.apache.org/confluence/display/MAVEN/MojoFailureException
[2019-04-02T21:00:43.327Z] [ERROR] 
[2019-04-02T21:00:43.327Z] [ERROR] After correcting the problems, you can resume the build with the command
[2019-04-02T21:00:43.327Z] [ERROR]   mvn <goals> -rf :surefire-its
[Pipeline] }
[Pipeline] // withEnv
[Pipeline] }
[Pipeline] // stage
[Pipeline] fileExists
[Pipeline] zip
[2019-04-02T21:00:43.545Z] Writing zip file of C:\Users\jenkins\AppData\Local\Temp\2\jenkins-maven-box-maven-surefire-1546-1222-3\maven-failsafe-plugin\target\it to C:\Users\jenkins\AppData\Local\Temp\2\jenkins-maven-box-maven-surefire-1546-1222-3\maven-failsafe-plugin--windows-jdk8-maven3.6.x.zip
[2019-04-02T21:00:44.087Z] Zipped 78 entries.
[2019-04-02T21:00:44.087Z] Archiving C:\Users\jenkins\AppData\Local\Temp\2\jenkins-maven-box-maven-surefire-1546-1222-3\maven-failsafe-plugin--windows-jdk8-maven3.6.x.zip
[2019-04-02T21:00:44.087Z] [Fast Archiver] No prior successful build to compare, so performing full copy of artifacts
[Pipeline] fileExists
[Pipeline] zip
[2019-04-02T21:00:44.216Z] Writing zip file of C:\Users\jenkins\AppData\Local\Temp\2\jenkins-maven-box-maven-surefire-1546-1222-3\surefire-its\target to C:\Users\jenkins\AppData\Local\Temp\2\jenkins-maven-box-maven-surefire-1546-1222-3\surefire-its--windows-jdk8-maven3.6.x.zip
[2019-04-02T21:01:04.427Z] Zipped 16044 entries.
[2019-04-02T21:01:04.427Z] Archiving C:\Users\jenkins\AppData\Local\Temp\2\jenkins-maven-box-maven-surefire-1546-1222-3\surefire-its--windows-jdk8-maven3.6.x.zip
[2019-04-02T21:01:04.427Z] [Fast Archiver] No prior successful build to compare, so performing full copy of artifacts
[Pipeline] archiveArtifacts
[2019-04-02T21:01:06.750Z] Archiving artifacts
[2019-04-02T21:01:06.774Z] [Fast Archiver] No prior successful build to compare, so performing full copy of artifacts
[Pipeline] cleanWs
[2019-04-02T21:01:08.958Z] [WS-CLEANUP] Deleting project workspace...
[2019-04-02T21:01:08.958Z] [WS-CLEANUP] Deferred wipeout is used...
[2019-04-02T21:01:09.128Z] [WS-CLEANUP] done
[Pipeline] }
[Pipeline] // ws
[Pipeline] }
[Pipeline] // timestamps
[Pipeline] }
[Pipeline] // node
[Pipeline] }
[Pipeline] // parallel
[Pipeline] echo
Build result: FAILURE
[Pipeline] jiraIssueSelector
[Pipeline] emailext

Build failed in Jenkins: Maven TLP » maven-surefire » 1546-1222 #2

Posted by Apache Jenkins Server <je...@builds.apache.org>.
See https://builds.apache.org/job/maven-box/job/maven-surefire/job/1546-1222/2/

Changes:

* enabled IT for display name
* added two getters in ReportEntry for display name
* enabled IT for display name
* added two getters in ReportEntry for display name
* enabled IT for display name
* added two getters in ReportEntry for display name
* enabled IT for display name
* added two getters in ReportEntry for display name
* enabled IT for display name
* added two getters in ReportEntry for display name
* enabled IT for display name
* added two getters in ReportEntry for display name
* enabled IT for display name
* added two getters in ReportEntry for display name
* enabled IT for display name
* added two getters in ReportEntry for display name

All tests passed

Build log:
[...truncated 29200 lines...]
[Pipeline] }
[2019-04-02T11:26:28.847Z] [WS-CLEANUP] done
[Pipeline] // timestamps
[Pipeline] }
[Pipeline] }
[Pipeline] // ws
[Pipeline] // node
[Pipeline] }
[Pipeline] }
[Pipeline] // timestamps
[Pipeline] }
[Pipeline] // node
[Pipeline] }
[2019-04-02T11:26:46.347Z] [INFO] 
[2019-04-02T11:26:46.347Z] [INFO] Results:
[2019-04-02T11:26:46.347Z] [INFO] 
[2019-04-02T11:26:46.347Z] [INFO] Tests run: 2, Failures: 0, Errors: 0, Skipped: 0
[2019-04-02T11:26:46.347Z] [INFO] 
[2019-04-02T11:26:46.347Z] [INFO] 
[2019-04-02T11:26:46.347Z] [INFO] --- maven-jar-plugin:3.1.0:jar (default-jar) @ surefire-junit4 ---
[2019-04-02T11:26:46.347Z] [INFO] Building jar: C:\Users\jenkins\AppData\Local\Temp\2\jenkins-maven-box-maven-surefire-1546-1222-2\surefire-providers\surefire-junit4\target\surefire-junit4-3.0.0-SNAPSHOT.jar
[2019-04-02T11:26:46.347Z] [INFO] 
[2019-04-02T11:26:46.347Z] [INFO] --- maven-site-plugin:3.7.1:attach-descriptor (attach-descriptor) @ surefire-junit4 ---
[2019-04-02T11:26:46.347Z] [INFO] Skipping because packaging 'jar' is not pom.
[2019-04-02T11:26:46.347Z] [INFO] 
[2019-04-02T11:26:46.347Z] [INFO] --- maven-checkstyle-plugin:3.0.0:check (checkstyle-check) @ surefire-junit4 ---
[2019-04-02T11:26:46.347Z] [INFO] 
[2019-04-02T11:26:46.347Z] [INFO] --- maven-install-plugin:2.5.2:install (default-install) @ surefire-junit4 ---
[2019-04-02T11:26:46.347Z] [INFO] Installing C:\Users\jenkins\AppData\Local\Temp\2\jenkins-maven-box-maven-surefire-1546-1222-2\surefire-providers\surefire-junit4\target\surefire-junit4-3.0.0-SNAPSHOT.jar to C:\Users\jenkins\AppData\Local\Temp\2\jenkins-maven-box-maven-surefire-1546-1222-2\.m2\org\apache\maven\surefire\surefire-junit4\3.0.0-SNAPSHOT\surefire-junit4-3.0.0-SNAPSHOT.jar
[2019-04-02T11:26:46.347Z] [INFO] Installing C:\Users\jenkins\AppData\Local\Temp\2\jenkins-maven-box-maven-surefire-1546-1222-2\surefire-providers\surefire-junit4\pom.xml to C:\Users\jenkins\AppData\Local\Temp\2\jenkins-maven-box-maven-surefire-1546-1222-2\.m2\org\apache\maven\surefire\surefire-junit4\3.0.0-SNAPSHOT\surefire-junit4-3.0.0-SNAPSHOT.pom
[2019-04-02T11:26:46.348Z] [INFO] 
[2019-04-02T11:26:46.348Z] [INFO] ----------< org.apache.maven.surefire:maven-surefire-common >-----------
[2019-04-02T11:26:46.348Z] [INFO] Building Maven Surefire Common 3.0.0-SNAPSHOT                    [13/23]
[2019-04-02T11:26:46.348Z] [INFO] --------------------------------[ jar ]---------------------------------
[2019-04-02T11:26:46.348Z] [INFO] Downloading from central: https://repo.maven.apache.org/maven2/org/apache/maven/shared/maven-common-artifact-filters/3.1.0/maven-common-artifact-filters-3.1.0.pom
[2019-04-02T11:26:46.348Z] [INFO] Downloaded from central: https://repo.maven.apache.org/maven2/org/apache/maven/shared/maven-common-artifact-filters/3.1.0/maven-common-artifact-filters-3.1.0.pom (5.3 kB at 165 kB/s)
[2019-04-02T11:26:46.348Z] [INFO] Downloading from central: https://repo.maven.apache.org/maven2/org/apache/maven/shared/maven-shared-components/33/maven-shared-components-33.pom
[2019-04-02T11:26:46.348Z] [INFO] Downloaded from central: https://repo.maven.apache.org/maven2/org/apache/maven/shared/maven-shared-components/33/maven-shared-components-33.pom (5.1 kB at 159 kB/s)
[2019-04-02T11:26:46.348Z] [INFO] Downloading from central: https://repo.maven.apache.org/maven2/org/apache/maven/shared/maven-artifact-transfer/0.11.0/maven-artifact-transfer-0.11.0.pom
[2019-04-02T11:26:46.348Z] [INFO] Downloaded from central: https://repo.maven.apache.org/maven2/org/apache/maven/shared/maven-artifact-transfer/0.11.0/maven-artifact-transfer-0.11.0.pom (11 kB at 369 kB/s)
[2019-04-02T11:26:46.348Z] [INFO] Downloading from central: https://repo.maven.apache.org/maven2/org/codehaus/plexus/plexus-java/1.0.3/plexus-java-1.0.3.pom
[2019-04-02T11:26:46.348Z] [INFO] Downloaded from central: https://repo.maven.apache.org/maven2/org/codehaus/plexus/plexus-java/1.0.3/plexus-java-1.0.3.pom (4.8 kB at 154 kB/s)
[2019-04-02T11:26:46.348Z] [INFO] Downloading from central: https://repo.maven.apache.org/maven2/org/codehaus/plexus/plexus-languages/1.0.3/plexus-languages-1.0.3.pom
[2019-04-02T11:26:46.348Z] [INFO] Downloaded from central: https://repo.maven.apache.org/maven2/org/codehaus/plexus/plexus-languages/1.0.3/plexus-languages-1.0.3.pom (4.2 kB at 136 kB/s)
[2019-04-02T11:26:46.348Z] [INFO] Downloading from central: https://repo.maven.apache.org/maven2/org/fusesource/jansi/jansi/1.13/jansi-1.13.pom
[2019-04-02T11:26:46.348Z] [INFO] Downloaded from central: https://repo.maven.apache.org/maven2/org/fusesource/jansi/jansi/1.13/jansi-1.13.pom (3.7 kB at 232 kB/s)
[2019-04-02T11:26:46.348Z] [INFO] Downloading from central: https://repo.maven.apache.org/maven2/org/fusesource/jansi/jansi-project/1.13/jansi-project-1.13.pom
[2019-04-02T11:26:46.348Z] [INFO] Downloaded from central: https://repo.maven.apache.org/maven2/org/fusesource/jansi/jansi-project/1.13/jansi-project-1.13.pom (12 kB at 257 kB/s)
[2019-04-02T11:26:46.348Z] [INFO] Downloading from central: https://repo.maven.apache.org/maven2/org/fusesource/fusesource-pom/1.11/fusesource-pom-1.11.pom
[2019-04-02T11:26:46.348Z] [INFO] Downloaded from central: https://repo.maven.apache.org/maven2/org/fusesource/fusesource-pom/1.11/fusesource-pom-1.11.pom (15 kB at 911 kB/s)
[2019-04-02T11:26:46.348Z] [INFO] Downloading from central: https://repo.maven.apache.org/maven2/org/apache/maven/shared/maven-common-artifact-filters/3.1.0/maven-common-artifact-filters-3.1.0.jar
[2019-04-02T11:26:46.348Z] [INFO] Downloading from central: https://repo.maven.apache.org/maven2/org/codehaus/plexus/plexus-java/1.0.3/plexus-java-1.0.3.jar
[2019-04-02T11:26:46.348Z] [INFO] Downloading from central: https://repo.maven.apache.org/maven2/org/fusesource/jansi/jansi/1.13/jansi-1.13.jar
[2019-04-02T11:26:46.348Z] [INFO] Downloading from central: https://repo.maven.apache.org/maven2/org/apache/maven/shared/maven-artifact-transfer/0.11.0/maven-artifact-transfer-0.11.0.jar
[2019-04-02T11:26:46.348Z] [INFO] Downloaded from central: https://repo.maven.apache.org/maven2/org/codehaus/plexus/plexus-java/1.0.3/plexus-java-1.0.3.jar (51 kB at 132 kB/s)
[2019-04-02T11:26:46.348Z] [INFO] Downloaded from central: https://repo.maven.apache.org/maven2/org/apache/maven/shared/maven-common-artifact-filters/3.1.0/maven-common-artifact-filters-3.1.0.jar (61 kB at 122 kB/s)
[2019-04-02T11:26:46.348Z] [INFO] Downloaded from central: https://repo.maven.apache.org/maven2/org/apache/maven/shared/maven-artifact-transfer/0.11.0/maven-artifact-transfer-0.11.0.jar (128 kB at 210 kB/s)
[2019-04-02T11:26:46.348Z] [INFO] Downloaded from central: https://repo.maven.apache.org/maven2/org/fusesource/jansi/jansi/1.13/jansi-1.13.jar (152 kB at 159 kB/s)
[2019-04-02T11:26:46.348Z] [INFO] 
[2019-04-02T11:26:46.348Z] [INFO] --- maven-clean-plugin:3.1.0:clean (default-clean) @ maven-surefire-common ---
[2019-04-02T11:26:46.348Z] [INFO] 
[2019-04-02T11:26:46.348Z] [INFO] --- maven-enforcer-plugin:3.0.0-M2:enforce (enforce-maven-version) @ maven-surefire-common ---
[2019-04-02T11:26:46.348Z] [INFO] Skipping Rule Enforcement.
[2019-04-02T11:26:46.348Z] [INFO] 
[2019-04-02T11:26:46.348Z] [INFO] --- maven-enforcer-plugin:3.0.0-M2:enforce (enforce-bytecode-version) @ maven-surefire-common ---
[2019-04-02T11:26:46.348Z] [INFO] Skipping Rule Enforcement.
[2019-04-02T11:26:46.348Z] [INFO] 
[2019-04-02T11:26:46.348Z] [INFO] --- maven-enforcer-plugin:3.0.0-M2:enforce (ban-known-bad-maven-versions) @ maven-surefire-common ---
[2019-04-02T11:26:46.348Z] [INFO] Skipping Rule Enforcement.
[2019-04-02T11:26:46.348Z] [INFO] 
[2019-04-02T11:26:46.348Z] [INFO] --- maven-enforcer-plugin:3.0.0-M2:enforce (enforce-java) @ maven-surefire-common ---
[2019-04-02T11:26:46.348Z] [INFO] Skipping Rule Enforcement.
[2019-04-02T11:26:46.348Z] [INFO] 
[2019-04-02T11:26:46.348Z] [INFO] --- maven-enforcer-plugin:3.0.0-M2:enforce (enforce-maven) @ maven-surefire-common ---
[2019-04-02T11:26:46.348Z] [INFO] Skipping Rule Enforcement.
[2019-04-02T11:26:46.348Z] [INFO] 
[2019-04-02T11:26:46.348Z] [INFO] --- apache-rat-plugin:0.12:check (rat-check) @ maven-surefire-common ---
[2019-04-02T11:26:46.348Z] [INFO] Enabled default license matchers.
[2019-04-02T11:26:46.348Z] [INFO] Will parse SCM ignores for exclusions...
[2019-04-02T11:26:46.348Z] [INFO] Finished adding exclusions from SCM ignore files.
[2019-04-02T11:26:46.348Z] [INFO] 61 implicit excludes (use -debug for more details).
[2019-04-02T11:26:46.348Z] [INFO] Exclude: .repository/**
[2019-04-02T11:26:46.348Z] [INFO] Exclude: .maven/spy.log
[2019-04-02T11:26:46.348Z] [INFO] Exclude: dependency-reduced-pom.xml
[2019-04-02T11:26:46.348Z] [INFO] Exclude: .java-version
[2019-04-02T11:26:46.348Z] [INFO] Exclude: Jenkinsfile
[2019-04-02T11:26:46.348Z] [INFO] Exclude: README.md
[2019-04-02T11:26:46.348Z] [INFO] Exclude: .gitignore
[2019-04-02T11:26:46.348Z] [INFO] Exclude: .git/**/*
[2019-04-02T11:26:46.348Z] [INFO] Exclude: **/.idea
[2019-04-02T11:26:46.348Z] [INFO] Exclude: **/.svn/**/*
[2019-04-02T11:26:46.348Z] [INFO] Exclude: **/*.iml
[2019-04-02T11:26:46.348Z] [INFO] Exclude: **/*.ipr
[2019-04-02T11:26:46.348Z] [INFO] Exclude: **/*.iws
[2019-04-02T11:26:46.348Z] [INFO] Exclude: **/*.versionsBackup
[2019-04-02T11:26:46.348Z] [INFO] Exclude: **/dependency-reduced-pom.xml
[2019-04-02T11:26:46.348Z] [INFO] Exclude: .repository/**
[2019-04-02T11:26:46.348Z] [INFO] Exclude: src/test/resources/**/*
[2019-04-02T11:26:46.348Z] [INFO] Exclude: src/test/resources/**/*.css
[2019-04-02T11:26:46.348Z] [INFO] Exclude: **/*.jj
[2019-04-02T11:26:46.348Z] [INFO] Exclude: src/main/resources/META-INF/services/org.apache.maven.surefire.providerapi.SurefireProvider
[2019-04-02T11:26:46.348Z] [INFO] Exclude: DEPENDENCIES
[2019-04-02T11:26:46.348Z] [INFO] Exclude: .m2/**
[2019-04-02T11:26:46.348Z] [INFO] Exclude: .m2
[2019-04-02T11:26:46.348Z] [INFO] Exclude: .travis.yml
[2019-04-02T11:26:46.348Z] [INFO] 125 resources included (use -debug for more details)
[2019-04-02T11:26:46.348Z] [INFO] Rat check: Summary over all files. Unapproved: 0, unknown: 0, generated: 0, approved: 125 licenses.
[2019-04-02T11:26:46.348Z] [INFO] 
[2019-04-02T11:26:46.348Z] [INFO] --- jacoco-maven-plugin:0.8.3:prepare-agent (jacoco-agent) @ maven-surefire-common ---
[2019-04-02T11:26:46.349Z] [INFO] Skipping JaCoCo execution because property jacoco.skip is set.
[2019-04-02T11:26:46.349Z] [INFO] jacoco.agent set to empty
[2019-04-02T11:26:46.349Z] [INFO] 
[2019-04-02T11:26:46.349Z] [INFO] --- maven-compiler-plugin:3.7.0:compile (compile-generated) @ maven-surefire-common ---
[2019-04-02T11:26:46.349Z] [INFO] Nothing to compile - all classes are up to date
[2019-04-02T11:26:46.349Z] [INFO] 
[2019-04-02T11:26:46.349Z] [INFO] --- maven-remote-resources-plugin:1.5:process (process-resource-bundles) @ maven-surefire-common ---
[2019-04-02T11:26:46.349Z] [INFO] 
[2019-04-02T11:26:46.349Z] [INFO] --- maven-resources-plugin:3.1.0:resources (default-resources) @ maven-surefire-common ---
[2019-04-02T11:26:46.349Z] [INFO] Using 'UTF-8' encoding to copy filtered resources.
[2019-04-02T11:26:46.349Z] [INFO] skip non existing resourceDirectory C:\Users\jenkins\AppData\Local\Temp\2\jenkins-maven-box-maven-surefire-1546-1222-2\maven-surefire-common\src\main\resources
[2019-04-02T11:26:46.349Z] [INFO] Copying 3 resources
[2019-04-02T11:26:46.349Z] [INFO] 
[2019-04-02T11:26:46.349Z] [INFO] --- maven-compiler-plugin:3.7.0:compile (default-compile) @ maven-surefire-common ---
[2019-04-02T11:26:46.349Z] [INFO] Changes detected - recompiling the module!
[2019-04-02T11:26:46.349Z] [INFO] Compiling 78 source files to C:\Users\jenkins\AppData\Local\Temp\2\jenkins-maven-box-maven-surefire-1546-1222-2\maven-surefire-common\target\classes
[2019-04-02T11:26:49.978Z] [INFO] -------------------------------------------------------------
[2019-04-02T11:26:49.978Z] [ERROR] COMPILATION ERROR : 
[2019-04-02T11:26:49.978Z] [INFO] -------------------------------------------------------------
[2019-04-02T11:26:49.978Z] [ERROR] C:\Users\jenkins\AppData\Local\Temp\2\jenkins-maven-box-maven-surefire-1546-1222-2\maven-surefire-common\src\main\java\org\apache\maven\plugin\surefire\report\WrappedReportEntry.java:[37,7] error: WrappedReportEntry is not abstract and does not override abstract method getNameText() in ReportEntry
[2019-04-02T11:26:49.978Z] [INFO] 1 error
[2019-04-02T11:26:49.978Z] [INFO] -------------------------------------------------------------
[2019-04-02T11:26:49.978Z] [INFO] ------------------------------------------------------------------------
[2019-04-02T11:26:49.978Z] [INFO] Reactor Summary for Apache Maven Surefire 3.0.0-SNAPSHOT:
[2019-04-02T11:26:49.978Z] [INFO] 
[2019-04-02T11:26:49.978Z] [INFO] Apache Maven Surefire .............................. SUCCESS [01:13 min]
[2019-04-02T11:26:49.978Z] [INFO] SureFire Logger API ................................ SUCCESS [ 14.133 s]
[2019-04-02T11:26:49.978Z] [INFO] SureFire API ....................................... SUCCESS [ 22.078 s]
[2019-04-02T11:26:49.978Z] [INFO] SureFire Booter .................................... SUCCESS [ 23.647 s]
[2019-04-02T11:26:49.978Z] [INFO] Maven Surefire Test-Grouping Support ............... SUCCESS [ 12.828 s]
[2019-04-02T11:26:49.978Z] [INFO] SureFire Providers ................................. SUCCESS [  1.536 s]
[2019-04-02T11:26:49.978Z] [INFO] Shared JUnit3 Provider Code ........................ SUCCESS [  7.270 s]
[2019-04-02T11:26:49.978Z] [INFO] Shared Java 5 Provider Base ........................ SUCCESS [  8.786 s]
[2019-04-02T11:26:49.978Z] [INFO] Shared JUnit4 Provider Code ........................ SUCCESS [  9.562 s]
[2019-04-02T11:26:49.978Z] [INFO] Shared JUnit48 Provider Code ....................... SUCCESS [ 10.972 s]
[2019-04-02T11:26:49.978Z] [INFO] SureFire JUnit Runner .............................. SUCCESS [  7.898 s]
[2019-04-02T11:26:49.978Z] [INFO] SureFire JUnit4 Runner ............................. SUCCESS [ 37.737 s]
[2019-04-02T11:26:49.978Z] [INFO] Maven Surefire Common .............................. FAILURE [  6.667 s]
[2019-04-02T11:26:49.978Z] [INFO] SureFire JUnitCore Runner .......................... SKIPPED
[2019-04-02T11:26:49.978Z] [INFO] SureFire JUnit Platform Runner ..................... SKIPPED
[2019-04-02T11:26:49.978Z] [INFO] SureFire TestNG Utils .............................. SKIPPED
[2019-04-02T11:26:49.979Z] [INFO] SureFire TestNG Runner ............................. SKIPPED
[2019-04-02T11:26:49.979Z] [INFO] ShadeFire JUnit3 Provider .......................... SKIPPED
[2019-04-02T11:26:49.979Z] [INFO] Surefire Report Parser ............................. SKIPPED
[2019-04-02T11:26:49.979Z] [INFO] Maven Surefire Plugin .............................. SKIPPED
[2019-04-02T11:26:49.979Z] [INFO] Maven Failsafe Plugin .............................. SKIPPED
[2019-04-02T11:26:49.979Z] [INFO] Maven Surefire Report Plugin ....................... SKIPPED
[2019-04-02T11:26:49.979Z] [INFO] Maven Surefire Integration Tests ................... SKIPPED
[2019-04-02T11:26:49.979Z] [INFO] ------------------------------------------------------------------------
[2019-04-02T11:26:49.979Z] [INFO] BUILD FAILURE
[2019-04-02T11:26:49.979Z] [INFO] ------------------------------------------------------------------------
[2019-04-02T11:26:49.979Z] [INFO] Total time:  03:58 min
[2019-04-02T11:26:49.979Z] [INFO] Finished at: 2019-04-02T04:26:49-07:00
[2019-04-02T11:26:49.979Z] [INFO] ------------------------------------------------------------------------
[2019-04-02T11:26:49.979Z] [ERROR] Failed to execute goal org.apache.maven.plugins:maven-compiler-plugin:3.7.0:compile (default-compile) on project maven-surefire-common: Compilation failure
[2019-04-02T11:26:49.979Z] [ERROR] C:\Users\jenkins\AppData\Local\Temp\2\jenkins-maven-box-maven-surefire-1546-1222-2\maven-surefire-common\src\main\java\org\apache\maven\plugin\surefire\report\WrappedReportEntry.java:[37,7] error: WrappedReportEntry is not abstract and does not override abstract method getNameText() in ReportEntry
[2019-04-02T11:26:49.979Z] [ERROR] -> [Help 1]
[2019-04-02T11:26:49.979Z] org.apache.maven.lifecycle.LifecycleExecutionException: Failed to execute goal org.apache.maven.plugins:maven-compiler-plugin:3.7.0:compile (default-compile) on project maven-surefire-common: Compilation failure
[2019-04-02T11:26:49.979Z] C:\Users\jenkins\AppData\Local\Temp\2\jenkins-maven-box-maven-surefire-1546-1222-2\maven-surefire-common\src\main\java\org\apache\maven\plugin\surefire\report\WrappedReportEntry.java:[37,7] error: WrappedReportEntry is not abstract and does not override abstract method getNameText() in ReportEntry
[2019-04-02T11:26:49.979Z] 
[2019-04-02T11:26:49.979Z]     at org.apache.maven.lifecycle.internal.MojoExecutor.execute (MojoExecutor.java:215)
[2019-04-02T11:26:49.979Z]     at org.apache.maven.lifecycle.internal.MojoExecutor.execute (MojoExecutor.java:156)
[2019-04-02T11:26:49.979Z]     at org.apache.maven.lifecycle.internal.MojoExecutor.execute (MojoExecutor.java:148)
[2019-04-02T11:26:49.979Z]     at org.apache.maven.lifecycle.internal.LifecycleModuleBuilder.buildProject (LifecycleModuleBuilder.java:117)
[2019-04-02T11:26:49.979Z]     at org.apache.maven.lifecycle.internal.LifecycleModuleBuilder.buildProject (LifecycleModuleBuilder.java:81)
[2019-04-02T11:26:49.979Z]     at org.apache.maven.lifecycle.internal.builder.singlethreaded.SingleThreadedBuilder.build (SingleThreadedBuilder.java:56)
[2019-04-02T11:26:49.979Z]     at org.apache.maven.lifecycle.internal.LifecycleStarter.execute (LifecycleStarter.java:128)
[2019-04-02T11:26:49.979Z]     at org.apache.maven.DefaultMaven.doExecute (DefaultMaven.java:305)
[2019-04-02T11:26:49.979Z]     at org.apache.maven.DefaultMaven.doExecute (DefaultMaven.java:192)
[2019-04-02T11:26:49.979Z]     at org.apache.maven.DefaultMaven.execute (DefaultMaven.java:105)
[2019-04-02T11:26:49.979Z]     at org.apache.maven.cli.MavenCli.execute (MavenCli.java:956)
[2019-04-02T11:26:49.979Z]     at org.apache.maven.cli.MavenCli.doMain (MavenCli.java:288)
[2019-04-02T11:26:49.979Z]     at org.apache.maven.cli.MavenCli.main (MavenCli.java:192)
[2019-04-02T11:26:49.979Z]     at sun.reflect.NativeMethodAccessorImpl.invoke0 (Native Method)
[2019-04-02T11:26:49.979Z]     at sun.reflect.NativeMethodAccessorImpl.invoke (NativeMethodAccessorImpl.java:62)
[2019-04-02T11:26:49.979Z]     at sun.reflect.DelegatingMethodAccessorImpl.invoke (DelegatingMethodAccessorImpl.java:43)
[2019-04-02T11:26:49.979Z]     at java.lang.reflect.Method.invoke (Method.java:498)
[2019-04-02T11:26:49.979Z]     at org.codehaus.plexus.classworlds.launcher.Launcher.launchEnhanced (Launcher.java:289)
[2019-04-02T11:26:49.979Z]     at org.codehaus.plexus.classworlds.launcher.Launcher.launch (Launcher.java:229)
[2019-04-02T11:26:49.979Z]     at org.codehaus.plexus.classworlds.launcher.Launcher.mainWithExitCode (Launcher.java:415)
[2019-04-02T11:26:49.979Z]     at org.codehaus.plexus.classworlds.launcher.Launcher.main (Launcher.java:356)
[2019-04-02T11:26:49.979Z] Caused by: org.apache.maven.plugin.compiler.CompilationFailureException: Compilation failure
[2019-04-02T11:26:49.979Z] C:\Users\jenkins\AppData\Local\Temp\2\jenkins-maven-box-maven-surefire-1546-1222-2\maven-surefire-common\src\main\java\org\apache\maven\plugin\surefire\report\WrappedReportEntry.java:[37,7] error: WrappedReportEntry is not abstract and does not override abstract method getNameText() in ReportEntry
[2019-04-02T11:26:49.979Z] 
[2019-04-02T11:26:49.979Z]     at org.apache.maven.plugin.compiler.AbstractCompilerMojo.execute (AbstractCompilerMojo.java:1161)
[2019-04-02T11:26:49.979Z]     at org.apache.maven.plugin.compiler.CompilerMojo.execute (CompilerMojo.java:168)
[2019-04-02T11:26:49.979Z]     at org.apache.maven.plugin.DefaultBuildPluginManager.executeMojo (DefaultBuildPluginManager.java:137)
[2019-04-02T11:26:49.979Z]     at org.apache.maven.lifecycle.internal.MojoExecutor.execute (MojoExecutor.java:210)
[2019-04-02T11:26:49.979Z]     at org.apache.maven.lifecycle.internal.MojoExecutor.execute (MojoExecutor.java:156)
[2019-04-02T11:26:49.979Z]     at org.apache.maven.lifecycle.internal.MojoExecutor.execute (MojoExecutor.java:148)
[2019-04-02T11:26:49.979Z]     at org.apache.maven.lifecycle.internal.LifecycleModuleBuilder.buildProject (LifecycleModuleBuilder.java:117)
[2019-04-02T11:26:49.979Z]     at org.apache.maven.lifecycle.internal.LifecycleModuleBuilder.buildProject (LifecycleModuleBuilder.java:81)
[2019-04-02T11:26:49.979Z]     at org.apache.maven.lifecycle.internal.builder.singlethreaded.SingleThreadedBuilder.build (SingleThreadedBuilder.java:56)
[2019-04-02T11:26:49.979Z]     at org.apache.maven.lifecycle.internal.LifecycleStarter.execute (LifecycleStarter.java:128)
[2019-04-02T11:26:49.979Z]     at org.apache.maven.DefaultMaven.doExecute (DefaultMaven.java:305)
[2019-04-02T11:26:49.979Z]     at org.apache.maven.DefaultMaven.doExecute (DefaultMaven.java:192)
[2019-04-02T11:26:49.979Z]     at org.apache.maven.DefaultMaven.execute (DefaultMaven.java:105)
[2019-04-02T11:26:49.979Z]     at org.apache.maven.cli.MavenCli.execute (MavenCli.java:956)
[2019-04-02T11:26:49.979Z]     at org.apache.maven.cli.MavenCli.doMain (MavenCli.java:288)
[2019-04-02T11:26:49.979Z]     at org.apache.maven.cli.MavenCli.main (MavenCli.java:192)
[2019-04-02T11:26:49.979Z]     at sun.reflect.NativeMethodAccessorImpl.invoke0 (Native Method)
[2019-04-02T11:26:49.979Z]     at sun.reflect.NativeMethodAccessorImpl.invoke (NativeMethodAccessorImpl.java:62)
[2019-04-02T11:26:49.979Z]     at sun.reflect.DelegatingMethodAccessorImpl.invoke (DelegatingMethodAccessorImpl.java:43)
[2019-04-02T11:26:49.979Z]     at java.lang.reflect.Method.invoke (Method.java:498)
[2019-04-02T11:26:49.979Z]     at org.codehaus.plexus.classworlds.launcher.Launcher.launchEnhanced (Launcher.java:289)
[2019-04-02T11:26:49.979Z]     at org.codehaus.plexus.classworlds.launcher.Launcher.launch (Launcher.java:229)
[2019-04-02T11:26:49.979Z]     at org.codehaus.plexus.classworlds.launcher.Launcher.mainWithExitCode (Launcher.java:415)
[2019-04-02T11:26:49.979Z]     at org.codehaus.plexus.classworlds.launcher.Launcher.main (Launcher.java:356)
[2019-04-02T11:26:49.979Z] [ERROR] 
[2019-04-02T11:26:49.979Z] [ERROR] Re-run Maven using the -X switch to enable full debug logging.
[2019-04-02T11:26:49.979Z] [ERROR] 
[2019-04-02T11:26:49.980Z] [ERROR] For more information about the errors and possible solutions, please read the following articles:
[2019-04-02T11:26:49.980Z] [ERROR] [Help 1] http://cwiki.apache.org/confluence/display/MAVEN/MojoFailureException
[2019-04-02T11:26:49.980Z] [ERROR] 
[2019-04-02T11:26:49.980Z] [ERROR] After correcting the problems, you can resume the build with the command
[2019-04-02T11:26:49.980Z] [ERROR]   mvn <goals> -rf :maven-surefire-common
[Pipeline] }
[Pipeline] // withEnv
[Pipeline] }
[Pipeline] // stage
[Pipeline] fileExists
[Pipeline] fileExists
[Pipeline] archiveArtifacts
[2019-04-02T11:26:50.190Z] Archiving artifacts
[Pipeline] cleanWs
[2019-04-02T11:26:50.264Z] [WS-CLEANUP] Deleting project workspace...
[2019-04-02T11:26:50.264Z] [WS-CLEANUP] Deferred wipeout is used...
[2019-04-02T11:26:50.322Z] [WS-CLEANUP] done
[Pipeline] }
[Pipeline] // ws
[Pipeline] }
[Pipeline] // timestamps
[Pipeline] }
[Pipeline] // node
[Pipeline] }
[Pipeline] // parallel
[Pipeline] echo
Build result: FAILURE
[Pipeline] jiraIssueSelector
[Pipeline] emailext