You are viewing a plain text version of this content. The canonical link for it is here.
Posted to commits@beam.apache.org by Apache Jenkins Server <je...@builds.apache.org> on 2018/06/19 04:13:35 UTC

Build failed in Jenkins: beam_PerformanceTests_ParquetIOIT_HDFS #31

See <https://builds.apache.org/job/beam_PerformanceTests_ParquetIOIT_HDFS/31/display/redirect?page=changes>

Changes:

[kenn] Fix name of heuristic JAVA_CLASS_TO_TYPENAME

[kenn] [SQL] Allow explicit return type in ExpressionChecker

[kenn] DSL-level tests for standard operators

[kenn] Add test that all supported operators are tested

[kenn] [SQL] Make parse failure slightly more actionable

[apilloud] [SQL] Remove unused BeamIOType

[ccy] [BEAM-4582] Fix streaming Create transform on Dataflow

------------------------------------------
[...truncated 218.22 KB...]
    Jun 19, 2018 4:11:26 AM org.apache.beam.runners.dataflow.DataflowPipelineTranslator$Translator addStep
    INFO: Adding Calculate hashcode/Flatten.PCollections as step s44
    Jun 19, 2018 4:11:26 AM org.apache.beam.runners.dataflow.DataflowPipelineTranslator$Translator addStep
    INFO: Adding PAssert$0/CreateActual/FilterActuals/Window.Assign as step s45
    Jun 19, 2018 4:11:26 AM org.apache.beam.runners.dataflow.DataflowPipelineTranslator$Translator addStep
    INFO: Adding PAssert$0/CreateActual/GatherPanes/Reify.Window/ParDo(Anonymous) as step s46
    Jun 19, 2018 4:11:26 AM org.apache.beam.runners.dataflow.DataflowPipelineTranslator$Translator addStep
    INFO: Adding PAssert$0/CreateActual/GatherPanes/WithKeys/AddKeys/Map as step s47
    Jun 19, 2018 4:11:26 AM org.apache.beam.runners.dataflow.DataflowPipelineTranslator$Translator addStep
    INFO: Adding PAssert$0/CreateActual/GatherPanes/Window.Into()/Window.Assign as step s48
    Jun 19, 2018 4:11:26 AM org.apache.beam.runners.dataflow.DataflowPipelineTranslator$Translator addStep
    INFO: Adding PAssert$0/CreateActual/GatherPanes/GroupByKey as step s49
    Jun 19, 2018 4:11:26 AM org.apache.beam.runners.dataflow.DataflowPipelineTranslator$Translator addStep
    INFO: Adding PAssert$0/CreateActual/GatherPanes/Values/Values/Map as step s50
    Jun 19, 2018 4:11:26 AM org.apache.beam.runners.dataflow.DataflowPipelineTranslator$Translator addStep
    INFO: Adding PAssert$0/CreateActual/ExtractPane/Map as step s51
    Jun 19, 2018 4:11:26 AM org.apache.beam.runners.dataflow.DataflowPipelineTranslator$Translator addStep
    INFO: Adding PAssert$0/CreateActual/Flatten.Iterables/FlattenIterables/FlatMap as step s52
    Jun 19, 2018 4:11:26 AM org.apache.beam.runners.dataflow.DataflowPipelineTranslator$Translator addStep
    INFO: Adding PAssert$0/CreateActual/RewindowActuals/Window.Assign as step s53
    Jun 19, 2018 4:11:26 AM org.apache.beam.runners.dataflow.DataflowPipelineTranslator$Translator addStep
    INFO: Adding PAssert$0/CreateActual/ParDo(Anonymous) as step s54
    Jun 19, 2018 4:11:26 AM org.apache.beam.runners.dataflow.DataflowPipelineTranslator$Translator addStep
    INFO: Adding PAssert$0/CreateActual/View.AsSingleton/Combine.GloballyAsSingletonView/Combine.globally(Singleton)/WithKeys/AddKeys/Map as step s55
    Jun 19, 2018 4:11:26 AM org.apache.beam.runners.dataflow.DataflowPipelineTranslator$Translator addStep
    INFO: Adding PAssert$0/CreateActual/View.AsSingleton/Combine.GloballyAsSingletonView/Combine.globally(Singleton)/Combine.perKey(Singleton)/GroupByKey as step s56
    Jun 19, 2018 4:11:26 AM org.apache.beam.runners.dataflow.DataflowPipelineTranslator$Translator addStep
    INFO: Adding PAssert$0/CreateActual/View.AsSingleton/Combine.GloballyAsSingletonView/Combine.globally(Singleton)/Combine.perKey(Singleton)/Combine.GroupedValues as step s57
    Jun 19, 2018 4:11:26 AM org.apache.beam.runners.dataflow.DataflowPipelineTranslator$Translator addStep
    INFO: Adding PAssert$0/CreateActual/View.AsSingleton/Combine.GloballyAsSingletonView/Combine.globally(Singleton)/Values/Values/Map as step s58
    Jun 19, 2018 4:11:26 AM org.apache.beam.runners.dataflow.DataflowPipelineTranslator$Translator addStep
    INFO: Adding PAssert$0/CreateActual/View.AsSingleton/Combine.GloballyAsSingletonView/BatchViewOverrides.GroupByWindowHashAsKeyAndWindowAsSortKey/ParDo(UseWindowHashAsKeyAndWindowAsSortKey) as step s59
    Jun 19, 2018 4:11:26 AM org.apache.beam.runners.dataflow.DataflowPipelineTranslator$Translator addStep
    INFO: Adding PAssert$0/CreateActual/View.AsSingleton/Combine.GloballyAsSingletonView/BatchViewOverrides.GroupByWindowHashAsKeyAndWindowAsSortKey/BatchViewOverrides.GroupByKeyAndSortValuesOnly as step s60
    Jun 19, 2018 4:11:26 AM org.apache.beam.runners.dataflow.DataflowPipelineTranslator$Translator addStep
    INFO: Adding PAssert$0/CreateActual/View.AsSingleton/Combine.GloballyAsSingletonView/ParDo(IsmRecordForSingularValuePerWindow) as step s61
    Jun 19, 2018 4:11:26 AM org.apache.beam.runners.dataflow.DataflowPipelineTranslator$Translator addStep
    INFO: Adding PAssert$0/CreateActual/View.AsSingleton/Combine.GloballyAsSingletonView/CreateDataflowView as step s62
    Jun 19, 2018 4:11:26 AM org.apache.beam.runners.dataflow.DataflowPipelineTranslator$Translator addStep
    INFO: Adding PAssert$0/Create.Values/Read(CreateSource) as step s63
    Jun 19, 2018 4:11:26 AM org.apache.beam.runners.dataflow.DataflowPipelineTranslator$Translator addStep
    INFO: Adding PAssert$0/WindowToken/Window.Assign as step s64
    Jun 19, 2018 4:11:26 AM org.apache.beam.runners.dataflow.DataflowPipelineTranslator$Translator addStep
    INFO: Adding PAssert$0/RunChecks as step s65
    Jun 19, 2018 4:11:26 AM org.apache.beam.runners.dataflow.DataflowPipelineTranslator$Translator addStep
    INFO: Adding PAssert$0/VerifyAssertions/ParDo(DefaultConclude) as step s66
    Jun 19, 2018 4:11:26 AM org.apache.beam.runners.dataflow.DataflowPipelineTranslator$Translator addStep
    INFO: Adding View.AsSingleton/Combine.GloballyAsSingletonView/Combine.globally(Singleton)/WithKeys/AddKeys/Map as step s67
    Jun 19, 2018 4:11:26 AM org.apache.beam.runners.dataflow.DataflowPipelineTranslator$Translator addStep
    INFO: Adding View.AsSingleton/Combine.GloballyAsSingletonView/Combine.globally(Singleton)/Combine.perKey(Singleton)/GroupByKey as step s68
    Jun 19, 2018 4:11:26 AM org.apache.beam.runners.dataflow.DataflowPipelineTranslator$Translator addStep
    INFO: Adding View.AsSingleton/Combine.GloballyAsSingletonView/Combine.globally(Singleton)/Combine.perKey(Singleton)/Combine.GroupedValues as step s69
    Jun 19, 2018 4:11:26 AM org.apache.beam.runners.dataflow.DataflowPipelineTranslator$Translator addStep
    INFO: Adding View.AsSingleton/Combine.GloballyAsSingletonView/Combine.globally(Singleton)/Values/Values/Map as step s70
    Jun 19, 2018 4:11:26 AM org.apache.beam.runners.dataflow.DataflowPipelineTranslator$Translator addStep
    INFO: Adding View.AsSingleton/Combine.GloballyAsSingletonView/BatchViewOverrides.GroupByWindowHashAsKeyAndWindowAsSortKey/ParDo(UseWindowHashAsKeyAndWindowAsSortKey) as step s71
    Jun 19, 2018 4:11:26 AM org.apache.beam.runners.dataflow.DataflowPipelineTranslator$Translator addStep
    INFO: Adding View.AsSingleton/Combine.GloballyAsSingletonView/BatchViewOverrides.GroupByWindowHashAsKeyAndWindowAsSortKey/BatchViewOverrides.GroupByKeyAndSortValuesOnly as step s72
    Jun 19, 2018 4:11:26 AM org.apache.beam.runners.dataflow.DataflowPipelineTranslator$Translator addStep
    INFO: Adding View.AsSingleton/Combine.GloballyAsSingletonView/ParDo(IsmRecordForSingularValuePerWindow) as step s73
    Jun 19, 2018 4:11:26 AM org.apache.beam.runners.dataflow.DataflowPipelineTranslator$Translator addStep
    INFO: Adding View.AsSingleton/Combine.GloballyAsSingletonView/CreateDataflowView as step s74
    Jun 19, 2018 4:11:26 AM org.apache.beam.runners.dataflow.DataflowPipelineTranslator$Translator addStep
    INFO: Adding Delete test files as step s75
    Jun 19, 2018 4:11:26 AM org.apache.beam.runners.dataflow.DataflowRunner run
    INFO: Staging pipeline description to gs://temp-storage-for-perf-tests/parquetioit0writethenreadall-jenkins-0619041120-cb7e5a85/output/results/staging/
    Jun 19, 2018 4:11:26 AM org.apache.beam.runners.dataflow.util.PackageUtil tryStagePackage
    INFO: Uploading <199908 bytes, hash Shvgw7Nw5R5CNZHck1sPEg> to gs://temp-storage-for-perf-tests/parquetioit0writethenreadall-jenkins-0619041120-cb7e5a85/output/results/staging/pipeline-Shvgw7Nw5R5CNZHck1sPEg.pb

org.apache.beam.sdk.io.parquet.ParquetIOIT > writeThenReadAll STANDARD_OUT
    Dataflow SDK version: 2.6.0-SNAPSHOT

org.apache.beam.sdk.io.parquet.ParquetIOIT > writeThenReadAll STANDARD_ERROR
    Jun 19, 2018 4:11:27 AM org.apache.beam.runners.dataflow.DataflowRunner run
    INFO: To access the Dataflow monitoring console, please navigate to https://console.cloud.google.com/dataflow/jobsDetail/locations/us-central1/jobs/2018-06-18_21_11_27-13995497088213430062?project=apache-beam-testing

org.apache.beam.sdk.io.parquet.ParquetIOIT > writeThenReadAll STANDARD_OUT
    Submitted job: 2018-06-18_21_11_27-13995497088213430062

org.apache.beam.sdk.io.parquet.ParquetIOIT > writeThenReadAll STANDARD_ERROR
    Jun 19, 2018 4:11:27 AM org.apache.beam.runners.dataflow.DataflowRunner run
    INFO: To cancel the job using the 'gcloud' tool, run:
    > gcloud dataflow jobs --project=apache-beam-testing cancel --region=us-central1 2018-06-18_21_11_27-13995497088213430062
    Jun 19, 2018 4:11:27 AM org.apache.beam.runners.dataflow.TestDataflowRunner run
    INFO: Running Dataflow job 2018-06-18_21_11_27-13995497088213430062 with 1 expected assertions.
    Jun 19, 2018 4:11:42 AM org.apache.beam.runners.dataflow.util.MonitoringUtil$LoggingHandler process
    INFO: 2018-06-19T04:11:27.221Z: Autoscaling is enabled for job 2018-06-18_21_11_27-13995497088213430062. The number of workers will be between 1 and 1000.
    Jun 19, 2018 4:11:42 AM org.apache.beam.runners.dataflow.util.MonitoringUtil$LoggingHandler process
    INFO: 2018-06-19T04:11:27.247Z: Autoscaling was automatically enabled for job 2018-06-18_21_11_27-13995497088213430062.
    Jun 19, 2018 4:11:42 AM org.apache.beam.runners.dataflow.util.MonitoringUtil$LoggingHandler process
    INFO: 2018-06-19T04:11:29.927Z: Checking required Cloud APIs are enabled.
    Jun 19, 2018 4:11:42 AM org.apache.beam.runners.dataflow.util.MonitoringUtil$LoggingHandler process
    INFO: 2018-06-19T04:11:30.101Z: Checking permissions granted to controller Service Account.
    Jun 19, 2018 4:11:42 AM org.apache.beam.runners.dataflow.util.MonitoringUtil$LoggingHandler process
    INFO: 2018-06-19T04:11:34.540Z: Worker configuration: n1-standard-1 in us-central1-b.
    Jun 19, 2018 4:11:42 AM org.apache.beam.runners.dataflow.util.MonitoringUtil$LoggingHandler process
    SEVERE: 2018-06-19T04:11:34.908Z: Workflow failed. Causes: Project apache-beam-testing has insufficient quota(s) to execute this workflow with 1 instances in region us-central1. Quota summary (required/available): 1/4334 instances, 1/34 CPUs, 250/160 disk GB, 0/1998 SSD disk GB, 1/51 instance groups, 1/1 managed instance groups, 1/26 instance templates, 1/286 in-use IP addresses.

    Please see https://cloud.google.com/compute/docs/resource-quotas about requesting more quota.
    Jun 19, 2018 4:11:42 AM org.apache.beam.runners.dataflow.util.MonitoringUtil$LoggingHandler process
    INFO: 2018-06-19T04:11:35.015Z: Cleaning up.
    Jun 19, 2018 4:11:42 AM org.apache.beam.runners.dataflow.TestDataflowRunner$ErrorMonitorMessagesHandler process
    INFO: Dataflow job 2018-06-18_21_11_27-13995497088213430062 threw exception. Failure message was: Workflow failed. Causes: Project apache-beam-testing has insufficient quota(s) to execute this workflow with 1 instances in region us-central1. Quota summary (required/available): 1/4334 instances, 1/34 CPUs, 250/160 disk GB, 0/1998 SSD disk GB, 1/51 instance groups, 1/1 managed instance groups, 1/26 instance templates, 1/286 in-use IP addresses.

    Please see https://cloud.google.com/compute/docs/resource-quotas about requesting more quota.
    Jun 19, 2018 4:11:43 AM org.apache.beam.runners.dataflow.DataflowPipelineJob waitUntilFinish
    INFO: Job 2018-06-18_21_11_27-13995497088213430062 failed with status FAILED.
    Jun 19, 2018 4:11:43 AM org.apache.beam.runners.dataflow.TestDataflowRunner checkForPAssertSuccess
    INFO: Dataflow job 2018-06-18_21_11_27-13995497088213430062 terminated in failure state FAILED without reporting a failed assertion
    Jun 19, 2018 4:11:43 AM org.apache.beam.runners.dataflow.TestDataflowRunner run
    WARNING: Dataflow job 2018-06-18_21_11_27-13995497088213430062 did not output a success or failure metric.

Gradle Test Executor 1 finished executing tests.

> Task :beam-sdks-java-io-file-based-io-tests:integrationTest FAILED

org.apache.beam.sdk.io.parquet.ParquetIOIT > writeThenReadAll FAILED
    java.lang.RuntimeException: Workflow failed. Causes: Project apache-beam-testing has insufficient quota(s) to execute this workflow with 1 instances in region us-central1. Quota summary (required/available): 1/4334 instances, 1/34 CPUs, 250/160 disk GB, 0/1998 SSD disk GB, 1/51 instance groups, 1/1 managed instance groups, 1/26 instance templates, 1/286 in-use IP addresses.

    Please see https://cloud.google.com/compute/docs/resource-quotas about requesting more quota.
        at org.apache.beam.runners.dataflow.TestDataflowRunner.run(TestDataflowRunner.java:134)
        at org.apache.beam.runners.dataflow.TestDataflowRunner.run(TestDataflowRunner.java:90)
        at org.apache.beam.runners.dataflow.TestDataflowRunner.run(TestDataflowRunner.java:55)
        at org.apache.beam.sdk.Pipeline.run(Pipeline.java:311)
        at org.apache.beam.sdk.testing.TestPipeline.run(TestPipeline.java:348)
        at org.apache.beam.sdk.testing.TestPipeline.run(TestPipeline.java:329)
        at org.apache.beam.sdk.io.parquet.ParquetIOIT.writeThenReadAll(ParquetIOIT.java:122)
Finished generating test XML results (0.021 secs) into: <https://builds.apache.org/job/beam_PerformanceTests_ParquetIOIT_HDFS/ws/src/sdks/java/io/file-based-io-tests/build/test-results/integrationTest>
Generating HTML test report...
Finished generating test html results (0.033 secs) into: <https://builds.apache.org/job/beam_PerformanceTests_ParquetIOIT_HDFS/ws/src/sdks/java/io/file-based-io-tests/build/reports/tests/integrationTest>
:beam-sdks-java-io-file-based-io-tests:integrationTest (Thread[Task worker for ':' Thread 12,5,main]) completed. Took 28.071 secs.

Deprecated Gradle features were used in this build, making it incompatible with Gradle 5.0.
See https://docs.gradle.org/4.8/userguide/command_line_interface.html#sec:command_line_warnings
73 actionable tasks: 1 executed, 72 up-to-date

Publishing build scan...
https://gradle.com/s/inc4swaru7qz4


STDERR: 
1 test completed, 1 failed

FAILURE: Build failed with an exception.

* What went wrong:
Execution failed for task ':beam-sdks-java-io-file-based-io-tests:integrationTest'.
> There were failing tests. See the report at: file://<https://builds.apache.org/job/beam_PerformanceTests_ParquetIOIT_HDFS/ws/src/sdks/java/io/file-based-io-tests/build/reports/tests/integrationTest/index.html>

* Try:
Run with --debug option to get more log output. Run with --scan to get full insights.

* Exception is:
org.gradle.api.tasks.TaskExecutionException: Execution failed for task ':beam-sdks-java-io-file-based-io-tests:integrationTest'.
	at org.gradle.api.internal.tasks.execution.ExecuteActionsTaskExecuter.executeActions(ExecuteActionsTaskExecuter.java:110)
	at org.gradle.api.internal.tasks.execution.ExecuteActionsTaskExecuter.execute(ExecuteActionsTaskExecuter.java:77)
	at org.gradle.api.internal.tasks.execution.OutputDirectoryCreatingTaskExecuter.execute(OutputDirectoryCreatingTaskExecuter.java:51)
	at org.gradle.api.internal.tasks.execution.SkipCachedTaskExecuter.execute(SkipCachedTaskExecuter.java:105)
	at org.gradle.api.internal.tasks.execution.SkipUpToDateTaskExecuter.execute(SkipUpToDateTaskExecuter.java:59)
	at org.gradle.api.internal.tasks.execution.ResolveTaskOutputCachingStateExecuter.execute(ResolveTaskOutputCachingStateExecuter.java:54)
	at org.gradle.api.internal.tasks.execution.ResolveBuildCacheKeyExecuter.execute(ResolveBuildCacheKeyExecuter.java:66)
	at org.gradle.api.internal.tasks.execution.ValidatingTaskExecuter.execute(ValidatingTaskExecuter.java:59)
	at org.gradle.api.internal.tasks.execution.SkipEmptySourceFilesTaskExecuter.execute(SkipEmptySourceFilesTaskExecuter.java:101)
	at org.gradle.api.internal.tasks.execution.FinalizeInputFilePropertiesTaskExecuter.execute(FinalizeInputFilePropertiesTaskExecuter.java:44)
	at org.gradle.api.internal.tasks.execution.CleanupStaleOutputsExecuter.execute(CleanupStaleOutputsExecuter.java:91)
	at org.gradle.api.internal.tasks.execution.ResolveTaskArtifactStateTaskExecuter.execute(ResolveTaskArtifactStateTaskExecuter.java:62)
	at org.gradle.api.internal.tasks.execution.SkipTaskWithNoActionsExecuter.execute(SkipTaskWithNoActionsExecuter.java:59)
	at org.gradle.api.internal.tasks.execution.SkipOnlyIfTaskExecuter.execute(SkipOnlyIfTaskExecuter.java:54)
	at org.gradle.api.internal.tasks.execution.ExecuteAtMostOnceTaskExecuter.execute(ExecuteAtMostOnceTaskExecuter.java:43)
	at org.gradle.api.internal.tasks.execution.CatchExceptionTaskExecuter.execute(CatchExceptionTaskExecuter.java:34)
	at org.gradle.api.internal.tasks.execution.EventFiringTaskExecuter$1.run(EventFiringTaskExecuter.java:51)
	at org.gradle.internal.operations.DefaultBuildOperationExecutor$RunnableBuildOperationWorker.execute(DefaultBuildOperationExecutor.java:317)
	at org.gradle.internal.operations.DefaultBuildOperationExecutor$RunnableBuildOperationWorker.execute(DefaultBuildOperationExecutor.java:309)
	at org.gradle.internal.operations.DefaultBuildOperationExecutor.execute(DefaultBuildOperationExecutor.java:185)
	at org.gradle.internal.operations.DefaultBuildOperationExecutor.run(DefaultBuildOperationExecutor.java:97)
	at org.gradle.internal.operations.DelegatingBuildOperationExecutor.run(DelegatingBuildOperationExecutor.java:31)
	at org.gradle.api.internal.tasks.execution.EventFiringTaskExecuter.execute(EventFiringTaskExecuter.java:46)
	at org.gradle.execution.taskgraph.DefaultTaskExecutionGraph$ExecuteTaskAction.execute(DefaultTaskExecutionGraph.java:262)
	at org.gradle.execution.taskgraph.DefaultTaskExecutionGraph$ExecuteTaskAction.execute(DefaultTaskExecutionGraph.java:246)
	at org.gradle.execution.taskgraph.DefaultTaskPlanExecutor$TaskExecutorWorker$1.execute(DefaultTaskPlanExecutor.java:136)
	at org.gradle.execution.taskgraph.DefaultTaskPlanExecutor$TaskExecutorWorker$1.execute(DefaultTaskPlanExecutor.java:130)
	at org.gradle.execution.taskgraph.DefaultTaskPlanExecutor$TaskExecutorWorker.execute(DefaultTaskPlanExecutor.java:201)
	at org.gradle.execution.taskgraph.DefaultTaskPlanExecutor$TaskExecutorWorker.executeWithTask(DefaultTaskPlanExecutor.java:192)
	at org.gradle.execution.taskgraph.DefaultTaskPlanExecutor$TaskExecutorWorker.run(DefaultTaskPlanExecutor.java:130)
	at org.gradle.internal.concurrent.ExecutorPolicy$CatchAndRecordFailures.onExecute(ExecutorPolicy.java:63)
	at org.gradle.internal.concurrent.ManagedExecutorImpl$1.run(ManagedExecutorImpl.java:46)
	at org.gradle.internal.concurrent.ThreadFactoryImpl$ManagedThreadRunnable.run(ThreadFactoryImpl.java:55)
Caused by: org.gradle.api.GradleException: There were failing tests. See the report at: file://<https://builds.apache.org/job/beam_PerformanceTests_ParquetIOIT_HDFS/ws/src/sdks/java/io/file-based-io-tests/build/reports/tests/integrationTest/index.html>
	at org.gradle.api.tasks.testing.AbstractTestTask.handleTestFailures(AbstractTestTask.java:612)
	at org.gradle.api.tasks.testing.AbstractTestTask.executeTests(AbstractTestTask.java:484)
	at org.gradle.api.tasks.testing.Test.executeTests(Test.java:603)
	at org.gradle.internal.reflect.JavaMethod.invoke(JavaMethod.java:73)
	at org.gradle.api.internal.project.taskfactory.StandardTaskAction.doExecute(StandardTaskAction.java:46)
	at org.gradle.api.internal.project.taskfactory.StandardTaskAction.execute(StandardTaskAction.java:39)
	at org.gradle.api.internal.project.taskfactory.StandardTaskAction.execute(StandardTaskAction.java:26)
	at org.gradle.api.internal.AbstractTask$TaskActionWrapper.execute(AbstractTask.java:794)
	at org.gradle.api.internal.AbstractTask$TaskActionWrapper.execute(AbstractTask.java:761)
	at org.gradle.api.internal.tasks.execution.ExecuteActionsTaskExecuter$1.run(ExecuteActionsTaskExecuter.java:131)
	at org.gradle.internal.operations.DefaultBuildOperationExecutor$RunnableBuildOperationWorker.execute(DefaultBuildOperationExecutor.java:317)
	at org.gradle.internal.operations.DefaultBuildOperationExecutor$RunnableBuildOperationWorker.execute(DefaultBuildOperationExecutor.java:309)
	at org.gradle.internal.operations.DefaultBuildOperationExecutor.execute(DefaultBuildOperationExecutor.java:185)
	at org.gradle.internal.operations.DefaultBuildOperationExecutor.run(DefaultBuildOperationExecutor.java:97)
	at org.gradle.internal.operations.DelegatingBuildOperationExecutor.run(DelegatingBuildOperationExecutor.java:31)
	at org.gradle.api.internal.tasks.execution.ExecuteActionsTaskExecuter.executeAction(ExecuteActionsTaskExecuter.java:120)
	at org.gradle.api.internal.tasks.execution.ExecuteActionsTaskExecuter.executeActions(ExecuteActionsTaskExecuter.java:99)
	... 32 more


* Get more help at https://help.gradle.org

BUILD FAILED in 41s

2018-06-19 04:11:45,369 0fee1fb7 MainThread beam_integration_benchmark(1/1) ERROR    Error during benchmark beam_integration_benchmark
Traceback (most recent call last):
  File "<https://builds.apache.org/job/beam_PerformanceTests_ParquetIOIT_HDFS/ws/PerfKitBenchmarker/perfkitbenchmarker/pkb.py",> line 667, in RunBenchmark
    DoRunPhase(spec, collector, detailed_timer)
  File "<https://builds.apache.org/job/beam_PerformanceTests_ParquetIOIT_HDFS/ws/PerfKitBenchmarker/perfkitbenchmarker/pkb.py",> line 547, in DoRunPhase
    samples = spec.BenchmarkRun(spec)
  File "<https://builds.apache.org/job/beam_PerformanceTests_ParquetIOIT_HDFS/ws/PerfKitBenchmarker/perfkitbenchmarker/linux_benchmarks/beam_integration_benchmark.py",> line 159, in Run
    job_type=job_type)
  File "<https://builds.apache.org/job/beam_PerformanceTests_ParquetIOIT_HDFS/ws/PerfKitBenchmarker/perfkitbenchmarker/providers/gcp/gcp_dpb_dataflow.py",> line 90, in SubmitJob
    assert retcode == 0, "Integration Test Failed."
AssertionError: Integration Test Failed.
2018-06-19 04:11:45,370 0fee1fb7 MainThread beam_integration_benchmark(1/1) INFO     Cleaning up benchmark beam_integration_benchmark
2018-06-19 04:11:45,371 0fee1fb7 MainThread beam_integration_benchmark(1/1) INFO     Running: kubectl --kubeconfig=<https://builds.apache.org/job/beam_PerformanceTests_ParquetIOIT_HDFS/ws/config-beam-performancetests-parquetioit-hdfs-31> delete -f <https://builds.apache.org/job/beam_PerformanceTests_ParquetIOIT_HDFS/ws/src/.test-infra/kubernetes/hadoop/LargeITCluster/hdfs-multi-datanode-cluster.yml> --ignore-not-found
2018-06-19 04:13:34,828 0fee1fb7 MainThread beam_integration_benchmark(1/1) ERROR    Exception running benchmark
Traceback (most recent call last):
  File "<https://builds.apache.org/job/beam_PerformanceTests_ParquetIOIT_HDFS/ws/PerfKitBenchmarker/perfkitbenchmarker/pkb.py",> line 801, in RunBenchmarkTask
    RunBenchmark(spec, collector)
  File "<https://builds.apache.org/job/beam_PerformanceTests_ParquetIOIT_HDFS/ws/PerfKitBenchmarker/perfkitbenchmarker/pkb.py",> line 667, in RunBenchmark
    DoRunPhase(spec, collector, detailed_timer)
  File "<https://builds.apache.org/job/beam_PerformanceTests_ParquetIOIT_HDFS/ws/PerfKitBenchmarker/perfkitbenchmarker/pkb.py",> line 547, in DoRunPhase
    samples = spec.BenchmarkRun(spec)
  File "<https://builds.apache.org/job/beam_PerformanceTests_ParquetIOIT_HDFS/ws/PerfKitBenchmarker/perfkitbenchmarker/linux_benchmarks/beam_integration_benchmark.py",> line 159, in Run
    job_type=job_type)
  File "<https://builds.apache.org/job/beam_PerformanceTests_ParquetIOIT_HDFS/ws/PerfKitBenchmarker/perfkitbenchmarker/providers/gcp/gcp_dpb_dataflow.py",> line 90, in SubmitJob
    assert retcode == 0, "Integration Test Failed."
AssertionError: Integration Test Failed.
2018-06-19 04:13:34,829 0fee1fb7 MainThread beam_integration_benchmark(1/1) ERROR    Benchmark 1/1 beam_integration_benchmark (UID: beam_integration_benchmark0) failed. Execution will continue.
2018-06-19 04:13:34,858 0fee1fb7 MainThread INFO     Benchmark run statuses:
---------------------------------------------------------------------------------
Name                        UID                          Status  Failed Substatus
---------------------------------------------------------------------------------
beam_integration_benchmark  beam_integration_benchmark0  FAILED                  
---------------------------------------------------------------------------------
Success rate: 0.00% (0/1)
2018-06-19 04:13:34,860 0fee1fb7 MainThread INFO     Complete logs can be found at: <https://builds.apache.org/job/beam_PerformanceTests_ParquetIOIT_HDFS/ws/runs/0fee1fb7/pkb.log>
2018-06-19 04:13:34,860 0fee1fb7 MainThread INFO     Completion statuses can be found at: <https://builds.apache.org/job/beam_PerformanceTests_ParquetIOIT_HDFS/ws/runs/0fee1fb7/completion_statuses.json>
Build step 'Execute shell' marked build as failure

Jenkins build is back to normal : beam_PerformanceTests_ParquetIOIT_HDFS #32

Posted by Apache Jenkins Server <je...@builds.apache.org>.
See <https://builds.apache.org/job/beam_PerformanceTests_ParquetIOIT_HDFS/32/display/redirect>