You are viewing a plain text version of this content. The canonical link for it is here.
Posted to yarn-dev@hadoop.apache.org by Apache Jenkins Server <je...@builds.apache.org> on 2012/09/05 20:22:41 UTC
Failed: YARN-57 PreCommit Build #25
Jira: https://issues.apache.org/jira/browse/YARN-57
Build: https://builds.apache.org/job/PreCommit-YARN-Build/25/
###################################################################################
########################## LAST 60 LINES OF THE CONSOLE ###########################
[...truncated 9 lines...]
A hadoop-yarn-project/hadoop-yarn/hadoop-yarn-client/src/test/java/org/apache/hadoop/yarn/client
A hadoop-yarn-project/hadoop-yarn/hadoop-yarn-client/src/test/java/org/apache/hadoop/yarn/client/TestYarnClient.java
D hadoop-yarn-project/hadoop-yarn/hadoop-yarn-client/src/main/java/org/hadoop
A hadoop-yarn-project/hadoop-yarn/hadoop-yarn-client/src/main/java/org/apache
A hadoop-yarn-project/hadoop-yarn/hadoop-yarn-client/src/main/java/org/apache/hadoop
A hadoop-yarn-project/hadoop-yarn/hadoop-yarn-client/src/main/java/org/apache/hadoop/yarn
A hadoop-yarn-project/hadoop-yarn/hadoop-yarn-client/src/main/java/org/apache/hadoop/yarn/client
A hadoop-yarn-project/hadoop-yarn/hadoop-yarn-client/src/main/java/org/apache/hadoop/yarn/client/YarnClient.java
A hadoop-yarn-project/hadoop-yarn/hadoop-yarn-client/src/main/java/org/apache/hadoop/yarn/client/YarnClientImpl.java
U hadoop-yarn-project/CHANGES.txt
At revision 1381280
Reverting /home/jenkins/jenkins-slave/workspace/PreCommit-YARN-Build/nightly
Updating http://svn.apache.org/repos/asf/hadoop/nightly
At revision 1381280
no change for http://svn.apache.org/repos/asf/hadoop/nightly since the previous build
No emails were triggered.
[PreCommit-YARN-Build] $ /bin/bash /tmp/hudson5667099097111615735.sh
32768
Running in Jenkins mode
======================================================================
======================================================================
Testing patch for YARN-57.
======================================================================
======================================================================
At revision 1381280.
YARN-57 patch is being downloaded at Wed Sep 5 18:21:01 UTC 2012 from
http://issues.apache.org/jira/secure/attachment/12543840/plugable-pstree-trunk-merge-8.txt
cp: cannot stat `/home/jenkins/buildSupport/lib/*': No such file or directory
======================================================================
======================================================================
Pre-build trunk to verify trunk stability and javac warnings
======================================================================
======================================================================
Compiling /home/jenkins/jenkins-slave/workspace/PreCommit-YARN-Build/trunk
/home/jenkins/tools/maven/latest/bin/mvn clean test -DskipTests -DHadoopPatchProcess -Ptest-patch > /home/jenkins/jenkins-slave/workspace/PreCommit-YARN-Build/patchprocess/trunkJavacWarnings.txt 2>&1
Trunk compilation is broken?
======================================================================
======================================================================
Finished build.
======================================================================
======================================================================
Build step 'Execute shell' marked build as failure
Archiving artifacts
[description-setter] Could not determine description.
Recording test results
Email was triggered for: Failure
Sending email for trigger: Failure
###################################################################################
############################## FAILED TESTS (if any) ##############################
No tests ran.
Success: YARN-87 PreCommit Build #28
Posted by Apache Jenkins Server <je...@builds.apache.org>.
Jira: https://issues.apache.org/jira/browse/YARN-87
Build: https://builds.apache.org/job/PreCommit-YARN-Build/28/
###################################################################################
########################## LAST 60 LINES OF THE CONSOLE ###########################
[...truncated 2870 lines...]
/bin/kill -9 14397
kill: No such process
NOP
+1 overall. Here are the results of testing the latest attachment
http://issues.apache.org/jira/secure/attachment/12543938/YARN-87.patch
against trunk revision .
+1 @author. The patch does not contain any @author tags.
+1 tests included. The patch appears to include 1 new or modified test files.
+1 javac. The applied patch does not increase the total number of javac compiler warnings.
+1 javadoc. The javadoc tool did not generate any warning messages.
+1 eclipse:eclipse. The patch built with eclipse:eclipse.
+1 findbugs. The patch does not introduce any new Findbugs (version 1.3.9) warnings.
+1 release audit. The applied patch does not increase the total number of release audit warnings.
+1 core tests. The patch passed unit tests in hadoop-yarn-project/hadoop-yarn/hadoop-yarn-server/hadoop-yarn-server-nodemanager.
+1 contrib tests. The patch passed contrib unit tests.
Test results: https://builds.apache.org/job/PreCommit-YARN-Build/28//testReport/
Console output: https://builds.apache.org/job/PreCommit-YARN-Build/28//console
This message is automatically generated.
======================================================================
======================================================================
Adding comment to Jira.
======================================================================
======================================================================
Comment added.
A0WI45REIg logged out
======================================================================
======================================================================
Finished build.
======================================================================
======================================================================
Archiving artifacts
Description set: YARN-87
Recording test results
Email was triggered for: Success
Sending email for trigger: Success
###################################################################################
############################## FAILED TESTS (if any) ##############################
All tests passed
Failed: YARN-86 PreCommit Build #27
Posted by Apache Jenkins Server <je...@builds.apache.org>.
Jira: https://issues.apache.org/jira/browse/YARN-86
Build: https://builds.apache.org/job/PreCommit-YARN-Build/27/
###################################################################################
########################## LAST 60 LINES OF THE CONSOLE ###########################
[...truncated 2812 lines...]
NOP
-1 overall. Here are the results of testing the latest attachment
http://issues.apache.org/jira/secure/attachment/12543927/YARN-86.patch
against trunk revision .
+1 @author. The patch does not contain any @author tags.
-1 tests included. The patch doesn't appear to include any new or modified tests.
Please justify why no new tests are needed for this patch.
Also please list what manual steps were performed to verify this patch.
+1 javac. The applied patch does not increase the total number of javac compiler warnings.
+1 javadoc. The javadoc tool did not generate any warning messages.
+1 eclipse:eclipse. The patch built with eclipse:eclipse.
+1 findbugs. The patch does not introduce any new Findbugs (version 1.3.9) warnings.
+1 release audit. The applied patch does not increase the total number of release audit warnings.
+1 core tests. The patch passed unit tests in hadoop-yarn-project/hadoop-yarn/hadoop-yarn-common.
+1 contrib tests. The patch passed contrib unit tests.
Test results: https://builds.apache.org/job/PreCommit-YARN-Build/27//testReport/
Console output: https://builds.apache.org/job/PreCommit-YARN-Build/27//console
This message is automatically generated.
======================================================================
======================================================================
Adding comment to Jira.
======================================================================
======================================================================
Comment added.
GZ1C1j017L logged out
======================================================================
======================================================================
Finished build.
======================================================================
======================================================================
Build step 'Execute shell' marked build as failure
Archiving artifacts
[description-setter] Could not determine description.
Recording test results
Email was triggered for: Failure
Sending email for trigger: Failure
###################################################################################
############################## FAILED TESTS (if any) ##############################
All tests passed
Failed: YARN-30 PreCommit Build #26
Posted by Apache Jenkins Server <je...@builds.apache.org>.
Jira: https://issues.apache.org/jira/browse/YARN-30
Build: https://builds.apache.org/job/PreCommit-YARN-Build/26/
###################################################################################
########################## LAST 60 LINES OF THE CONSOLE ###########################
Started by user vinodkv
Building remotely on hadoop4 in workspace /home/jenkins/jenkins-slave/workspace/PreCommit-YARN-Build
Reverting /home/jenkins/jenkins-slave/workspace/PreCommit-YARN-Build/trunk
Updating http://svn.apache.org/repos/asf/hadoop/common/trunk
At revision 1381286
Reverting /home/jenkins/jenkins-slave/workspace/PreCommit-YARN-Build/nightly
Updating http://svn.apache.org/repos/asf/hadoop/nightly
At revision 1381286
no change for http://svn.apache.org/repos/asf/hadoop/common/trunk since the previous build
no change for http://svn.apache.org/repos/asf/hadoop/nightly since the previous build
No emails were triggered.
[PreCommit-YARN-Build] $ /bin/bash /tmp/hudson250626757201634653.sh
32768
Running in Jenkins mode
======================================================================
======================================================================
Testing patch for YARN-30.
======================================================================
======================================================================
At revision 1381286.
YARN-30 is not "Patch Available". Exiting.
======================================================================
======================================================================
Finished build.
======================================================================
======================================================================
Archiving artifacts
Description set: YARN-30
Recording test results
No test report files were found. Configuration error?
Build step 'Publish JUnit test result report' changed build result to FAILURE
Email was triggered for: Failure
Sending email for trigger: Failure
###################################################################################
############################## FAILED TESTS (if any) ##############################
No tests ran.