You are viewing a plain text version of this content. The canonical link for it is here.
Posted to dev@sling.apache.org by Apache Jenkins Server <je...@builds.apache.org> on 2011/07/06 13:51:59 UTC

Build failed in Jenkins: sling-trunk-1.6 #942

See <https://builds.apache.org/job/sling-trunk-1.6/942/changes>

Changes:

[cziegeler] Switch to scr annotations - no functional changes.

[cziegeler] Correct typo

------------------------------------------
[...truncated 12891 lines...]

-------------------------------------------------------
 T E S T S
-------------------------------------------------------
Running org.apache.sling.testing.samples.integrationtests.http.OsgiConsoleTest
4 [main] INFO org.apache.sling.testing.tools.sling.SlingTestBase - Server base URL=http://localhost:39508
17 [main] INFO org.apache.sling.testing.tools.jarexec.JarExecutor - Executable jar options: -p 39508
17 [main] INFO org.apache.sling.testing.tools.jarexec.JarExecutor - Executing java -Xmx512m -jar <https://builds.apache.org/job/sling-trunk-1.6/ws/trunk/testing/samples/integration-tests/target/dependency/org.apache.sling.launchpad-6-standalone.jar> -p 39508
21 [main] INFO org.apache.sling.testing.tools.sling.TimeoutsProvider - Timeout factor set to 1.0 from system property sling.testing.timeout.multiplier
21 [main] INFO org.apache.sling.testing.tools.sling.SlingTestBase - Will wait up to 60 seconds for server to become ready
23 [main] INFO org.apache.sling.testing.tools.sling.SlingTestBase - Checking that GET requests return expected content (timeout=60 seconds): [/:script src="system/sling.js", /.explorer.html:href="/libs/sling/explorer/css/explorer.css", /sling-test/sling/sling-test.html:Sling client library tests]
06.07.2011 04:51:39.042 *INFO* [main] Setting sling.home=sling (default)
06.07.2011 04:51:39.043 *INFO* [main] Starting Sling in sling (<https://builds.apache.org/job/sling-trunk-1.6/ws/trunk/testing/samples/integration-tests/sling)>
06.07.2011 04:51:39.047 *INFO* [main] Checking launcher JAR in folder sling
06.07.2011 04:51:39.058 *INFO* [main] Installing new launcher: jar:<https://builds.apache.org/job/sling-trunk-1.6/ws/trunk/testing/samples/integration-tests/target/dependency/org.apache.sling.launchpad-6-standalone.jar!/resources/org.apache.sling.launchpad.base.jar,> 2.3.0 (org.apache.sling.launchpad.base.jar.1309953099058)
06.07.2011 04:51:39.059 *INFO* [main] Loading launcher class org.apache.sling.launchpad.base.app.MainDelegate from org.apache.sling.launchpad.base.jar.1309953099058
06.07.2011 04:51:39.069 *INFO* [main] Starting launcher ...
06.07.2011 04:51:39.071 *INFO* [main] HTTP server port: 39508
06.07.2011 04:51:40.192 *INFO* [main] Startup completed
10795 [main] INFO org.apache.sling.testing.tools.sling.SlingTestBase - All 3 paths return expected content, server ready
10795 [main] INFO org.apache.sling.testing.tools.osgi.WebconsoleClient - Installing additional bundle org.apache.sling.junit.core-1.0.7-SNAPSHOT.jar
10952 [main] INFO org.apache.sling.testing.tools.osgi.WebconsoleClient - Installing additional bundle org.apache.sling.junit.scriptable-1.0.7-SNAPSHOT.jar
10959 [main] INFO org.apache.sling.testing.tools.osgi.WebconsoleClient - Installing additional bundle org.apache.sling.testing.samples.sampletests-1.0.7-SNAPSHOT.jar
10966 [main] INFO org.apache.sling.testing.tools.osgi.WebconsoleClient - Installing additional bundle org.apache.sling.testing.samples.failingtests-1.0.7-SNAPSHOT.jar
10973 [main] INFO org.apache.sling.testing.tools.osgi.WebconsoleClient - Installing additional bundle org.apache.sling.junit.remote-1.0.7-SNAPSHOT.jar
10979 [main] INFO org.apache.sling.testing.tools.osgi.WebconsoleClient - Installing additional bundle org.apache.sling.testing.tools-1.0.5-SNAPSHOT.jar
10987 [main] INFO org.apache.sling.testing.tools.sling.SlingTestBase - 6 additional bundles installed from <https://builds.apache.org/job/sling-trunk-1.6/ws/trunk/testing/samples/integration-tests/target/sling/additional-bundles>
Tests run: 1, Failures: 0, Errors: 0, Skipped: 0, Time elapsed: 13.144 sec
Running org.apache.sling.testing.samples.integrationtests.serverside.DontCareForTestsCountTest
13081 [main] INFO org.apache.sling.testing.tools.sling.SlingTestBase - Server base URL=http://localhost:39508
13081 [main] INFO org.apache.sling.testing.samples.integrationtests.serverside.DontCareForTestsCountTest - Checking that /system/sling/junit returns status 200, timeout=60 seconds
13111 [main] INFO org.apache.sling.junit.remote.httpclient.RemoteTestHttpClient - Executing test remotely, path=/org.apache.sling.testing.samples.sampletests.json JUnit servlet URL=http://localhost:39508/system/sling/junit
13174 [main] INFO org.apache.sling.junit.remote.testrunner.SlingRemoteTestRunner - Server-side tests executed at http://localhost:39508/system/sling/junit with path /org.apache.sling.testing.samples.sampletests.json
Tests run: 5, Failures: 0, Errors: 0, Skipped: 0, Time elapsed: 0.097 sec
Running org.apache.sling.testing.samples.integrationtests.serverside.JSONResponseTest
13183 [main] INFO org.apache.sling.testing.tools.sling.SlingTestBase - Server base URL=http://localhost:39508
13183 [main] INFO org.apache.sling.testing.samples.integrationtests.serverside.JSONResponseTest - Checking JSON list of server-side tests (timeout=30 seconds)
Tests run: 1, Failures: 0, Errors: 0, Skipped: 0, Time elapsed: 0.004 sec
Running org.apache.sling.testing.samples.integrationtests.serverside.FailingTestsTest
13191 [main] INFO org.apache.sling.testing.tools.sling.SlingTestBase - Server base URL=http://localhost:39508
Tests run: 1, Failures: 0, Errors: 0, Skipped: 0, Time elapsed: 0.009 sec
Running org.apache.sling.testing.samples.integrationtests.serverside.SingleServerSideMethodTest
13203 [main] INFO org.apache.sling.testing.tools.sling.SlingTestBase - Server base URL=http://localhost:39508
13203 [main] INFO org.apache.sling.junit.remote.httpclient.RemoteTestHttpClient - Executing test remotely, path=/org.apache.sling.testing.samples.sampletests.JUnit4Test/testRequiresBefore.json JUnit servlet URL=http://localhost:39508/system/sling/junit
13218 [main] INFO org.apache.sling.junit.remote.testrunner.SlingRemoteTestRunner - Server-side tests executed at http://localhost:39508/system/sling/junit with path /org.apache.sling.testing.samples.sampletests.JUnit4Test/testRequiresBefore.json
Tests run: 1, Failures: 0, Errors: 0, Skipped: 0, Time elapsed: 0.015 sec
Running org.apache.sling.testing.samples.integrationtests.serverside.sling.SlingServerSideSingleMethodTest
13221 [main] INFO org.apache.sling.testing.tools.sling.SlingTestBase - Server base URL=http://localhost:39508
13323 [main] INFO org.apache.sling.testing.samples.integrationtests.serverside.sling.SlingServerSideSingleMethodTest - Checking that /test/sling/1309953112140.junit returns status 200, timeout=30 seconds
13340 [main] INFO org.apache.sling.testing.samples.integrationtests.serverside.sling.SlingServerSideSingleMethodTest - /test/sling/1309953112140.junit is ready, returns expected content
13340 [main] INFO org.apache.sling.junit.remote.httpclient.RemoteTestHttpClient - Executing test remotely, path=/org.apache.sling.testing.samples.sampletests.JUnit4Test/testRequiresBefore.json JUnit servlet URL=http://localhost:39508/test/sling/1309953112140.junit
13350 [main] INFO org.apache.sling.junit.remote.testrunner.SlingRemoteTestRunner - Server-side tests executed at http://localhost:39508/test/sling/1309953112140.junit with path /org.apache.sling.testing.samples.sampletests.JUnit4Test/testRequiresBefore.json
Tests run: 1, Failures: 0, Errors: 0, Skipped: 0, Time elapsed: 0.13 sec
Running org.apache.sling.testing.samples.integrationtests.serverside.sling.SlingServerSideTest
13353 [main] INFO org.apache.sling.testing.tools.sling.SlingTestBase - Server base URL=http://localhost:39508
13353 [main] INFO org.apache.sling.junit.remote.httpclient.RemoteTestHttpClient - Executing test remotely, path=/org.apache.sling.testing.samples.sampletests.json JUnit servlet URL=http://localhost:39508/test/sling/1309953112140.junit
13364 [main] INFO org.apache.sling.junit.remote.testrunner.SlingRemoteTestRunner - Server-side tests executed at http://localhost:39508/test/sling/1309953112140.junit with path /org.apache.sling.testing.samples.sampletests.json
Tests run: 5, Failures: 0, Errors: 0, Skipped: 0, Time elapsed: 0.014 sec
Running org.apache.sling.testing.samples.integrationtests.serverside.ServerSideSampleTest
13369 [main] INFO org.apache.sling.testing.tools.sling.SlingTestBase - Server base URL=http://localhost:39508
13369 [main] INFO org.apache.sling.junit.remote.httpclient.RemoteTestHttpClient - Executing test remotely, path=/org.apache.sling.testing.samples.sampletests.json JUnit servlet URL=http://localhost:39508/system/sling/junit
13378 [main] INFO org.apache.sling.junit.remote.testrunner.SlingRemoteTestRunner - Server-side tests executed at http://localhost:39508/system/sling/junit with path /org.apache.sling.testing.samples.sampletests.json
Tests run: 5, Failures: 0, Errors: 0, Skipped: 0, Time elapsed: 0.012 sec
Running org.apache.sling.testing.samples.integrationtests.serverside.scriptable.ScriptableTestsTest
13391 [main] INFO org.apache.sling.testing.tools.sling.SlingTestBase - Server base URL=http://localhost:39508
13506 [main] INFO org.apache.sling.junit.remote.httpclient.RemoteTestHttpClient - Executing test remotely, path=/org.apache.sling.junit.scriptable.ScriptableTestsProvider.json JUnit servlet URL=http://localhost:39508/system/sling/junit
13655 [main] INFO org.apache.sling.testing.tools.sling.SlingTestBase - Server base URL=http://localhost:39508
13722 [main] INFO org.apache.sling.junit.remote.httpclient.RemoteTestHttpClient - Executing test remotely, path=/org.apache.sling.junit.scriptable.ScriptableTestsProvider.json JUnit servlet URL=http://localhost:39508/system/sling/junit
Tests run: 2, Failures: 1, Errors: 0, Skipped: 0, Time elapsed: 0.395 sec <<< FAILURE!

Results :

Failed tests: 
  testScriptableTest[0](org.apache.sling.testing.samples.integrationtests.serverside.scriptable.ScriptableTestsTest): Expected 0 failing tests but got 1: [verifyContent[0](org.apache.sling.junit.scriptable.TestAllPaths): Unexpected content at path /apps/testing/ScriptableTests/testnode.test.txt, should be just TEST_PASSED (lines starting with # and empty lines are ignored)
content was:
** Resource dumped by PlainTextRendererServlet**
Resource path:/apps/testing/ScriptableTests/testnode
Resource metadata: {sling.resolutionPathInfo=.test.txt, sling.resolutionPath=/apps/testing/ScriptableTests/testnode}
Resource type: testing/ScriptableTests
Resource super type: -

** Resource properties **
sling:resourceType: testing/ScriptableTests
jcr:createdBy: admin
jcr:mixinTypes: [sling:Test]
jcr:created: java.util.GregorianCalendar[time=1309953112344,areFieldsSet=true,areAllFieldsSet=true,lenient=true,zone=sun.util.calendar.ZoneInfo[id="America/Los_Angeles",offset=-28800000,dstSavings=3600000,useDaylight=true,transitions=185,lastRule=java.util.SimpleTimeZone[id=America/Los_Angeles,offset=-28800000,dstSavings=3600000,useDaylight=true,startYear=0,startMode=3,startMonth=2,startDay=8,startDayOfWeek=1,startTime=7200000,startTimeMode=0,endMode=3,endMonth=10,endDay=1,endDayOfWeek=1,endTime=7200000,endTimeMode=0]],firstDayOfWeek=1,minimalDaysInFirstWeek=1,ERA=1,YEAR=2011,MONTH=6,WEEK_OF_YEAR=28,WEEK_OF_MONTH=2,DAY_OF_MONTH=6,DAY_OF_YEAR=187,DAY_OF_WEEK=4,DAY_OF_WEEK_IN_MONTH=1,AM_PM=0,HOUR=4,HOUR_OF_DAY=4,MINUTE=51,SECOND=52,MILLISECOND=344,ZONE_OFFSET=-28800000,DST_OFFSET=3600000]
jcr:primaryType: sling:Folder

]

Tests run: 22, Failures: 1, Errors: 0, Skipped: 0

[WARNING] File encoding has not been set, using platform encoding ANSI_X3.4-1968, i.e. build is platform dependent!
[JENKINS] Recording test results
[INFO] Checking legal files in: org.apache.sling.testing.samples.integrationtests-1.0.7-SNAPSHOT.jar
[INFO] [INFO] Checking legal files in: org.apache.sling.testing.samples.integrationtests-1.0.7-SNAPSHOT-sources.jar

[INFO] --- ianal-maven-plugin:1.0-alpha-1:verify-legal-files (default) @ org.apache.sling.testing.samples.integrationtests ---
[INFO] [INFO] Failsafe report directory: <https://builds.apache.org/job/sling-trunk-1.6/ws/trunk/testing/samples/integration-tests/target/failsafe-reports>
[WARNING] File encoding has not been set, using platform encoding ANSI_X3.4-1968, i.e. build is platform dependent!

[INFO] --- maven-failsafe-plugin:2.7.2:verify (verify) @ org.apache.sling.testing.samples.integrationtests ---
mojoFailed org.apache.maven.plugins:maven-failsafe-plugin:2.7.2(verify)
projectFailed org.apache.sling:org.apache.sling.testing.samples.integrationtests:1.0.7-SNAPSHOT
[JENKINS] Archiving <https://builds.apache.org/job/sling-trunk-1.6/ws/trunk/testing/samples/integration-tests/target/org.apache.sling.testing.samples.integrationtests-1.0.7-SNAPSHOT-sources.jar> to /home/hudson/hudson/jobs/sling-trunk-1.6/modules/org.apache.sling$org.apache.sling.testing.samples.integrationtests/builds/2011-07-06_11-19-51/archive/org.apache.sling/org.apache.sling.testing.samples.integrationtests/1.0.7-SNAPSHOT/org.apache.sling.testing.samples.integrationtests-1.0.7-SNAPSHOT-sources.jar
sessionEnded
[INFO] ------------------------------------------------------------------------
[INFO] Reactor Summary:
[INFO] 
[INFO] Apache Sling (Parent) ............................. SUCCESS [11.769s]
[INFO] Apache Sling Maven Plugin to create Jackrabbit OCM descriptors  SUCCESS [7.475s]
[INFO] Apache Sling Maven Plugin for Compiling JSP Sources into Bundles  SUCCESS [5.883s]
[INFO] Apache Sling Maven Plugin for Supporting Bundle Development  SUCCESS [5.735s]
[INFO] Apache Sling Launchpad API ........................ SUCCESS [6.055s]
[INFO] Apache Sling Launchpad Base ....................... SUCCESS [22.877s]
[INFO] Apache Sling Launchpad Maven Plugin ............... SUCCESS [9.230s]
[INFO] Sling Launchpad Standalone Archetype .............. SUCCESS [5.001s]
[INFO] Sling Launchpad Webapp Archetype .................. SUCCESS [4.578s]
[INFO] Sling Initial Content Archetype ................... SUCCESS [5.081s]
[INFO] Sling Servlet Archetype ........................... SUCCESS [4.404s]
[INFO] Apache Sling API .................................. SUCCESS [7.974s]
[INFO] Apache Sling System Bundle Extension: Java Transaction API  SUCCESS [5.320s]
[INFO] Apache Sling System Bundle Extension: XML APIs .... SUCCESS [4.914s]
[INFO] Apache Sling Dynamic Class Loader Support ......... SUCCESS [6.412s]
[INFO] Apache Sling JSON Library ......................... SUCCESS [6.639s]
[INFO] Apache Sling OSGi LogService Implementation ....... SUCCESS [6.837s]
[INFO] Apache Sling MIME type mapping support ............ SUCCESS [6.286s]
[INFO] Apache Sling Commons OSGi support ................. SUCCESS [6.554s]
[INFO] Apache Sling Scheduler Support .................... SUCCESS [9.296s]
[INFO] Apache Sling Testing Utilities .................... SUCCESS [13.933s]
[INFO] Apache Sling Thread Support ....................... SUCCESS [6.007s]
[INFO] Apache Sling Authentication Service ............... SUCCESS [7.767s]
[INFO] Apache Sling OpenID Authentication ................ SUCCESS [9.137s]
[INFO] Apache Sling Form Based Authentication Handler .... SUCCESS [7.543s]
[INFO] Apache Sling Authentication Selector .............. SUCCESS [6.308s]
[INFO] Apache Sling Engine Implementation ................ SUCCESS [9.568s]
[INFO] Apache Sling Repository API Bundle ................ SUCCESS [5.784s]
[INFO] Apache Sling JCR Base Bundle ...................... SUCCESS [7.244s]
[INFO] Apache Sling JCR ClassLoader ...................... SUCCESS [7.426s]
[INFO] Apache Sling Initial Content Loader ............... SUCCESS [8.974s]
[INFO] Apache Sling Jackrabbit Embedded Repository ....... SUCCESS [32.726s]
[INFO] Apache Sling Jackrabbit UserManager Support ....... SUCCESS [7.115s]
[INFO] Apache Sling Jackrabbit JSR-283 Access Control Manager Support  SUCCESS [6.142s]
[INFO] Apache Sling Object Content Mapping ............... SUCCESS [10.316s]
[INFO] Apache Sling JCR Resource Resolver ................ SUCCESS [34.654s]
[INFO] Apache Sling Simple WebDAV Access to repositories . SUCCESS [12.122s]
[INFO] Apache Sling DavEx Access to repositories ......... SUCCESS [9.164s]
[INFO] Apache Sling JCR WebConsole Bundle ................ SUCCESS [6.496s]
[INFO] Apache Sling Servlet Resolver ..................... SUCCESS [8.809s]
[INFO] Apache Sling Default GET Servlets ................. SUCCESS [8.812s]
[INFO] Apache Sling Default POST Servlets ................ SUCCESS [9.994s]
[INFO] Apache Sling Scripting Implementation API ......... SUCCESS [7.590s]
[INFO] Apache Sling Scripting Core implementation ........ SUCCESS [8.981s]
[INFO] Apache Sling Scripting JavaScript Support ......... SUCCESS [19.123s]
[INFO] Apache Sling Scripting JSP Support ................ SUCCESS [22.841s]
[INFO] Apache Sling JSP Tag Library ...................... SUCCESS [7.273s]
[INFO] Apache Sling Adapter Manager Implementation ....... SUCCESS [8.169s]
[INFO] Apache Sling Bundle Resource Provider ............. SUCCESS [7.390s]
[INFO] Apache Sling Event Support ........................ SUCCESS [4:08.013s]
[INFO] Apache Sling Filesystem Resource Provider ......... SUCCESS [8.392s]
[INFO] Apache Sling Settings ............................. SUCCESS [8.186s]
[INFO] Apache Sling Thread Dumper ........................ SUCCESS [7.566s]
[INFO] Apache Sling Web Console Branding ................. SUCCESS [7.323s]
[INFO] Apache Sling Web Console Security Provider ........ SUCCESS [7.553s]
[INFO] Apache Sling Integration Tests .................... SUCCESS [13.374s]
[INFO] Apache Sling Groovy Extensions .................... SUCCESS [12.092s]
[INFO] Apache Sling Explorer ............................. SUCCESS [8.065s]
[INFO] Apache Sling Test Tools ........................... SUCCESS [8.383s]
[INFO] Apache Sling JUnit Core ........................... SUCCESS [10.261s]
[INFO] Apache Sling JUnit Scriptable Tests Provider ...... SUCCESS [7.574s]
[INFO] Apache Sling JUnit Remote Tests Runners ........... SUCCESS [9.548s]
[INFO] Apache Sling Installer ............................ SUCCESS [9.504s]
[INFO] Apache Sling File Installer ....................... SUCCESS [7.308s]
[INFO] Apache Sling JCR Installer ........................ SUCCESS [1:56.462s]
[INFO] Apache Sling Installer Configuration Admin Support  SUCCESS [7.797s]
[INFO] Apache Sling Deployment Package Installer ......... SUCCESS [7.202s]
[INFO] Apache Sling Installer Integration Tests .......... SUCCESS [1:12.494s]
[INFO] Apache Sling Launchpad Installer .................. SUCCESS [7.355s]
[INFO] Apache Sling Launchpad Content .................... SUCCESS [6.942s]
[INFO] Apache Sling Launchpad Application Builder ........ SUCCESS [4:15.433s]
[INFO] Apache Sling Sample Server-Side Tests ............. SUCCESS [7.558s]
[INFO] Apache Sling Failing Server-Side Tests ............ SUCCESS [7.905s]
[INFO] Apache Sling Sample Integration Tests ............. FAILURE [25.704s]
[INFO] Apache Sling Launchpad Testing Services ........... SKIPPED
[INFO] Apache Sling Launchpad Testing Services WAR ....... SKIPPED
[INFO] org.apache.sling.launchpad.test-bundles ........... SKIPPED
[INFO] Apache Sling Launchpad Testing .................... SKIPPED
[INFO] Apache Sling Launchpad Testing WAR version ........ SKIPPED
[INFO] Apache Sling (Builder) ............................ SKIPPED
[INFO] ------------------------------------------------------------------------
[INFO] BUILD FAILURE
[INFO] ------------------------------------------------------------------------
[INFO] Total time: 31:52.648s
[INFO] Finished at: Wed Jul 06 04:51:54 PDT 2011
[INFO] Final Memory: 183M/454M
[INFO] ------------------------------------------------------------------------
maven builder waiting
mavenExecutionResult exceptions not empty
message : Failed to execute goal org.apache.maven.plugins:maven-failsafe-plugin:2.7.2:verify (verify) on project org.apache.sling.testing.samples.integrationtests: There are test failures.

Please refer to <https://builds.apache.org/job/sling-trunk-1.6/ws/trunk/testing/samples/integration-tests/target/failsafe-reports> for the individual test results.
cause : There are test failures.

Please refer to <https://builds.apache.org/job/sling-trunk-1.6/ws/trunk/testing/samples/integration-tests/target/failsafe-reports> for the individual test results.
Stack trace : 
org.apache.maven.lifecycle.LifecycleExecutionException: Failed to execute goal org.apache.maven.plugins:maven-failsafe-plugin:2.7.2:verify (verify) on project org.apache.sling.testing.samples.integrationtests: There are test failures.

Please refer to <https://builds.apache.org/job/sling-trunk-1.6/ws/trunk/testing/samples/integration-tests/target/failsafe-reports> for the individual test results.
	at org.apache.maven.lifecycle.internal.MojoExecutor.execute(MojoExecutor.java:213)
	at org.apache.maven.lifecycle.internal.MojoExecutor.execute(MojoExecutor.java:153)
	at org.apache.maven.lifecycle.internal.MojoExecutor.execute(MojoExecutor.java:145)
	at org.apache.maven.lifecycle.internal.LifecycleModuleBuilder.buildProject(LifecycleModuleBuilder.java:84)
	at org.apache.maven.lifecycle.internal.LifecycleModuleBuilder.buildProject(LifecycleModuleBuilder.java:59)
	at org.apache.maven.lifecycle.internal.LifecycleStarter.singleThreadedBuild(LifecycleStarter.java:183)
	at org.apache.maven.lifecycle.internal.LifecycleStarter.execute(LifecycleStarter.java:161)
	at org.apache.maven.DefaultMaven.doExecute(DefaultMaven.java:319)
	at org.apache.maven.DefaultMaven.execute(DefaultMaven.java:156)
	at org.jvnet.hudson.maven3.launcher.Maven3Launcher.main(Maven3Launcher.java:79)
	at sun.reflect.NativeMethodAccessorImpl.invoke0(Native Method)
	at sun.reflect.NativeMethodAccessorImpl.invoke(NativeMethodAccessorImpl.java:39)
	at sun.reflect.DelegatingMethodAccessorImpl.invoke(DelegatingMethodAccessorImpl.java:25)
	at java.lang.reflect.Method.invoke(Method.java:597)
	at org.codehaus.plexus.classworlds.launcher.Launcher.launchStandard(Launcher.java:329)
	at org.codehaus.plexus.classworlds.launcher.Launcher.launch(Launcher.java:239)
	at org.jvnet.hudson.maven3.agent.Maven3Main.launch(Maven3Main.java:158)
	at hudson.maven.Maven3Builder.call(Maven3Builder.java:128)
	at hudson.maven.Maven3Builder.call(Maven3Builder.java:75)
	at hudson.remoting.UserRequest.perform(UserRequest.java:118)
	at hudson.remoting.UserRequest.perform(UserRequest.java:48)
	at hudson.remoting.Request$2.run(Request.java:270)
	at java.util.concurrent.Executors$RunnableAdapter.call(Executors.java:441)
	at java.util.concurrent.FutureTask$Sync.innerRun(FutureTask.java:303)
	at java.util.concurrent.FutureTask.run(FutureTask.java:138)
	at java.util.concurrent.ThreadPoolExecutor$Worker.runTask(ThreadPoolExecutor.java:886)
	at java.util.concurrent.ThreadPoolExecutor$Worker.run(ThreadPoolExecutor.java:908)
	at java.lang.Thread.run(Thread.java:619)
Caused by: org.apache.maven.plugin.MojoFailureException: There are test failures.

Please refer to <https://builds.apache.org/job/sling-trunk-1.6/ws/trunk/testing/samples/integration-tests/target/failsafe-reports> for the individual test results.
	at org.apache.maven.plugin.surefire.SurefireHelper.reportExecution(SurefireHelper.java:74)
	at org.apache.maven.plugin.failsafe.VerifyMojo.execute(VerifyMojo.java:205)
	at org.apache.maven.plugin.DefaultBuildPluginManager.executeMojo(DefaultBuildPluginManager.java:101)
	at org.apache.maven.lifecycle.internal.MojoExecutor.execute(MojoExecutor.java:209)
	... 27 more
Maven failed with error.
Sending e-mails to: dev@sling.apache.org
channel stopped
[locks-and-latches] Releasing all the locks
[locks-and-latches] All the locks released


Jenkins build is back to normal : sling-trunk-1.6 #943

Posted by Apache Jenkins Server <je...@builds.apache.org>.
See <https://builds.apache.org/job/sling-trunk-1.6/943/changes>