You are viewing a plain text version of this content. The canonical link for it is here.
Posted to builds@beam.apache.org by Apache Jenkins Server <je...@builds.apache.org> on 2022/06/23 16:26:53 UTC

Build failed in Jenkins: beam_PostCommit_Python_VR_Flink #2515

See <https://ci-beam.apache.org/job/beam_PostCommit_Python_VR_Flink/2515/display/redirect?page=changes>

Changes:

[andyye333] Move wrapper class outside run()

[noreply] Fix issues with test ordering (#21986)


------------------------------------------
[...truncated 61.81 KB...]
  Using cached wheel-0.37.1-py2.py3-none-any.whl (35 kB)
Installing collected packages: pip, setuptools, wheel
  Attempting uninstall: pip
    Found existing installation: pip 20.0.2
    Uninstalling pip-20.0.2:
      Successfully uninstalled pip-20.0.2

> Task :sdks:python:setupVirtualenv
  Using cached grpcio_tools-1.37.0-cp38-cp38-manylinux2014_x86_64.whl (2.5 MB)
Collecting mypy-protobuf==1.18
  Using cached mypy_protobuf-1.18-py3-none-any.whl (7.3 kB)
Collecting distlib==0.3.1
  Using cached distlib-0.3.1-py2.py3-none-any.whl (335 kB)
Collecting virtualenv!=20.0.0,!=20.0.1,!=20.0.2,!=20.0.3,!=20.0.4,!=20.0.5,!=20.0.6,!=20.0.7,>=16.0.0
  Using cached virtualenv-20.14.1-py2.py3-none-any.whl (8.8 MB)
Collecting toml>=0.9.4
  Using cached toml-0.10.2-py2.py3-none-any.whl (16 kB)
Collecting packaging>=14
  Using cached packaging-21.3-py3-none-any.whl (40 kB)
Collecting pluggy>=0.12.0
  Using cached pluggy-1.0.0-py2.py3-none-any.whl (13 kB)
Collecting six>=1.14.0
  Using cached six-1.16.0-py2.py3-none-any.whl (11 kB)
Collecting py>=1.4.17
  Using cached py-1.11.0-py2.py3-none-any.whl (98 kB)
Collecting filelock>=3.0.0
  Using cached filelock-3.7.1-py3-none-any.whl (10 kB)
Collecting grpcio>=1.37.0
  Using cached grpcio-1.47.0-cp38-cp38-manylinux_2_17_x86_64.manylinux2014_x86_64.whl (4.5 MB)
Collecting protobuf<4.0dev,>=3.5.0.post1
  Using cached protobuf-3.20.1-cp38-cp38-manylinux_2_5_x86_64.manylinux1_x86_64.whl (1.0 MB)
Collecting pyparsing!=3.0.5,>=2.0.2
  Using cached pyparsing-3.0.9-py3-none-any.whl (98 kB)
Collecting platformdirs<3,>=2
  Using cached platformdirs-2.5.2-py3-none-any.whl (14 kB)
Installing collected packages: distlib, wheel, toml, six, setuptools, pyparsing, py, protobuf, pluggy, platformdirs, filelock, virtualenv, packaging, mypy-protobuf, grpcio, tox, grpcio-tools
  Attempting uninstall: setuptools
    Found existing installation: setuptools 44.0.0
    Uninstalling setuptools-44.0.0:
      Successfully uninstalled setuptools-44.0.0
Successfully installed distlib-0.3.1 filelock-3.7.1 grpcio-1.47.0 grpcio-tools-1.37.0 mypy-protobuf-1.18 packaging-21.3 platformdirs-2.5.2 pluggy-1.0.0 protobuf-3.20.1 py-1.11.0 pyparsing-3.0.9 setuptools-62.6.0 six-1.16.0 toml-0.10.2 tox-3.20.1 virtualenv-20.14.1 wheel-0.37.1

> Task :sdks:python:test-suites:portable:py37:setupVirtualenv
Collecting grpcio-tools==1.37.0
  Using cached grpcio_tools-1.37.0-cp37-cp37m-manylinux2014_x86_64.whl (2.5 MB)
Collecting mypy-protobuf==1.18
  Using cached mypy_protobuf-1.18-py3-none-any.whl (7.3 kB)
Collecting distlib==0.3.1
  Using cached distlib-0.3.1-py2.py3-none-any.whl (335 kB)
Collecting py>=1.4.17
  Using cached py-1.11.0-py2.py3-none-any.whl (98 kB)
Collecting filelock>=3.0.0
  Using cached filelock-3.7.1-py3-none-any.whl (10 kB)
Collecting virtualenv!=20.0.0,!=20.0.1,!=20.0.2,!=20.0.3,!=20.0.4,!=20.0.5,!=20.0.6,!=20.0.7,>=16.0.0
  Using cached virtualenv-20.14.1-py2.py3-none-any.whl (8.8 MB)
Collecting packaging>=14
  Using cached packaging-21.3-py3-none-any.whl (40 kB)
Collecting six>=1.14.0
  Using cached six-1.16.0-py2.py3-none-any.whl (11 kB)
Collecting toml>=0.9.4
  Using cached toml-0.10.2-py2.py3-none-any.whl (16 kB)
Collecting importlib-metadata<3,>=0.12
  Using cached importlib_metadata-2.1.3-py2.py3-none-any.whl (10 kB)
Collecting pluggy>=0.12.0
  Using cached pluggy-1.0.0-py2.py3-none-any.whl (13 kB)
Collecting protobuf<4.0dev,>=3.5.0.post1
  Using cached protobuf-3.20.1-cp37-cp37m-manylinux_2_5_x86_64.manylinux1_x86_64.whl (1.0 MB)
Collecting grpcio>=1.37.0
  Using cached grpcio-1.47.0-cp37-cp37m-manylinux_2_17_x86_64.manylinux2014_x86_64.whl (4.5 MB)
Collecting zipp>=0.5
  Using cached zipp-3.8.0-py3-none-any.whl (5.4 kB)
Collecting pyparsing!=3.0.5,>=2.0.2
  Using cached pyparsing-3.0.9-py3-none-any.whl (98 kB)
Collecting platformdirs<3,>=2
  Using cached platformdirs-2.5.2-py3-none-any.whl (14 kB)
Installing collected packages: distlib, zipp, wheel, toml, six, setuptools, pyparsing, py, protobuf, platformdirs, filelock, packaging, mypy-protobuf, importlib-metadata, grpcio, virtualenv, pluggy, grpcio-tools, tox
  Attempting uninstall: setuptools
    Found existing installation: setuptools 47.1.0
    Uninstalling setuptools-47.1.0:
      Successfully uninstalled setuptools-47.1.0

> Task :sdks:python:test-suites:portable:py38:setupVirtualenv
Collecting distlib==0.3.1
  Using cached distlib-0.3.1-py2.py3-none-any.whl (335 kB)
Collecting packaging>=14
  Using cached packaging-21.3-py3-none-any.whl (40 kB)
Collecting pluggy>=0.12.0
  Using cached pluggy-1.0.0-py2.py3-none-any.whl (13 kB)
Collecting filelock>=3.0.0
  Using cached filelock-3.7.1-py3-none-any.whl (10 kB)
Collecting toml>=0.9.4
  Using cached toml-0.10.2-py2.py3-none-any.whl (16 kB)
Collecting py>=1.4.17
  Using cached py-1.11.0-py2.py3-none-any.whl (98 kB)
Collecting virtualenv!=20.0.0,!=20.0.1,!=20.0.2,!=20.0.3,!=20.0.4,!=20.0.5,!=20.0.6,!=20.0.7,>=16.0.0
  Using cached virtualenv-20.14.1-py2.py3-none-any.whl (8.8 MB)
Collecting six>=1.14.0
  Using cached six-1.16.0-py2.py3-none-any.whl (11 kB)
Collecting grpcio>=1.37.0
  Using cached grpcio-1.47.0-cp38-cp38-manylinux_2_17_x86_64.manylinux2014_x86_64.whl (4.5 MB)
Collecting protobuf<4.0dev,>=3.5.0.post1
  Using cached protobuf-3.20.1-cp38-cp38-manylinux_2_5_x86_64.manylinux1_x86_64.whl (1.0 MB)
Collecting pyparsing!=3.0.5,>=2.0.2
  Using cached pyparsing-3.0.9-py3-none-any.whl (98 kB)
Collecting platformdirs<3,>=2
  Using cached platformdirs-2.5.2-py3-none-any.whl (14 kB)
Installing collected packages: distlib, wheel, toml, six, setuptools, pyparsing, py, protobuf, pluggy, platformdirs, filelock, virtualenv, packaging, mypy-protobuf, grpcio, tox, grpcio-tools
  Attempting uninstall: setuptools
    Found existing installation: setuptools 44.0.0
    Uninstalling setuptools-44.0.0:
      Successfully uninstalled setuptools-44.0.0
Successfully installed distlib-0.3.1 filelock-3.7.1 grpcio-1.47.0 grpcio-tools-1.37.0 mypy-protobuf-1.18 packaging-21.3 platformdirs-2.5.2 pluggy-1.0.0 protobuf-3.20.1 py-1.11.0 pyparsing-3.0.9 setuptools-62.6.0 six-1.16.0 toml-0.10.2 tox-3.20.1 virtualenv-20.14.1 wheel-0.37.1

> Task :sdks:python:test-suites:portable:py39:setupVirtualenv
Collecting grpcio-tools==1.37.0
  Using cached grpcio_tools-1.37.0-cp39-cp39-manylinux2014_x86_64.whl (2.5 MB)
Collecting mypy-protobuf==1.18
  Using cached mypy_protobuf-1.18-py3-none-any.whl (7.3 kB)
Collecting distlib==0.3.1
  Using cached distlib-0.3.1-py2.py3-none-any.whl (335 kB)
Collecting pluggy>=0.12.0
  Using cached pluggy-1.0.0-py2.py3-none-any.whl (13 kB)
Collecting six>=1.14.0
  Using cached six-1.16.0-py2.py3-none-any.whl (11 kB)
Collecting packaging>=14
  Using cached packaging-21.3-py3-none-any.whl (40 kB)
Collecting virtualenv!=20.0.0,!=20.0.1,!=20.0.2,!=20.0.3,!=20.0.4,!=20.0.5,!=20.0.6,!=20.0.7,>=16.0.0
  Using cached virtualenv-20.14.1-py2.py3-none-any.whl (8.8 MB)
Collecting filelock>=3.0.0
  Using cached filelock-3.7.1-py3-none-any.whl (10 kB)
Collecting py>=1.4.17
  Using cached py-1.11.0-py2.py3-none-any.whl (98 kB)
Collecting toml>=0.9.4
  Using cached toml-0.10.2-py2.py3-none-any.whl (16 kB)
Collecting grpcio>=1.37.0
  Using cached grpcio-1.47.0-cp39-cp39-manylinux_2_17_x86_64.manylinux2014_x86_64.whl (4.5 MB)
Collecting protobuf<4.0dev,>=3.5.0.post1
  Using cached protobuf-3.20.1-cp39-cp39-manylinux_2_5_x86_64.manylinux1_x86_64.whl (1.0 MB)
Collecting pyparsing!=3.0.5,>=2.0.2
  Using cached pyparsing-3.0.9-py3-none-any.whl (98 kB)
Collecting platformdirs<3,>=2
  Using cached platformdirs-2.5.2-py3-none-any.whl (14 kB)
Installing collected packages: distlib, wheel, toml, six, setuptools, pyparsing, py, protobuf, pluggy, platformdirs, filelock, virtualenv, packaging, mypy-protobuf, grpcio, tox, grpcio-tools
  Attempting uninstall: setuptools
    Found existing installation: setuptools 58.1.0
    Uninstalling setuptools-58.1.0:
      Successfully uninstalled setuptools-58.1.0

> Task :sdks:java:container:pullLicenses
Collecting beautifulsoup4<5.0,>=4.9.0
  Using cached beautifulsoup4-4.11.1-py3-none-any.whl (128 kB)
Collecting pyyaml<6.0.0,>=3.12
  Using cached PyYAML-5.4.1-cp38-cp38-manylinux1_x86_64.whl (662 kB)
Collecting tenacity<6.0,>=5.0.2
  Using cached tenacity-5.1.5-py2.py3-none-any.whl (34 kB)
Collecting soupsieve>1.2
  Using cached soupsieve-2.3.2.post1-py3-none-any.whl (37 kB)
Collecting six>=1.9.0
  Using cached six-1.16.0-py2.py3-none-any.whl (11 kB)
Installing collected packages: soupsieve, six, pyyaml, tenacity, beautifulsoup4
Successfully installed beautifulsoup4-4.11.1 pyyaml-5.4.1 six-1.16.0 soupsieve-2.3.2.post1 tenacity-5.1.5
Executing python <https://ci-beam.apache.org/job/beam_PostCommit_Python_VR_Flink/ws/src/sdks/java/container/license_scripts/pull_licenses_java.py> --license_index=<https://ci-beam.apache.org/job/beam_PostCommit_Python_VR_Flink/ws/src/sdks/java/container/build/reports/dependency-license/index.json>        --output_dir=<https://ci-beam.apache.org/job/beam_PostCommit_Python_VR_Flink/ws/src/sdks/java/container/build/target/java_third_party_licenses>        --dep_url_yaml=<https://ci-beam.apache.org/job/beam_PostCommit_Python_VR_Flink/ws/src/sdks/java/container/license_scripts/dep_urls_java.yaml>        --manual_license_path=<https://ci-beam.apache.org/job/beam_PostCommit_Python_VR_Flink/ws/src/sdks/java/container/license_scripts/manual_licenses>

> Task :sdks:java:extensions:sql:expansion-service:shadowJar FROM-CACHE

> Task :sdks:python:sdist
org/apache/beam/model/interactive/v1/beam_interactive_api.proto:36:1: warning: Import google/protobuf/timestamp.proto is unused.
Writing mypy to org/apache/beam/model/pipeline/v1/external_transforms_pb2.pyi
Writing mypy to org/apache/beam/model/pipeline/v1/beam_runner_api_pb2.pyi
Writing mypy to org/apache/beam/model/pipeline/v1/standard_window_fns_pb2.pyi
Writing mypy to org/apache/beam/model/pipeline/v1/metrics_pb2.pyi
Writing mypy to org/apache/beam/model/pipeline/v1/endpoints_pb2.pyi
Writing mypy to org/apache/beam/model/pipeline/v1/schema_pb2.pyi
Writing mypy to org/apache/beam/model/job_management/v1/beam_artifact_api_pb2.pyi
Writing mypy to org/apache/beam/model/job_management/v1/beam_expansion_api_pb2.pyi
Writing mypy to org/apache/beam/model/job_management/v1/beam_job_api_pb2.pyi
Writing mypy to org/apache/beam/model/fn_execution/v1/beam_provision_api_pb2.pyi
Writing mypy to org/apache/beam/model/fn_execution/v1/beam_fn_api_pb2.pyi
Writing mypy to org/apache/beam/model/interactive/v1/beam_interactive_api_pb2.pyi
<https://ci-beam.apache.org/job/beam_PostCommit_Python_VR_Flink/ws/src/build/gradleenv/1922375555/lib/python3.8/site-packages/setuptools/dist.py>:531: UserWarning: Normalizing '2.41.0.dev' to '2.41.0.dev0'
  warnings.warn(tmpl.format(**locals()))
warning: no files found matching 'README.md'
warning: no files found matching 'NOTICE'
warning: no files found matching 'LICENSE'
warning: no files found matching 'LICENSE.python'
warning: sdist: standard file not found: should have one of README, README.rst, README.txt, README.md


> Task :sdks:java:container:pullLicenses
INFO:root:Pulling license for 242 dependencies using 16 threads.
INFO:root:Replaced local file URL with file://<https://ci-beam.apache.org/job/beam_PostCommit_Python_VR_Flink/ws/src/sdks/java/container/license_scripts/manual_licenses/xz/COPYING> for xz-1.5
INFO:root:pull_licenses_java.py succeed. It took 9.319459 seconds with 16 threads.

> Task :sdks:java:container:goPrepare UP-TO-DATE
> Task :sdks:java:container:java8:copyJavaThirdPartyLicenses

> Task :sdks:java:container:goBuild
/home/jenkins/go/bin/go1.18.1 build -o ./build/target/linux_amd64/boot boot.go boot_test.go

> Task :sdks:java:container:java8:copySdkHarnessLauncher
Execution optimizations have been disabled for task ':sdks:java:container:java8:copySdkHarnessLauncher' to ensure correctness due to the following reasons:
  - Gradle detected a problem with the following location: '<https://ci-beam.apache.org/job/beam_PostCommit_Python_VR_Flink/ws/src/sdks/java/container/build/target'.> Reason: Task ':sdks:java:container:java8:copySdkHarnessLauncher' uses this output of task ':sdks:java:container:downloadCloudProfilerAgent' without declaring an explicit or implicit dependency. This can lead to incorrect results being produced, depending on what order the tasks are executed. Please refer to https://docs.gradle.org/7.4/userguide/validation_problems.html#implicit_dependency for more details about this problem.
  - Gradle detected a problem with the following location: '<https://ci-beam.apache.org/job/beam_PostCommit_Python_VR_Flink/ws/src/sdks/java/container/build/target'.> Reason: Task ':sdks:java:container:java8:copySdkHarnessLauncher' uses this output of task ':sdks:java:container:pullLicenses' without declaring an explicit or implicit dependency. This can lead to incorrect results being produced, depending on what order the tasks are executed. Please refer to https://docs.gradle.org/7.4/userguide/validation_problems.html#implicit_dependency for more details about this problem.

> Task :runners:flink:1.15:job-server:shadowJar FROM-CACHE

> Task :release:go-licenses:java:dockerRun
go: github.com/apache/beam/sdks/v2@v2.39.0 requires
	github.com/testcontainers/testcontainers-go@v0.12.0 requires
	github.com/Microsoft/hcsshim@v0.8.16 requires
	github.com/containerd/containerd@v1.5.0-beta.4 requires
	k8s.io/apiserver@v0.20.1 requires
	go.etcd.io/etcd@v0.5.0-alpha.5.0.20200910180754-dd1b699fc489 requires
	github.com/grpc-ecosystem/grpc-gateway@v1.9.5 requires
	golang.org/x/net@v0.0.0-20181220203305-927f97764cc3: verifying go.mod: golang.org/x/net@v0.0.0-20181220203305-927f97764cc3/go.mod: reading https://sum.golang.org/lookup/golang.org/x/net@v0.0.0-20181220203305-927f97764cc3: 500 Internal Server Error
	server response: unable to provide a signed tree head containing the record

> Task :release:go-licenses:java:dockerRun FAILED

FAILURE: Build failed with an exception.

* What went wrong:
Execution failed for task ':release:go-licenses:java:dockerRun'.
> Process 'command 'docker'' finished with non-zero exit value 1

* Try:
> Run with --stacktrace option to get the stack trace.
> Run with --info or --debug option to get more log output.
> Run with --scan to get full insights.

* Get more help at https://help.gradle.org

Deprecated Gradle features were used in this build, making it incompatible with Gradle 8.0.

You can use '--warning-mode all' to show the individual deprecation warnings and determine if they come from your own scripts or plugins.

See https://docs.gradle.org/7.4/userguide/command_line_interface.html#sec:command_line_warnings

Execution optimizations have been disabled for 1 invalid unit(s) of work during this build to ensure correctness.
Please consult deprecation warnings for more details.

BUILD FAILED in 1m 29s
145 actionable tasks: 96 executed, 45 from cache, 4 up-to-date

Publishing build scan...
https://gradle.com/s/46pxktuej7xe6

Build step 'Invoke Gradle script' changed build result to FAILURE
Build step 'Invoke Gradle script' marked build as failure

---------------------------------------------------------------------
To unsubscribe, e-mail: builds-unsubscribe@beam.apache.org
For additional commands, e-mail: builds-help@beam.apache.org


Jenkins build is back to normal : beam_PostCommit_Python_VR_Flink #2516

Posted by Apache Jenkins Server <je...@builds.apache.org>.
See <https://ci-beam.apache.org/job/beam_PostCommit_Python_VR_Flink/2516/display/redirect?page=changes>


---------------------------------------------------------------------
To unsubscribe, e-mail: builds-unsubscribe@beam.apache.org
For additional commands, e-mail: builds-help@beam.apache.org