You are viewing a plain text version of this content. The canonical link for it is here.
Posted to builds@cassandra.apache.org by Apache Jenkins Server <je...@builds.apache.org> on 2022/01/22 18:32:00 UTC
Build complete: Cassandra-3.11 #305 [UNSTABLE] 7e684482353b763d7f41b9cb15d311bf150174f8
-------------------------------------------------------------------------------
Build Cassandra-3.11 #305 Still unstable
URL: https://ci-cassandra.apache.org/job/Cassandra-3.11/305/
-------------------------------------------------------------------------------
Changes:
No changes
-------------------------------------------------------------------------------
Failed Tests:
41 tests failed.
FAILED: dtest-large-novnode.snitch_test.TestDynamicEndpointSnitch.test_multidatacenter_local_quorum
FAILED: dtest-large.snitch_test.TestDynamicEndpointSnitch.test_multidatacenter_local_quorum
FAILED: dtest-upgrade.upgrade_tests.thrift_upgrade_test.TestUpgradeSuperColumnsThrough.test_dense_supercolumn
FAILED: org.apache.cassandra.distributed.upgrade.CompactStorage2to3UpgradeTest.testDropCompactWithClusteringAndValueColumnWithDeletesAndWrites
FAILED: org.apache.cassandra.distributed.test.BootstrapTest.bootstrapTest
FAILED: org.apache.cassandra.distributed.test.BootstrapTest.bootstrapTest
FAILED: org.apache.cassandra.distributed.test.GossipTest.nodeDownDuringMove
FAILED: org.apache.cassandra.utils.SlidingTimeRateTest.testConcurrentUpdateAndGet-compression
FAILED: org.apache.cassandra.cql3.ViewFilteringTest.testPartitionKeyFilteringWithSlice
FAILED: org.apache.cassandra.utils.memory.LongBufferPoolTest.testAllocate
FAILED: org.apache.cassandra.utils.memory.LongBufferPoolTest.testAllocate
FAILED: cqlshlib.python2.jdk8.no_cython.test.test_cqlsh_output.TestCqlshOutput.test_boolean_output
FAILED: cqlshlib.python2.jdk8.no_cython.test.test_cqlsh_output.TestCqlshOutput.test_columnless_key_output
FAILED: cqlshlib.python2.jdk8.no_cython.test.test_cqlsh_output.TestCqlshOutput.test_count_output
FAILED: cqlshlib.python2.jdk8.no_cython.test.test_cqlsh_output.TestCqlshOutput.test_null_output
FAILED: cqlshlib.python2.jdk8.no_cython.test.test_cqlsh_output.TestCqlshOutput.test_numeric_output
FAILED: cqlshlib.python2.jdk8.no_cython.test.test_cqlsh_output.TestCqlshOutput.test_static_cf_output
FAILED: cqlshlib.python2.jdk8.no_cython.test.test_cqlsh_output.TestCqlshOutput.test_string_output_ascii
FAILED: cqlshlib.python2.jdk8.no_cython.test.test_cqlsh_output.TestCqlshOutput.test_boolean_output
FAILED: cqlshlib.python2.jdk8.no_cython.test.test_cqlsh_output.TestCqlshOutput.test_columnless_key_output
FAILED: cqlshlib.python2.jdk8.no_cython.test.test_cqlsh_output.TestCqlshOutput.test_count_output
FAILED: cqlshlib.python2.jdk8.no_cython.test.test_cqlsh_output.TestCqlshOutput.test_null_output
FAILED: cqlshlib.python2.jdk8.no_cython.test.test_cqlsh_output.TestCqlshOutput.test_numeric_output
FAILED: cqlshlib.python2.jdk8.no_cython.test.test_cqlsh_output.TestCqlshOutput.test_static_cf_output
FAILED: cqlshlib.python2.jdk8.no_cython.test.test_cqlsh_output.TestCqlshOutput.test_string_output_ascii
FAILED: dtest-offheap.counter_test.TestCounters.test_13691
FAILED: dtest-offheap.counter_test.TestCounters.test_13691
FAILED: dtest-upgrade.upgrade_tests.upgrade_through_versions_test.TestUpgrade_indev_2_2_x_To_indev_3_11_x.test_rolling_upgrade
FAILED: dtest-upgrade.upgrade_tests.upgrade_through_versions_test.TestUpgrade_current_2_2_x_To_indev_3_11_x.test_rolling_upgrade_with_internode_ssl
FAILED: dtest-upgrade.upgrade_tests.upgrade_through_versions_test.TestUpgrade_indev_2_2_x_To_indev_3_11_x.test_rolling_upgrade_with_internode_ssl
FAILED: dtest-upgrade.upgrade_internal_auth_test.TestAuthUpgrade.test_upgrade_legacy_table
FAILED: dtest-upgrade.upgrade_tests.upgrade_through_versions_test.TestProtoV3Upgrade_AllVersions_EndsAt_3_11_X.test_rolling_upgrade
FAILED: dtest-upgrade.upgrade_tests.upgrade_through_versions_test.TestProtoV3Upgrade_AllVersions_EndsAt_3_11_X.test_rolling_upgrade_with_internode_ssl
FAILED: dtest-upgrade.upgrade_tests.upgrade_through_versions_test.TestProtoV3Upgrade_AllVersions_RandomPartitioner_EndsAt_3_11_X_HEAD.test_rolling_upgrade
FAILED: dtest-upgrade.upgrade_tests.upgrade_through_versions_test.TestProtoV3Upgrade_AllVersions_RandomPartitioner_EndsAt_3_11_X_HEAD.test_rolling_upgrade_with_internode_ssl
FAILED: dtest-upgrade.upgrade_tests.upgrade_through_versions_test.TestUpgrade_current_2_1_x_To_indev_3_11_x.test_rolling_upgrade
FAILED: dtest-upgrade.upgrade_tests.upgrade_through_versions_test.TestUpgrade_current_2_1_x_To_indev_3_11_x.test_rolling_upgrade
FAILED: dtest-upgrade.upgrade_tests.upgrade_through_versions_test.TestUpgrade_current_3_0_x_To_indev_3_11_x.test_rolling_upgrade
FAILED: dtest-upgrade.upgrade_tests.upgrade_through_versions_test.TestUpgrade_current_2_1_x_To_indev_3_11_x.test_rolling_upgrade_with_internode_ssl
FAILED: dtest-upgrade.upgrade_tests.upgrade_through_versions_test.TestUpgrade_current_2_2_x_To_indev_3_11_x.test_rolling_upgrade
FAILED: dtest-upgrade.upgrade_tests.upgrade_through_versions_test.TestUpgrade_current_3_0_x_To_indev_3_11_x.test_rolling_upgrade_with_internode_ssl
-------------------------------------------------------------------------------
For complete test report and logs see https://nightlies.apache.org/cassandra/Cassandra-3.11/305/