You are viewing a plain text version of this content. The canonical link for it is here.
Posted to commits@sling.apache.org by Apache Jenkins Server <je...@builds.apache.org> on 2017/04/10 17:20:08 UTC
Build failed in Jenkins:
sling-bundles-extensions-healthcheck-it-1.8 #3
See <https://builds.apache.org/job/sling-bundles-extensions-healthcheck-it-1.8/3/display/redirect?page=changes>
Changes:
[justin] SLING-6773 - separate HC API from Core
------------------------------------------
Started by an SCM change
[EnvInject] - Loading node environment variables.
Building remotely on ubuntu-4 (ubuntu trusty) in workspace <https://builds.apache.org/job/sling-bundles-extensions-healthcheck-it-1.8/ws/>
Checking out a fresh workspace because there's no workspace at <https://builds.apache.org/job/sling-bundles-extensions-healthcheck-it-1.8/ws/>
Cleaning local Directory .
Checking out https://svn.apache.org/repos/asf/sling/trunk/bundles/extensions/healthcheck/it at revision '2017-04-10T17:19:14.934 +0000'
A src
A src/test
A src/test/java
A src/test/java/org
A src/test/java/org/apache
A src/test/java/org/apache/sling
A src/test/java/org/apache/sling/hc
A src/test/java/org/apache/sling/hc/it
A src/test/java/org/apache/sling/hc/it/core
A src/test/java/org/apache/sling/hc/it/core/U.java
A src/test/java/org/apache/sling/hc/it/core/SampleHealthChecksTest.java
A pom.xml
U .
At revision 1790879
Parsing POMs
Modules changed, recalculating dependency graph
Established TCP socket on 38069
maven33-agent.jar already up to date
maven33-interceptor.jar already up to date
maven3-interceptor-commons.jar already up to date
[sling-bundles-extensions-healthcheck-it-1.8] $ /home/jenkins/tools/java/latest1.8/bin/java -Xmx2g -Xms256m -cp /home/jenkins/jenkins-slave/maven33-agent.jar:/home/jenkins/tools/maven/apache-maven-3.3.9/boot/plexus-classworlds-2.5.2.jar:/home/jenkins/tools/maven/apache-maven-3.3.9/conf/logging jenkins.maven3.agent.Maven33Main /home/jenkins/tools/maven/apache-maven-3.3.9 /home/jenkins/jenkins-slave/slave.jar /home/jenkins/jenkins-slave/maven33-interceptor.jar /home/jenkins/jenkins-slave/maven3-interceptor-commons.jar 38069
<===[JENKINS REMOTING CAPACITY]===> channel started
Executing Maven: -B -f <https://builds.apache.org/job/sling-bundles-extensions-healthcheck-it-1.8/ws/pom.xml> -Dmaven.repo.local=/home/jenkins/jenkins-slave/maven-repositories/1 -U clean verify
[INFO] Scanning for projects...
[INFO]
[INFO] ------------------------------------------------------------------------
[INFO] Building Apache Sling Health Check Integration Tests 1.1.1-SNAPSHOT
[INFO] ------------------------------------------------------------------------
[INFO] Downloading: http://repository.apache.org/snapshots/org/apache/sling/org.apache.sling.hc.api/0.0.99-SNAPSHOT/maven-metadata.xml
[INFO] Downloading: http://repository.apache.org/snapshots/org/apache/sling/org.apache.sling.hc.api/0.0.99-SNAPSHOT/org.apache.sling.hc.api-0.0.99-SNAPSHOT.pom
[WARNING] The POM for org.apache.sling:org.apache.sling.hc.api:jar:0.0.99-SNAPSHOT is missing, no dependency information available
[INFO] Downloading: http://repository.apache.org/snapshots/org/apache/sling/org.apache.sling.hc.api/0.0.99-SNAPSHOT/org.apache.sling.hc.api-0.0.99-SNAPSHOT.jar
[JENKINS] Archiving disabled
[INFO] ------------------------------------------------------------------------
[INFO] BUILD FAILURE
[INFO] ------------------------------------------------------------------------
[INFO] Total time: 4.703 s
[INFO] Finished at: 2017-04-10T17:20:07+00:00
[JENKINS] Archiving disabled
[INFO] Final Memory: 14M/279M
[INFO] ------------------------------------------------------------------------
[ERROR] Failed to execute goal on project org.apache.sling.hc.it: Could not resolve dependencies for project org.apache.sling:org.apache.sling.hc.it:jar:1.1.1-SNAPSHOT: Could not find artifact org.apache.sling:org.apache.sling.hc.api:jar:0.0.99-SNAPSHOT in Nexus (http://repository.apache.org/snapshots) -> [Help 1]
[ERROR]
[ERROR] To see the full stack trace of the errors, re-run Maven with the -e switch.
[ERROR] Re-run Maven using the -X switch to enable full debug logging.
[ERROR]
[ERROR] For more information about the errors and possible solutions, please read the following articles:
[ERROR] [Help 1] http://cwiki.apache.org/confluence/display/MAVEN/DependencyResolutionException
channel stopped
Recording test results
Jenkins build is back to normal :
sling-bundles-extensions-healthcheck-it-1.8 #5
Posted by Apache Jenkins Server <je...@builds.apache.org>.
See <https://builds.apache.org/job/sling-bundles-extensions-healthcheck-it-1.8/5/display/redirect>
Build failed in Jenkins:
sling-bundles-extensions-healthcheck-it-1.8 #4
Posted by Apache Jenkins Server <je...@builds.apache.org>.
See <https://builds.apache.org/job/sling-bundles-extensions-healthcheck-it-1.8/4/display/redirect>
------------------------------------------
Started by upstream project "sling-bundles-extensions-healthcheck-api-1.8" build number 2
originally caused by:
Started by an SCM change
[EnvInject] - Loading node environment variables.
Building remotely on ubuntu-us1 (ubuntu trusty) in workspace <https://builds.apache.org/job/sling-bundles-extensions-healthcheck-it-1.8/ws/>
Checking out a fresh workspace because there's no workspace at <https://builds.apache.org/job/sling-bundles-extensions-healthcheck-it-1.8/ws/>
Cleaning local Directory .
Checking out https://svn.apache.org/repos/asf/sling/trunk/bundles/extensions/healthcheck/it at revision '2017-04-27T14:21:01.646 +0000'
A src
A src/test
A src/test/java
A src/test/java/org
A src/test/java/org/apache
A src/test/java/org/apache/sling
A src/test/java/org/apache/sling/hc
A src/test/java/org/apache/sling/hc/it
A src/test/java/org/apache/sling/hc/it/core
A src/test/java/org/apache/sling/hc/it/core/U.java
A src/test/java/org/apache/sling/hc/it/core/SampleHealthChecksTest.java
A pom.xml
U .
At revision 1792902
No changes for https://svn.apache.org/repos/asf/sling/trunk/bundles/extensions/healthcheck/it since the previous build
Parsing POMs
Established TCP socket on 32975
maven33-agent.jar already up to date
maven33-interceptor.jar already up to date
maven3-interceptor-commons.jar already up to date
[sling-bundles-extensions-healthcheck-it-1.8] $ /home/jenkins/tools/java/latest1.8/bin/java -Xmx2g -Xms256m -cp /home/jenkins/jenkins-slave/maven33-agent.jar:/home/jenkins/tools/maven/apache-maven-3.3.9/boot/plexus-classworlds-2.5.2.jar:/home/jenkins/tools/maven/apache-maven-3.3.9/conf/logging jenkins.maven3.agent.Maven33Main /home/jenkins/tools/maven/apache-maven-3.3.9 /home/jenkins/jenkins-slave/slave.jar /home/jenkins/jenkins-slave/maven33-interceptor.jar /home/jenkins/jenkins-slave/maven3-interceptor-commons.jar 32975
<===[JENKINS REMOTING CAPACITY]===> channel started
Executing Maven: -B -f <https://builds.apache.org/job/sling-bundles-extensions-healthcheck-it-1.8/ws/pom.xml> -Dmaven.repo.local=/home/jenkins/jenkins-slave/maven-repositories/1 -U clean verify
[INFO] Scanning for projects...
[INFO]
[INFO] ------------------------------------------------------------------------
[INFO] Building Apache Sling Health Check Integration Tests 1.1.1-SNAPSHOT
[INFO] ------------------------------------------------------------------------
[INFO] Downloading: http://repository.apache.org/snapshots/org/apache/sling/org.apache.sling.hc.api/0.0.99-SNAPSHOT/maven-metadata.xml
[INFO] Downloading: http://repository.apache.org/snapshots/org/apache/sling/org.apache.sling.hc.api/0.0.99-SNAPSHOT/org.apache.sling.hc.api-0.0.99-SNAPSHOT.pom
[WARNING] The POM for org.apache.sling:org.apache.sling.hc.api:jar:0.0.99-SNAPSHOT is missing, no dependency information available
[INFO] Downloading: http://repository.apache.org/snapshots/org/apache/sling/org.apache.sling.hc.api/0.0.99-SNAPSHOT/org.apache.sling.hc.api-0.0.99-SNAPSHOT.jar
[JENKINS] Archiving disabled
[JENKINS] Archiving disabled
[INFO] ------------------------------------------------------------------------
[INFO] BUILD FAILURE
[INFO] ------------------------------------------------------------------------
[INFO] Total time: 7.515 s
[INFO] Finished at: 2017-04-27T14:21:28+00:00
[INFO] Final Memory: 14M/277M
[INFO] ------------------------------------------------------------------------
[ERROR] Failed to execute goal on project org.apache.sling.hc.it: Could not resolve dependencies for project org.apache.sling:org.apache.sling.hc.it:jar:1.1.1-SNAPSHOT: Could not find artifact org.apache.sling:org.apache.sling.hc.api:jar:0.0.99-SNAPSHOT in Nexus (http://repository.apache.org/snapshots) -> [Help 1]
[ERROR]
[ERROR] To see the full stack trace of the errors, re-run Maven with the -e switch.
[ERROR] Re-run Maven using the -X switch to enable full debug logging.
[ERROR]
[ERROR] For more information about the errors and possible solutions, please read the following articles:
[ERROR] [Help 1] http://cwiki.apache.org/confluence/display/MAVEN/DependencyResolutionException
channel stopped
Recording test results