You are viewing a plain text version of this content. The canonical link for it is here.
Posted to builds@solr.apache.org by Apache Jenkins Server <je...@builds.apache.org> on 2024/01/09 23:41:21 UTC

[JENKINS] Lucene » Lucene-Solr-Tests-8.11 - Build # 452 - Unstable!

Build: https://ci-builds.apache.org/job/Lucene/job/Lucene-Solr-Tests-8.11/452/

3 tests failed.
FAILED:  org.apache.solr.cloud.api.collections.ShardSplitTest.testSplitMixedReplicaTypes

Error Message:
Timeout occurred while waiting response from server at: http://127.0.0.1:45049

Stack Trace:
org.apache.solr.client.solrj.SolrServerException: Timeout occurred while waiting response from server at: http://127.0.0.1:45049
	at __randomizedtesting.SeedInfo.seed([635D9E93FFB1D67F:DB9ECA33036A030A]:0)
	at org.apache.solr.client.solrj.impl.HttpSolrClient.executeMethod(HttpSolrClient.java:692)
	at org.apache.solr.client.solrj.impl.HttpSolrClient.request(HttpSolrClient.java:266)
	at org.apache.solr.client.solrj.impl.HttpSolrClient.request(HttpSolrClient.java:248)
	at org.apache.solr.client.solrj.impl.LBSolrClient.doRequest(LBSolrClient.java:369)
	at org.apache.solr.client.solrj.impl.LBSolrClient.request(LBSolrClient.java:297)
	at org.apache.solr.client.solrj.impl.BaseCloudSolrClient.sendRequest(BaseCloudSolrClient.java:1188)
	at org.apache.solr.client.solrj.impl.BaseCloudSolrClient.requestWithRetryOnStaleState(BaseCloudSolrClient.java:934)
	at org.apache.solr.client.solrj.impl.BaseCloudSolrClient.request(BaseCloudSolrClient.java:866)
	at org.apache.solr.client.solrj.SolrRequest.process(SolrRequest.java:225)
	at org.apache.solr.client.solrj.SolrRequest.process(SolrRequest.java:242)
	at org.apache.solr.cloud.api.collections.ShardSplitTest.doSplitMixedReplicaTypes(ShardSplitTest.java:365)
	at org.apache.solr.cloud.api.collections.ShardSplitTest.testSplitMixedReplicaTypes(ShardSplitTest.java:350)
	at sun.reflect.NativeMethodAccessorImpl.invoke0(Native Method)
	at sun.reflect.NativeMethodAccessorImpl.invoke(NativeMethodAccessorImpl.java:62)
	at sun.reflect.DelegatingMethodAccessorImpl.invoke(DelegatingMethodAccessorImpl.java:43)
	at java.lang.reflect.Method.invoke(Method.java:498)
	at com.carrotsearch.randomizedtesting.RandomizedRunner.invoke(RandomizedRunner.java:1758)
	at com.carrotsearch.randomizedtesting.RandomizedRunner$8.evaluate(RandomizedRunner.java:946)
	at com.carrotsearch.randomizedtesting.RandomizedRunner$9.evaluate(RandomizedRunner.java:982)
	at com.carrotsearch.randomizedtesting.RandomizedRunner$10.evaluate(RandomizedRunner.java:996)
	at org.apache.solr.BaseDistributedSearchTestCase$ShardsRepeatRule$ShardsFixedStatement.callStatement(BaseDistributedSearchTestCase.java:1084)
	at org.apache.solr.BaseDistributedSearchTestCase$ShardsRepeatRule$ShardsStatement.evaluate(BaseDistributedSearchTestCase.java:1055)
	at com.carrotsearch.randomizedtesting.rules.SystemPropertiesRestoreRule$1.evaluate(SystemPropertiesRestoreRule.java:80)
	at org.junit.rules.RunRules.evaluate(RunRules.java:20)
	at org.apache.lucene.util.TestRuleSetupTeardownChained$1.evaluate(TestRuleSetupTeardownChained.java:49)
	at org.apache.lucene.util.AbstractBeforeAfterRule$1.evaluate(AbstractBeforeAfterRule.java:45)
	at org.apache.lucene.util.TestRuleThreadAndTestName$1.evaluate(TestRuleThreadAndTestName.java:48)
	at org.apache.lucene.util.TestRuleIgnoreAfterMaxFailures$1.evaluate(TestRuleIgnoreAfterMaxFailures.java:64)
	at org.apache.lucene.util.TestRuleMarkFailure$1.evaluate(TestRuleMarkFailure.java:47)
	at org.junit.rules.RunRules.evaluate(RunRules.java:20)
	at com.carrotsearch.randomizedtesting.rules.StatementAdapter.evaluate(StatementAdapter.java:36)
	at com.carrotsearch.randomizedtesting.ThreadLeakControl$StatementRunner.run(ThreadLeakControl.java:390)
	at com.carrotsearch.randomizedtesting.ThreadLeakControl.forkTimeoutingTask(ThreadLeakControl.java:843)
	at com.carrotsearch.randomizedtesting.ThreadLeakControl$3.evaluate(ThreadLeakControl.java:490)
	at com.carrotsearch.randomizedtesting.RandomizedRunner.runSingleTest(RandomizedRunner.java:955)
	at com.carrotsearch.randomizedtesting.RandomizedRunner$5.evaluate(RandomizedRunner.java:840)
	at com.carrotsearch.randomizedtesting.RandomizedRunner$6.evaluate(RandomizedRunner.java:891)
	at com.carrotsearch.randomizedtesting.RandomizedRunner$7.evaluate(RandomizedRunner.java:902)
	at com.carrotsearch.randomizedtesting.rules.StatementAdapter.evaluate(StatementAdapter.java:36)
	at com.carrotsearch.randomizedtesting.rules.SystemPropertiesRestoreRule$1.evaluate(SystemPropertiesRestoreRule.java:80)
	at org.junit.rules.RunRules.evaluate(RunRules.java:20)
	at org.apache.lucene.util.AbstractBeforeAfterRule$1.evaluate(AbstractBeforeAfterRule.java:45)
	at com.carrotsearch.randomizedtesting.rules.StatementAdapter.evaluate(StatementAdapter.java:36)
	at org.apache.lucene.util.TestRuleStoreClassName$1.evaluate(TestRuleStoreClassName.java:41)
	at com.carrotsearch.randomizedtesting.rules.NoShadowingOrOverridesOnMethodsRule$1.evaluate(NoShadowingOrOverridesOnMethodsRule.java:40)
	at com.carrotsearch.randomizedtesting.rules.NoShadowingOrOverridesOnMethodsRule$1.evaluate(NoShadowingOrOverridesOnMethodsRule.java:40)
	at com.carrotsearch.randomizedtesting.rules.StatementAdapter.evaluate(StatementAdapter.java:36)
	at com.carrotsearch.randomizedtesting.rules.StatementAdapter.evaluate(StatementAdapter.java:36)
	at com.carrotsearch.randomizedtesting.rules.StatementAdapter.evaluate(StatementAdapter.java:36)
	at org.apache.lucene.util.TestRuleAssertionsRequired$1.evaluate(TestRuleAssertionsRequired.java:53)
	at org.apache.lucene.util.TestRuleMarkFailure$1.evaluate(TestRuleMarkFailure.java:47)
	at org.apache.lucene.util.TestRuleIgnoreAfterMaxFailures$1.evaluate(TestRuleIgnoreAfterMaxFailures.java:64)
	at org.apache.lucene.util.TestRuleIgnoreTestSuites$1.evaluate(TestRuleIgnoreTestSuites.java:54)
	at org.junit.rules.RunRules.evaluate(RunRules.java:20)
	at com.carrotsearch.randomizedtesting.rules.StatementAdapter.evaluate(StatementAdapter.java:36)
	at com.carrotsearch.randomizedtesting.ThreadLeakControl$StatementRunner.run(ThreadLeakControl.java:390)
	at com.carrotsearch.randomizedtesting.ThreadLeakControl.lambda$forkTimeoutingTask$0(ThreadLeakControl.java:850)
	at java.lang.Thread.run(Thread.java:750)
Caused by: java.net.SocketTimeoutException: Read timed out
	at java.net.SocketInputStream.socketRead0(Native Method)
	at java.net.SocketInputStream.socketRead(SocketInputStream.java:116)
	at java.net.SocketInputStream.read(SocketInputStream.java:171)
	at java.net.SocketInputStream.read(SocketInputStream.java:141)
	at org.apache.http.impl.io.SessionInputBufferImpl.streamRead(SessionInputBufferImpl.java:137)
	at org.apache.http.impl.io.SessionInputBufferImpl.fillBuffer(SessionInputBufferImpl.java:153)
	at org.apache.http.impl.io.SessionInputBufferImpl.readLine(SessionInputBufferImpl.java:280)
	at org.apache.http.impl.conn.DefaultHttpResponseParser.parseHead(DefaultHttpResponseParser.java:138)
	at org.apache.http.impl.conn.DefaultHttpResponseParser.parseHead(DefaultHttpResponseParser.java:56)
	at org.apache.http.impl.io.AbstractMessageParser.parse(AbstractMessageParser.java:259)
	at org.apache.http.impl.DefaultBHttpClientConnection.receiveResponseHeader(DefaultBHttpClientConnection.java:163)
	at org.apache.http.impl.conn.CPoolProxy.receiveResponseHeader(CPoolProxy.java:157)
	at org.apache.http.protocol.HttpRequestExecutor.doReceiveResponse(HttpRequestExecutor.java:273)
	at org.apache.http.protocol.HttpRequestExecutor.execute(HttpRequestExecutor.java:125)
	at org.apache.http.impl.execchain.MainClientExec.execute(MainClientExec.java:272)
	at org.apache.http.impl.execchain.ProtocolExec.execute(ProtocolExec.java:186)
	at org.apache.http.impl.execchain.RetryExec.execute(RetryExec.java:89)
	at org.apache.http.impl.execchain.RedirectExec.execute(RedirectExec.java:110)
	at org.apache.http.impl.client.InternalHttpClient.doExecute(InternalHttpClient.java:185)
	at org.apache.http.impl.client.CloseableHttpClient.execute(CloseableHttpClient.java:83)
	at org.apache.http.impl.client.CloseableHttpClient.execute(CloseableHttpClient.java:56)
	at org.apache.solr.client.solrj.impl.HttpSolrClient.executeMethod(HttpSolrClient.java:571)
	... 57 more


FAILED:  org.apache.solr.cloud.api.collections.ShardSplitTest.testSplitMixedReplicaTypesLink

Error Message:
Timeout occurred while waiting response from server at: http://127.0.0.1:36613

Stack Trace:
org.apache.solr.client.solrj.SolrServerException: Timeout occurred while waiting response from server at: http://127.0.0.1:36613
	at __randomizedtesting.SeedInfo.seed([635D9E93FFB1D67F:5F3357CA5A697DE6]:0)
	at org.apache.solr.client.solrj.impl.HttpSolrClient.executeMethod(HttpSolrClient.java:692)
	at org.apache.solr.client.solrj.impl.HttpSolrClient.request(HttpSolrClient.java:266)
	at org.apache.solr.client.solrj.impl.HttpSolrClient.request(HttpSolrClient.java:248)
	at org.apache.solr.client.solrj.impl.LBSolrClient.doRequest(LBSolrClient.java:369)
	at org.apache.solr.client.solrj.impl.LBSolrClient.request(LBSolrClient.java:297)
	at org.apache.solr.client.solrj.impl.BaseCloudSolrClient.sendRequest(BaseCloudSolrClient.java:1188)
	at org.apache.solr.client.solrj.impl.BaseCloudSolrClient.requestWithRetryOnStaleState(BaseCloudSolrClient.java:934)
	at org.apache.solr.client.solrj.impl.BaseCloudSolrClient.request(BaseCloudSolrClient.java:866)
	at org.apache.solr.client.solrj.SolrRequest.process(SolrRequest.java:225)
	at org.apache.solr.client.solrj.SolrRequest.process(SolrRequest.java:242)
	at org.apache.solr.cloud.api.collections.ShardSplitTest.doSplitMixedReplicaTypes(ShardSplitTest.java:365)
	at org.apache.solr.cloud.api.collections.ShardSplitTest.testSplitMixedReplicaTypesLink(ShardSplitTest.java:356)
	at sun.reflect.NativeMethodAccessorImpl.invoke0(Native Method)
	at sun.reflect.NativeMethodAccessorImpl.invoke(NativeMethodAccessorImpl.java:62)
	at sun.reflect.DelegatingMethodAccessorImpl.invoke(DelegatingMethodAccessorImpl.java:43)
	at java.lang.reflect.Method.invoke(Method.java:498)
	at com.carrotsearch.randomizedtesting.RandomizedRunner.invoke(RandomizedRunner.java:1758)
	at com.carrotsearch.randomizedtesting.RandomizedRunner$8.evaluate(RandomizedRunner.java:946)
	at com.carrotsearch.randomizedtesting.RandomizedRunner$9.evaluate(RandomizedRunner.java:982)
	at com.carrotsearch.randomizedtesting.RandomizedRunner$10.evaluate(RandomizedRunner.java:996)
	at org.apache.solr.BaseDistributedSearchTestCase$ShardsRepeatRule$ShardsFixedStatement.callStatement(BaseDistributedSearchTestCase.java:1084)
	at org.apache.solr.BaseDistributedSearchTestCase$ShardsRepeatRule$ShardsStatement.evaluate(BaseDistributedSearchTestCase.java:1055)
	at com.carrotsearch.randomizedtesting.rules.SystemPropertiesRestoreRule$1.evaluate(SystemPropertiesRestoreRule.java:80)
	at org.junit.rules.RunRules.evaluate(RunRules.java:20)
	at org.apache.lucene.util.TestRuleSetupTeardownChained$1.evaluate(TestRuleSetupTeardownChained.java:49)
	at org.apache.lucene.util.AbstractBeforeAfterRule$1.evaluate(AbstractBeforeAfterRule.java:45)
	at org.apache.lucene.util.TestRuleThreadAndTestName$1.evaluate(TestRuleThreadAndTestName.java:48)
	at org.apache.lucene.util.TestRuleIgnoreAfterMaxFailures$1.evaluate(TestRuleIgnoreAfterMaxFailures.java:64)
	at org.apache.lucene.util.TestRuleMarkFailure$1.evaluate(TestRuleMarkFailure.java:47)
	at org.junit.rules.RunRules.evaluate(RunRules.java:20)
	at com.carrotsearch.randomizedtesting.rules.StatementAdapter.evaluate(StatementAdapter.java:36)
	at com.carrotsearch.randomizedtesting.ThreadLeakControl$StatementRunner.run(ThreadLeakControl.java:390)
	at com.carrotsearch.randomizedtesting.ThreadLeakControl.forkTimeoutingTask(ThreadLeakControl.java:843)
	at com.carrotsearch.randomizedtesting.ThreadLeakControl$3.evaluate(ThreadLeakControl.java:490)
	at com.carrotsearch.randomizedtesting.RandomizedRunner.runSingleTest(RandomizedRunner.java:955)
	at com.carrotsearch.randomizedtesting.RandomizedRunner$5.evaluate(RandomizedRunner.java:840)
	at com.carrotsearch.randomizedtesting.RandomizedRunner$6.evaluate(RandomizedRunner.java:891)
	at com.carrotsearch.randomizedtesting.RandomizedRunner$7.evaluate(RandomizedRunner.java:902)
	at com.carrotsearch.randomizedtesting.rules.StatementAdapter.evaluate(StatementAdapter.java:36)
	at com.carrotsearch.randomizedtesting.rules.SystemPropertiesRestoreRule$1.evaluate(SystemPropertiesRestoreRule.java:80)
	at org.junit.rules.RunRules.evaluate(RunRules.java:20)
	at org.apache.lucene.util.AbstractBeforeAfterRule$1.evaluate(AbstractBeforeAfterRule.java:45)
	at com.carrotsearch.randomizedtesting.rules.StatementAdapter.evaluate(StatementAdapter.java:36)
	at org.apache.lucene.util.TestRuleStoreClassName$1.evaluate(TestRuleStoreClassName.java:41)
	at com.carrotsearch.randomizedtesting.rules.NoShadowingOrOverridesOnMethodsRule$1.evaluate(NoShadowingOrOverridesOnMethodsRule.java:40)
	at com.carrotsearch.randomizedtesting.rules.NoShadowingOrOverridesOnMethodsRule$1.evaluate(NoShadowingOrOverridesOnMethodsRule.java:40)
	at com.carrotsearch.randomizedtesting.rules.StatementAdapter.evaluate(StatementAdapter.java:36)
	at com.carrotsearch.randomizedtesting.rules.StatementAdapter.evaluate(StatementAdapter.java:36)
	at com.carrotsearch.randomizedtesting.rules.StatementAdapter.evaluate(StatementAdapter.java:36)
	at org.apache.lucene.util.TestRuleAssertionsRequired$1.evaluate(TestRuleAssertionsRequired.java:53)
	at org.apache.lucene.util.TestRuleMarkFailure$1.evaluate(TestRuleMarkFailure.java:47)
	at org.apache.lucene.util.TestRuleIgnoreAfterMaxFailures$1.evaluate(TestRuleIgnoreAfterMaxFailures.java:64)
	at org.apache.lucene.util.TestRuleIgnoreTestSuites$1.evaluate(TestRuleIgnoreTestSuites.java:54)
	at org.junit.rules.RunRules.evaluate(RunRules.java:20)
	at com.carrotsearch.randomizedtesting.rules.StatementAdapter.evaluate(StatementAdapter.java:36)
	at com.carrotsearch.randomizedtesting.ThreadLeakControl$StatementRunner.run(ThreadLeakControl.java:390)
	at com.carrotsearch.randomizedtesting.ThreadLeakControl.lambda$forkTimeoutingTask$0(ThreadLeakControl.java:850)
	at java.lang.Thread.run(Thread.java:750)
Caused by: java.net.SocketTimeoutException: Read timed out
	at java.net.SocketInputStream.socketRead0(Native Method)
	at java.net.SocketInputStream.socketRead(SocketInputStream.java:116)
	at java.net.SocketInputStream.read(SocketInputStream.java:171)
	at java.net.SocketInputStream.read(SocketInputStream.java:141)
	at org.apache.http.impl.io.SessionInputBufferImpl.streamRead(SessionInputBufferImpl.java:137)
	at org.apache.http.impl.io.SessionInputBufferImpl.fillBuffer(SessionInputBufferImpl.java:153)
	at org.apache.http.impl.io.SessionInputBufferImpl.readLine(SessionInputBufferImpl.java:280)
	at org.apache.http.impl.conn.DefaultHttpResponseParser.parseHead(DefaultHttpResponseParser.java:138)
	at org.apache.http.impl.conn.DefaultHttpResponseParser.parseHead(DefaultHttpResponseParser.java:56)
	at org.apache.http.impl.io.AbstractMessageParser.parse(AbstractMessageParser.java:259)
	at org.apache.http.impl.DefaultBHttpClientConnection.receiveResponseHeader(DefaultBHttpClientConnection.java:163)
	at org.apache.http.impl.conn.CPoolProxy.receiveResponseHeader(CPoolProxy.java:157)
	at org.apache.http.protocol.HttpRequestExecutor.doReceiveResponse(HttpRequestExecutor.java:273)
	at org.apache.http.protocol.HttpRequestExecutor.execute(HttpRequestExecutor.java:125)
	at org.apache.http.impl.execchain.MainClientExec.execute(MainClientExec.java:272)
	at org.apache.http.impl.execchain.ProtocolExec.execute(ProtocolExec.java:186)
	at org.apache.http.impl.execchain.RetryExec.execute(RetryExec.java:89)
	at org.apache.http.impl.execchain.RedirectExec.execute(RedirectExec.java:110)
	at org.apache.http.impl.client.InternalHttpClient.doExecute(InternalHttpClient.java:185)
	at org.apache.http.impl.client.CloseableHttpClient.execute(CloseableHttpClient.java:83)
	at org.apache.http.impl.client.CloseableHttpClient.execute(CloseableHttpClient.java:56)
	at org.apache.solr.client.solrj.impl.HttpSolrClient.executeMethod(HttpSolrClient.java:571)
	... 57 more


FAILED:  junit.framework.TestSuite.org.apache.solr.search.TestRecoveryHdfs

Error Message:
1 thread leaked from SUITE scope at org.apache.solr.search.TestRecoveryHdfs:     1) Thread[id=39031, name=Command processor, state=WAITING, group=TGRP-TestRecoveryHdfs]         at sun.misc.Unsafe.park(Native Method)         at java.util.concurrent.locks.LockSupport.park(LockSupport.java:175)         at java.util.concurrent.locks.AbstractQueuedSynchronizer$ConditionObject.await(AbstractQueuedSynchronizer.java:2039)         at java.util.concurrent.LinkedBlockingQueue.take(LinkedBlockingQueue.java:442)         at org.apache.hadoop.hdfs.server.datanode.BPServiceActor$CommandProcessingThread.processQueue(BPServiceActor.java:1291)         at org.apache.hadoop.hdfs.server.datanode.BPServiceActor$CommandProcessingThread.run(BPServiceActor.java:1275)

Stack Trace:
com.carrotsearch.randomizedtesting.ThreadLeakError: 1 thread leaked from SUITE scope at org.apache.solr.search.TestRecoveryHdfs: 
   1) Thread[id=39031, name=Command processor, state=WAITING, group=TGRP-TestRecoveryHdfs]
        at sun.misc.Unsafe.park(Native Method)
        at java.util.concurrent.locks.LockSupport.park(LockSupport.java:175)
        at java.util.concurrent.locks.AbstractQueuedSynchronizer$ConditionObject.await(AbstractQueuedSynchronizer.java:2039)
        at java.util.concurrent.LinkedBlockingQueue.take(LinkedBlockingQueue.java:442)
        at org.apache.hadoop.hdfs.server.datanode.BPServiceActor$CommandProcessingThread.processQueue(BPServiceActor.java:1291)
        at org.apache.hadoop.hdfs.server.datanode.BPServiceActor$CommandProcessingThread.run(BPServiceActor.java:1275)
	at __randomizedtesting.SeedInfo.seed([635D9E93FFB1D67F]:0)




Build Log:
[...truncated 15802 lines...]
   [junit4] Suite: org.apache.solr.cloud.api.collections.ShardSplitTest
   [junit4]   2> 1621071 INFO  (SUITE-ShardSplitTest-seed#[635D9E93FFB1D67F]-worker) [     ] o.a.s.SolrTestCase Setting 'solr.default.confdir' system property to test-framework derived value of '/home/jenkins/jenkins-slave/workspace/Lucene/Lucene-Solr-Tests-8.11/solr/server/solr/configsets/_default/conf'
   [junit4]   2> 1621071 INFO  (SUITE-ShardSplitTest-seed#[635D9E93FFB1D67F]-worker) [     ] o.a.s.SolrTestCaseJ4 SecureRandom sanity checks: test.solr.allowed.securerandom=null & java.security.egd=file:/dev/./urandom
   [junit4]   2> 1621072 INFO  (SUITE-ShardSplitTest-seed#[635D9E93FFB1D67F]-worker) [     ] o.a.s.u.ErrorLogMuter Closing ErrorLogMuter-regex-268 after mutting 0 log messages
   [junit4]   2> 1621072 INFO  (SUITE-ShardSplitTest-seed#[635D9E93FFB1D67F]-worker) [     ] o.a.s.u.ErrorLogMuter Creating ErrorLogMuter-regex-269 for ERROR logs matching regex: ignore_exception
   [junit4]   2> 1621073 INFO  (SUITE-ShardSplitTest-seed#[635D9E93FFB1D67F]-worker) [     ] o.a.s.SolrTestCaseJ4 Created dataDir: /home/jenkins/jenkins-slave/workspace/Lucene/Lucene-Solr-Tests-8.11/solr/build/solr-core/test/J1/temp/solr.cloud.api.collections.ShardSplitTest_635D9E93FFB1D67F-001/data-dir-120-001
   [junit4]   2> 1621074 INFO  (SUITE-ShardSplitTest-seed#[635D9E93FFB1D67F]-worker) [     ] o.a.s.SolrTestCaseJ4 Using PointFields (NUMERIC_POINTS_SYSPROP=true) w/NUMERIC_DOCVALUES_SYSPROP=false
   [junit4]   2> 1621076 INFO  (SUITE-ShardSplitTest-seed#[635D9E93FFB1D67F]-worker) [     ] o.a.s.SolrTestCaseJ4 Randomized ssl (false) and clientAuth (false) via: @org.apache.solr.SolrTestCaseJ4$SuppressSSL(bugUrl=https://issues.apache.org/jira/browse/SOLR-5776)
   [junit4]   2> 1621076 INFO  (SUITE-ShardSplitTest-seed#[635D9E93FFB1D67F]-worker) [     ] o.a.s.BaseDistributedSearchTestCase Setting hostContext system property: /
   [junit4]   2> 1621080 INFO  (TEST-ShardSplitTest.testSplitAfterFailedSplit-seed#[635D9E93FFB1D67F]) [     ] o.a.s.u.ErrorLogMuter Closing ErrorLogMuter-regex-269 after mutting 0 log messages
   [junit4]   2> 1621080 INFO  (TEST-ShardSplitTest.testSplitAfterFailedSplit-seed#[635D9E93FFB1D67F]) [     ] o.a.s.u.ErrorLogMuter Creating ErrorLogMuter-regex-270 for ERROR logs matching regex: ignore_exception
   [junit4]   2> 1621081 INFO  (TEST-ShardSplitTest.testSplitAfterFailedSplit-seed#[635D9E93FFB1D67F]) [     ] o.a.s.c.ZkTestServer STARTING ZK TEST SERVER
   [junit4]   2> 1621081 INFO  (ZkTestServer Run Thread) [     ] o.a.s.c.ZkTestServer client port: 0.0.0.0/0.0.0.0:0
   [junit4]   2> 1621082 INFO  (ZkTestServer Run Thread) [     ] o.a.s.c.ZkTestServer Starting server
   [junit4]   2> 1621082 WARN  (ZkTestServer Run Thread) [     ] o.a.z.s.ServerCnxnFactory maxCnxns is not configured, using default value 0.
   [junit4]   2> 1621182 INFO  (TEST-ShardSplitTest.testSplitAfterFailedSplit-seed#[635D9E93FFB1D67F]) [     ] o.a.s.c.ZkTestServer start zk server on port: 40835
   [junit4]   2> 1621182 INFO  (TEST-ShardSplitTest.testSplitAfterFailedSplit-seed#[635D9E93FFB1D67F]) [     ] o.a.s.c.ZkTestServer waitForServerUp: 127.0.0.1:40835
   [junit4]   2> 1621182 INFO  (TEST-ShardSplitTest.testSplitAfterFailedSplit-seed#[635D9E93FFB1D67F]) [     ] o.a.s.c.ZkTestServer parse host and port list: 127.0.0.1:40835
   [junit4]   2> 1621182 INFO  (TEST-ShardSplitTest.testSplitAfterFailedSplit-seed#[635D9E93FFB1D67F]) [     ] o.a.s.c.ZkTestServer connecting to 127.0.0.1 40835
   [junit4]   2> 1621182 DEBUG (TEST-ShardSplitTest.testSplitAfterFailedSplit-seed#[635D9E93FFB1D67F]) [     ] o.a.s.c.c.SolrZkClient Using default ZkCredentialsProvider
   [junit4]   2> 1621183 INFO  (TEST-ShardSplitTest.testSplitAfterFailedSplit-seed#[635D9E93FFB1D67F]) [     ] o.a.s.c.c.ConnectionManager Waiting for client to connect to ZooKeeper
   [junit4]   2> 1621185 DEBUG (TEST-ShardSplitTest.testSplitAfterFailedSplit-seed#[635D9E93FFB1D67F]-EventThread) [     ] o.a.s.c.c.SolrZkClient Submitting job to respond to event WatchedEvent state:SyncConnected type:None path:null
   [junit4]   2> 1621185 DEBUG (zkConnectionManagerCallback-18172-thread-1) [     ] o.a.s.c.c.ConnectionManager Watcher org.apache.solr.common.cloud.ConnectionManager@500b55b0 name: ZooKeeperConnection Watcher:127.0.0.1:40835 got event WatchedEvent state:SyncConnected type:None path:null path: null type: None
   [junit4]   2> 1621185 INFO  (zkConnectionManagerCallback-18172-thread-1) [     ] o.a.s.c.c.ConnectionManager zkClient has connected
   [junit4]   2> 1621185 INFO  (TEST-ShardSplitTest.testSplitAfterFailedSplit-seed#[635D9E93FFB1D67F]) [     ] o.a.s.c.c.ConnectionManager Client is connected to ZooKeeper
   [junit4]   2> 1621185 DEBUG (TEST-ShardSplitTest.testSplitAfterFailedSplit-seed#[635D9E93FFB1D67F]) [     ] o.a.s.c.c.SolrZkClient Using default ZkACLProvider
   [junit4]   2> 1621186 DEBUG (TEST-ShardSplitTest.testSplitAfterFailedSplit-seed#[635D9E93FFB1D67F]) [     ] o.a.s.c.c.SolrZkClient makePath: /solr
   [junit4]   2> 1621187 DEBUG (TEST-ShardSplitTest.testSplitAfterFailedSplit-seed#[635D9E93FFB1D67F]) [     ] o.a.s.c.c.SolrZkClient Using default ZkCredentialsProvider
   [junit4]   2> 1621187 INFO  (TEST-ShardSplitTest.testSplitAfterFailedSplit-seed#[635D9E93FFB1D67F]) [     ] o.a.s.c.c.ConnectionManager Waiting for client to connect to ZooKeeper
   [junit4]   2> 1621189 DEBUG (TEST-ShardSplitTest.testSplitAfterFailedSplit-seed#[635D9E93FFB1D67F]-EventThread) [     ] o.a.s.c.c.SolrZkClient Submitting job to respond to event WatchedEvent state:SyncConnected type:None path:null
   [junit4]   2> 1621189 DEBUG (zkConnectionManagerCallback-18174-thread-1) [     ] o.a.s.c.c.ConnectionManager Watcher org.apache.solr.common.cloud.ConnectionManager@684ac2ed name: ZooKeeperConnection Watcher:127.0.0.1:40835/solr got event WatchedEvent state:SyncConnected type:None path:null path: null type: None
   [junit4]   2> 1621189 INFO  (zkConnectionManagerCallback-18174-thread-1) [     ] o.a.s.c.c.ConnectionManager zkClient has connected
   [junit4]   2> 1621189 INFO  (TEST-ShardSplitTest.testSplitAfterFailedSplit-seed#[635D9E93FFB1D67F]) [     ] o.a.s.c.c.ConnectionManager Client is connected to ZooKeeper
   [junit4]   2> 1621189 DEBUG (TEST-ShardSplitTest.testSplitAfterFailedSplit-seed#[635D9E93FFB1D67F]) [     ] o.a.s.c.c.SolrZkClient Using default ZkACLProvider
   [junit4]   2> 1621190 DEBUG (TEST-ShardSplitTest.testSplitAfterFailedSplit-seed#[635D9E93FFB1D67F]) [     ] o.a.s.c.c.SolrZkClient makePath: /clusterprops.json
   [junit4]   2> 1621190 INFO  (TEST-ShardSplitTest.testSplitAfterFailedSplit-seed#[635D9E93FFB1D67F]) [     ] o.a.s.c.ZkTestServer put /home/jenkins/jenkins-slave/workspace/Lucene/Lucene-Solr-Tests-8.11/solr/core/src/test-files/solr/collection1/conf/solrconfig-tlog.xml to /configs/conf1/solrconfig.xml
   [junit4]   2> 1621190 DEBUG (TEST-ShardSplitTest.testSplitAfterFailedSplit-seed#[635D9E93FFB1D67F]) [     ] o.a.s.c.c.SolrZkClient makePath: /configs/conf1/solrconfig.xml
   [junit4]   2> 1621191 INFO  (TEST-ShardSplitTest.testSplitAfterFailedSplit-seed#[635D9E93FFB1D67F]) [     ] o.a.s.c.ZkTestServer put /home/jenkins/jenkins-slave/workspace/Lucene/Lucene-Solr-Tests-8.11/solr/core/src/test-files/solr/collection1/conf/schema15.xml to /configs/conf1/schema.xml
   [junit4]   2> 1621191 DEBUG (TEST-ShardSplitTest.testSplitAfterFailedSplit-seed#[635D9E93FFB1D67F]) [     ] o.a.s.c.c.SolrZkClient makePath: /configs/conf1/schema.xml
   [junit4]   2> 1621193 INFO  (TEST-ShardSplitTest.testSplitAfterFailedSplit-seed#[635D9E93FFB1D67F]) [     ] o.a.s.c.ZkTestServer put /home/jenkins/jenkins-slave/workspace/Lucene/Lucene-Solr-Tests-8.11/solr/core/src/test-files/solr/collection1/conf/solrconfig.snippet.randomindexconfig.xml to /configs/conf1/solrconfig.snippet.randomindexconfig.xml
   [junit4]   2> 1621193 DEBUG (TEST-ShardSplitTest.testSplitAfterFailedSplit-seed#[635D9E93FFB1D67F]) [     ] o.a.s.c.c.SolrZkClient makePath: /configs/conf1/solrconfig.snippet.randomindexconfig.xml
   [junit4]   2> 1621194 INFO  (TEST-ShardSplitTest.testSplitAfterFailedSplit-seed#[635D9E93FFB1D67F]) [     ] o.a.s.c.ZkTestServer put /home/jenkins/jenkins-slave/workspace/Lucene/Lucene-Solr-Tests-8.11/solr/core/src/test-files/solr/collection1/conf/stopwords.txt to /configs/conf1/stopwords.txt
   [junit4]   2> 1621194 DEBUG (TEST-ShardSplitTest.testSplitAfterFailedSplit-seed#[635D9E93FFB1D67F]) [     ] o.a.s.c.c.SolrZkClient makePath: /configs/conf1/stopwords.txt
   [junit4]   2> 1621195 INFO  (TEST-ShardSplitTest.testSplitAfterFailedSplit-seed#[635D9E93FFB1D67F]) [     ] o.a.s.c.ZkTestServer put /home/jenkins/jenkins-slave/workspace/Lucene/Lucene-Solr-Tests-8.11/solr/core/src/test-files/solr/collection1/conf/protwords.txt to /configs/conf1/protwords.txt
   [junit4]   2> 1621196 DEBUG (TEST-ShardSplitTest.testSplitAfterFailedSplit-seed#[635D9E93FFB1D67F]) [     ] o.a.s.c.c.SolrZkClient makePath: /configs/conf1/protwords.txt
   [junit4]   2> 1621200 INFO  (TEST-ShardSplitTest.testSplitAfterFailedSplit-seed#[635D9E93FFB1D67F]) [     ] o.a.s.c.ZkTestServer put /home/jenkins/jenkins-slave/workspace/Lucene/Lucene-Solr-Tests-8.11/solr/core/src/test-files/solr/collection1/conf/currency.xml to /configs/conf1/currency.xml
   [junit4]   2> 1621200 DEBUG (TEST-ShardSplitTest.testSplitAfterFailedSplit-seed#[635D9E93FFB1D67F]) [     ] o.a.s.c.c.SolrZkClient makePath: /configs/conf1/currency.xml
   [junit4]   2> 1621203 INFO  (TEST-ShardSplitTest.testSplitAfterFailedSplit-seed#[635D9E93FFB1D67F]) [     ] o.a.s.c.ZkTestServer put /home/jenkins/jenkins-slave/workspace/Lucene/Lucene-Solr-Tests-8.11/solr/core/src/test-files/solr/collection1/conf/enumsConfig.xml to /configs/conf1/enumsConfig.xml
   [junit4]   2> 1621203 DEBUG (TEST-ShardSplitTest.testSplitAfterFailedSplit-seed#[635D9E93FFB1D67F]) [     ] o.a.s.c.c.SolrZkClient makePath: /configs/conf1/enumsConfig.xml
   [junit4]   2> 1621204 INFO  (TEST-ShardSplitTest.testSplitAfterFailedSplit-seed#[635D9E93FFB1D67F]) [     ] o.a.s.c.ZkTestServer put /home/jenkins/jenkins-slave/workspace/Lucene/Lucene-Solr-Tests-8.11/solr/core/src/test-files/solr/collection1/conf/open-exchange-rates.json to /configs/conf1/open-exchange-rates.json
   [junit4]   2> 1621204 DEBUG (TEST-ShardSplitTest.testSplitAfterFailedSplit-seed#[635D9E93FFB1D67F]) [     ] o.a.s.c.c.SolrZkClient makePath: /configs/conf1/open-exchange-rates.json
   [junit4]   2> 1621204 INFO  (TEST-ShardSplitTest.testSplitAfterFailedSplit-seed#[635D9E93FFB1D67F]) [     ] o.a.s.c.ZkTestServer put /home/jenkins/jenkins-slave/workspace/Lucene/Lucene-Solr-Tests-8.11/solr/core/src/test-files/solr/collection1/conf/mapping-ISOLatin1Accent.txt to /configs/conf1/mapping-ISOLatin1Accent.txt
   [junit4]   2> 1621204 DEBUG (TEST-ShardSplitTest.testSplitAfterFailedSplit-seed#[635D9E93FFB1D67F]) [     ] o.a.s.c.c.SolrZkClient makePath: /configs/conf1/mapping-ISOLatin1Accent.txt
   [junit4]   2> 1621205 INFO  (TEST-ShardSplitTest.testSplitAfterFailedSplit-seed#[635D9E93FFB1D67F]) [     ] o.a.s.c.ZkTestServer put /home/jenkins/jenkins-slave/workspace/Lucene/Lucene-Solr-Tests-8.11/solr/core/src/test-files/solr/collection1/conf/old_synonyms.txt to /configs/conf1/old_synonyms.txt
   [junit4]   2> 1621205 DEBUG (TEST-ShardSplitTest.testSplitAfterFailedSplit-seed#[635D9E93FFB1D67F]) [     ] o.a.s.c.c.SolrZkClient makePath: /configs/conf1/old_synonyms.txt
   [junit4]   2> 1621206 INFO  (TEST-ShardSplitTest.testSplitAfterFailedSplit-seed#[635D9E93FFB1D67F]) [     ] o.a.s.c.ZkTestServer put /home/jenkins/jenkins-slave/workspace/Lucene/Lucene-Solr-Tests-8.11/solr/core/src/test-files/solr/collection1/conf/synonyms.txt to /configs/conf1/synonyms.txt
   [junit4]   2> 1621206 DEBUG (TEST-ShardSplitTest.testSplitAfterFailedSplit-seed#[635D9E93FFB1D67F]) [     ] o.a.s.c.c.SolrZkClient makePath: /configs/conf1/synonyms.txt
   [junit4]   2> 1621207 INFO  (TEST-ShardSplitTest.testSplitAfterFailedSplit-seed#[635D9E93FFB1D67F]) [     ] o.a.s.c.AbstractFullDistribZkTestBase Will use NRT replicas unless explicitly asked otherwise
   [junit4]   2> 1621360 INFO  (TEST-ShardSplitTest.testSplitAfterFailedSplit-seed#[635D9E93FFB1D67F]) [     ] o.a.s.c.s.e.JettySolrRunner Start Jetty (configured port=0, binding port=0)
   [junit4]   2> 1621360 INFO  (TEST-ShardSplitTest.testSplitAfterFailedSplit-seed#[635D9E93FFB1D67F]) [     ] o.a.s.c.s.e.JettySolrRunner Trying to start Jetty on port 0 try number 2 ...
   [junit4]   2> 1621360 INFO  (TEST-ShardSplitTest.testSplitAfterFailedSplit-seed#[635D9E93FFB1D67F]) [     ] o.e.j.s.Server jetty-9.4.53.v20231009; built: 2023-10-09T12:29:09.265Z; git: 27bde00a0b95a1d5bbee0eae7984f891d2d0f8c9; jvm 1.8.0_362-b09
   [junit4]   2> 1621360 INFO  (TEST-ShardSplitTest.testSplitAfterFailedSplit-seed#[635D9E93FFB1D67F]) [     ] o.e.j.s.session DefaultSessionIdManager workerName=node0
   [junit4]   2> 1621360 INFO  (TEST-ShardSplitTest.testSplitAfterFailedSplit-seed#[635D9E93FFB1D67F]) [     ] o.e.j.s.session No SessionScavenger set, using defaults
   [junit4]   2> 1621361 INFO  (TEST-ShardSplitTest.testSplitAfterFailedSplit-seed#[635D9E93FFB1D67F]) [     ] o.e.j.s.session node0 Scavenging every 600000ms
   [junit4]   2> 1621361 INFO  (TEST-ShardSplitTest.testSplitAfterFailedSplit-seed#[635D9E93FFB1D67F]) [     ] o.e.j.s.h.ContextHandler Started o.e.j.s.ServletContextHandler@fedd8d2{/,null,AVAILABLE}
   [junit4]   2> 1621361 INFO  (TEST-ShardSplitTest.testSplitAfterFailedSplit-seed#[635D9E93FFB1D67F]) [     ] o.e.j.s.AbstractConnector Started ServerConnector@6ea334a3{HTTP/1.1, (http/1.1, h2c)}{127.0.0.1:44125}
   [junit4]   2> 1621361 INFO  (TEST-ShardSplitTest.testSplitAfterFailedSplit-seed#[635D9E93FFB1D67F]) [     ] o.e.j.s.Server Started @1621389ms
   [junit4]   2> 1621361 INFO  (TEST-ShardSplitTest.testSplitAfterFailedSplit-seed#[635D9E93FFB1D67F]) [     ] o.a.s.c.s.e.JettySolrRunner Jetty properties: {solr.data.dir=/home/jenkins/jenkins-slave/workspace/Lucene/Lucene-Solr-Tests-8.11/solr/build/solr-core/test/J1/temp/solr.cloud.api.collections.ShardSplitTest_635D9E93FFB1D67F-001/tempDir-001/control/data, replicaType=NRT, hostContext=/, hostPort=44125, coreRootDirectory=/home/jenkins/jenkins-slave/workspace/Lucene/Lucene-Solr-Tests-8.11/solr/build/solr-core/test/J1/temp/solr.cloud.api.collections.ShardSplitTest_635D9E93FFB1D67F-001/control-001/cores}
   [junit4]   2> 1621361 ERROR (TEST-ShardSplitTest.testSplitAfterFailedSplit-seed#[635D9E93FFB1D67F]) [     ] o.a.s.u.StartupLoggingUtils Missing Java Option solr.log.dir. Logging may be missing or incomplete.
   [junit4]   2> 1621361 INFO  (TEST-ShardSplitTest.testSplitAfterFailedSplit-seed#[635D9E93FFB1D67F]) [     ] o.a.s.s.SolrDispatchFilter Using logger factory org.apache.logging.slf4j.Log4jLoggerFactory
   [junit4]   2> 1621361 INFO  (TEST-ShardSplitTest.testSplitAfterFailedSplit-seed#[635D9E93FFB1D67F]) [     ] o.a.s.s.SolrDispatchFilter  ___      _       Welcome to Apache Solr? version 8.11.3
   [junit4]   2> 1621361 INFO  (TEST-ShardSplitTest.testSplitAfterFailedSplit-seed#[635D9E93FFB1D67F]) [     ] o.a.s.s.SolrDispatchFilter / __| ___| |_ _   Starting in cloud mode on port null
   [junit4]   2> 1621362 INFO  (TEST-ShardSplitTest.testSplitAfterFailedSplit-seed#[635D9E93FFB1D67F]) [     ] o.a.s.s.SolrDispatchFilter \__ \/ _ \ | '_|  Install dir: /home/jenkins/jenkins-slave/workspace/Lucene/Lucene-Solr-Tests-8.11/solr
   [junit4]   2> 1621362 INFO  (TEST-ShardSplitTest.testSplitAfterFailedSplit-seed#[635D9E93FFB1D67F]) [     ] o.a.s.s.SolrDispatchFilter |___/\___/_|_|    Start time: 2024-01-09T23:04:36.001Z
   [junit4]   2> 1621362 DEBUG (TEST-ShardSplitTest.testSplitAfterFailedSplit-seed#[635D9E93FFB1D67F]) [     ] o.a.s.c.c.SolrZkClient Using default ZkCredentialsProvider
   [junit4]   2> 1621362 INFO  (TEST-ShardSplitTest.testSplitAfterFailedSplit-seed#[635D9E93FFB1D67F]) [     ] o.a.s.c.c.ConnectionManager Waiting for client to connect to ZooKeeper
   [junit4]   2> 1621363 DEBUG (TEST-ShardSplitTest.testSplitAfterFailedSplit-seed#[635D9E93FFB1D67F]-EventThread) [     ] o.a.s.c.c.SolrZkClient Submitting job to respond to event WatchedEvent state:SyncConnected type:None path:null
   [junit4]   2> 1621363 DEBUG (zkConnectionManagerCallback-18176-thread-1) [     ] o.a.s.c.c.ConnectionManager Watcher org.apache.solr.common.cloud.ConnectionManager@2abc41fa name: ZooKeeperConnection Watcher:127.0.0.1:40835/solr got event WatchedEvent state:SyncConnected type:None path:null path: null type: None
   [junit4]   2> 1621363 INFO  (zkConnectionManagerCallback-18176-thread-1) [     ] o.a.s.c.c.ConnectionManager zkClient has connected
   [junit4]   2> 1621363 INFO  (TEST-ShardSplitTest.testSplitAfterFailedSplit-seed#[635D9E93FFB1D67F]) [     ] o.a.s.c.c.ConnectionManager Client is connected to ZooKeeper
   [junit4]   2> 1621363 DEBUG (TEST-ShardSplitTest.testSplitAfterFailedSplit-seed#[635D9E93FFB1D67F]) [     ] o.a.s.c.c.SolrZkClient Using default ZkACLProvider
   [junit4]   2> 1621464 DEBUG (TEST-ShardSplitTest.testSplitAfterFailedSplit-seed#[635D9E93FFB1D67F]-EventThread) [     ] o.a.s.c.c.SolrZkClient Submitting job to respond to event WatchedEvent state:Closed type:None path:null
   [junit4]   2> 1621464 INFO  (TEST-ShardSplitTest.testSplitAfterFailedSplit-seed#[635D9E93FFB1D67F]) [     ] o.a.s.s.SolrDispatchFilter Loading solr.xml from SolrHome (not found in ZooKeeper)
   [junit4]   2> 1621464 INFO  (TEST-ShardSplitTest.testSplitAfterFailedSplit-seed#[635D9E93FFB1D67F]) [     ] o.a.s.c.SolrXmlConfig Loading container configuration from /home/jenkins/jenkins-slave/workspace/Lucene/Lucene-Solr-Tests-8.11/solr/build/solr-core/test/J1/temp/solr.cloud.api.collections.ShardSplitTest_635D9E93FFB1D67F-001/control-001/solr.xml
   [junit4]   2> 1621467 INFO  (TEST-ShardSplitTest.testSplitAfterFailedSplit-seed#[635D9E93FFB1D67F]) [     ] o.a.s.c.SolrXmlConfig Configuration parameter autoReplicaFailoverWorkLoopDelay is ignored
   [junit4]   2> 1621467 INFO  (TEST-ShardSplitTest.testSplitAfterFailedSplit-seed#[635D9E93FFB1D67F]) [     ] o.a.s.c.SolrXmlConfig Configuration parameter autoReplicaFailoverBadNodeExpiration is ignored
   [junit4]   2> 1621468 INFO  (TEST-ShardSplitTest.testSplitAfterFailedSplit-seed#[635D9E93FFB1D67F]) [     ] o.a.s.c.SolrXmlConfig MBean server found: com.sun.jmx.mbeanserver.JmxMBeanServer@20bff77f, but no JMX reporters were configured - adding default JMX reporter.
   [junit4]   2> 1622015 INFO  (TEST-ShardSplitTest.testSplitAfterFailedSplit-seed#[635D9E93FFB1D67F]) [     ] o.a.s.h.c.HttpShardHandlerFactory Host whitelist initialized: WhitelistHostChecker [whitelistHosts=null, whitelistHostCheckingEnabled=false]
   [junit4]   2> 1622017 WARN  (TEST-ShardSplitTest.testSplitAfterFailedSplit-seed#[635D9E93FFB1D67F]) [     ] o.e.j.u.s.S.config Trusting all certificates configured for Client@602c6951[provider=null,keyStore=null,trustStore=null]
   [junit4]   2> 1622017 WARN  (TEST-ShardSplitTest.testSplitAfterFailedSplit-seed#[635D9E93FFB1D67F]) [     ] o.e.j.u.s.S.config No Client EndPointIdentificationAlgorithm configured for Client@602c6951[provider=null,keyStore=null,trustStore=null]
   [junit4]   2> 1622020 WARN  (TEST-ShardSplitTest.testSplitAfterFailedSplit-seed#[635D9E93FFB1D67F]) [     ] o.e.j.u.s.S.config Trusting all certificates configured for Client@5eefd9ee[provider=null,keyStore=null,trustStore=null]
   [junit4]   2> 1622020 WARN  (TEST-ShardSplitTest.testSplitAfterFailedSplit-seed#[635D9E93FFB1D67F]) [     ] o.e.j.u.s.S.config No Client EndPointIdentificationAlgorithm configured for Client@5eefd9ee[provider=null,keyStore=null,trustStore=null]
   [junit4]   2> 1622022 INFO  (TEST-ShardSplitTest.testSplitAfterFailedSplit-seed#[635D9E93FFB1D67F]) [     ] o.a.s.c.ZkContainer Zookeeper client=127.0.0.1:40835/solr
   [junit4]   2> 1622022 DEBUG (TEST-ShardSplitTest.testSplitAfterFailedSplit-seed#[635D9E93FFB1D67F]) [     ] o.a.s.c.c.SolrZkClient Using default ZkCredentialsProvider
   [junit4]   2> 1622025 INFO  (TEST-ShardSplitTest.testSplitAfterFailedSplit-seed#[635D9E93FFB1D67F]) [     ] o.a.s.c.c.ConnectionManager Waiting for client to connect to ZooKeeper
   [junit4]   2> 1622027 DEBUG (TEST-ShardSplitTest.testSplitAfterFailedSplit-seed#[635D9E93FFB1D67F]-EventThread) [     ] o.a.s.c.c.SolrZkClient Submitting job to respond to event WatchedEvent state:SyncConnected type:None path:null
   [junit4]   2> 1622027 DEBUG (zkConnectionManagerCallback-18187-thread-1) [     ] o.a.s.c.c.ConnectionManager Watcher org.apache.solr.common.cloud.ConnectionManager@57a73792 name: ZooKeeperConnection Watcher:127.0.0.1:40835 got event WatchedEvent state:SyncConnected type:None path:null path: null type: None
   [junit4]   2> 1622027 INFO  (zkConnectionManagerCallback-18187-thread-1) [     ] o.a.s.c.c.ConnectionManager zkClient has connected
   [junit4]   2> 1622027 INFO  (TEST-ShardSplitTest.testSplitAfterFailedSplit-seed#[635D9E93FFB1D67F]) [     ] o.a.s.c.c.ConnectionManager Client is connected to ZooKeeper
   [junit4]   2> 1622027 DEBUG (TEST-ShardSplitTest.testSplitAfterFailedSplit-seed#[635D9E93FFB1D67F]) [     ] o.a.s.c.c.SolrZkClient Using default ZkACLProvider
   [junit4]   2> 1622129 DEBUG (TEST-ShardSplitTest.testSplitAfterFailedSplit-seed#[635D9E93FFB1D67F]-EventThread) [     ] o.a.s.c.c.SolrZkClient Submitting job to respond to event WatchedEvent state:Closed type:None path:null
   [junit4]   2> 1622130 INFO  (TEST-ShardSplitTest.testSplitAfterFailedSplit-seed#[635D9E93FFB1D67F]) [n:127.0.0.1:44125_     ] o.a.s.c.c.ConnectionManager Waiting for client to connect to ZooKeeper
   [junit4]   2> 1622130 DEBUG (TEST-ShardSplitTest.testSplitAfterFailedSplit-seed#[635D9E93FFB1D67F]-EventThread) [     ] o.a.s.c.c.SolrZkClient Submitting job to respond to event WatchedEvent state:SyncConnected type:None path:null
   [junit4]   2> 1622131 DEBUG (zkConnectionManagerCallback-18189-thread-1) [     ] o.a.s.c.c.ConnectionManager Watcher org.apache.solr.common.cloud.ConnectionManager@508f317d name: ZooKeeperConnection Watcher:127.0.0.1:40835/solr got event WatchedEvent state:SyncConnected type:None path:null path: null type: None
   [junit4]   2> 1622131 INFO  (zkConnectionManagerCallback-18189-thread-1) [     ] o.a.s.c.c.ConnectionManager zkClient has connected
   [junit4]   2> 1622131 INFO  (TEST-ShardSplitTest.testSplitAfterFailedSplit-seed#[635D9E93FFB1D67F]) [n:127.0.0.1:44125_     ] o.a.s.c.c.ConnectionManager Client is connected to ZooKeeper
   [junit4]   2> 1622131 DEBUG (TEST-ShardSplitTest.testSplitAfterFailedSplit-seed#[635D9E93FFB1D67F]) [n:127.0.0.1:44125_     ] o.a.s.c.c.SolrZkClient makePath: /overseer/collection-map-running
   [junit4]   2> 1622132 DEBUG (TEST-ShardSplitTest.testSplitAfterFailedSplit-seed#[635D9E93FFB1D67F]) [n:127.0.0.1:44125_     ] o.a.s.c.c.SolrZkClient makePath: /overseer/collection-map-completed
   [junit4]   2> 1622133 DEBUG (TEST-ShardSplitTest.testSplitAfterFailedSplit-seed#[635D9E93FFB1D67F]) [n:127.0.0.1:44125_     ] o.a.s.c.c.SolrZkClient makePath: /overseer/collection-map-failure
   [junit4]   2> 1622134 DEBUG (TEST-ShardSplitTest.testSplitAfterFailedSplit-seed#[635D9E93FFB1D67F]) [n:127.0.0.1:44125_     ] o.a.s.c.c.SolrZkClient makePath: /overseer/async_ids
   [junit4]   2> 1622135 DEBUG (TEST-ShardSplitTest.testSplitAfterFailedSplit-seed#[635D9E93FFB1D67F]) [n:127.0.0.1:44125_     ] o.a.s.c.c.SolrZkClient makePath: /live_nodes
   [junit4]   2> 1622135 DEBUG (TEST-ShardSplitTest.testSplitAfterFailedSplit-seed#[635D9E93FFB1D67F]) [n:127.0.0.1:44125_     ] o.a.s.c.c.SolrZkClient makePath: /node_roles
   [junit4]   2> 1622136 DEBUG (TEST-ShardSplitTest.testSplitAfterFailedSplit-seed#[635D9E93FFB1D67F]) [n:127.0.0.1:44125_     ] o.a.s.c.c.SolrZkClient makePath: /node_roles/data
   [junit4]   2> 1622137 DEBUG (TEST-ShardSplitTest.testSplitAfterFailedSplit-seed#[635D9E93FFB1D67F]) [n:127.0.0.1:44125_     ] o.a.s.c.c.SolrZkClient makePath: /node_roles/data/on
   [junit4]   2> 1622138 DEBUG (TEST-ShardSplitTest.testSplitAfterFailedSplit-seed#[635D9E93FFB1D67F]) [n:127.0.0.1:44125_     ] o.a.s.c.c.SolrZkClient makePath: /node_roles/data/off
   [junit4]   2> 1622140 DEBUG (TEST-ShardSplitTest.testSplitAfterFailedSplit-seed#[635D9E93FFB1D67F]) [n:127.0.0.1:44125_     ] o.a.s.c.c.SolrZkClient makePath: /node_roles/overseer
   [junit4]   2> 1622140 DEBUG (TEST-ShardSplitTest.testSplitAfterFailedSplit-seed#[635D9E93FFB1D67F]) [n:127.0.0.1:44125_     ] o.a.s.c.c.SolrZkClient makePath: /node_roles/overseer/allowed
   [junit4]   2> 1622142 DEBUG (TEST-ShardSplitTest.testSplitAfterFailedSplit-seed#[635D9E93FFB1D67F]) [n:127.0.0.1:44125_     ] o.a.s.c.c.SolrZkClient makePath: /node_roles/overseer/preferred
   [junit4]   2> 1622143 DEBUG (TEST-ShardSplitTest.testSplitAfterFailedSplit-seed#[635D9E93FFB1D67F]) [n:127.0.0.1:44125_     ] o.a.s.c.c.SolrZkClient makePath: /node_roles/overseer/disallowed
   [junit4]   2> 1622143 DEBUG (TEST-ShardSplitTest.testSplitAfterFailedSplit-seed#[635D9E93FFB1D67F]) [n:127.0.0.1:44125_     ] o.a.s.c.c.SolrZkClient makePath: /node_roles/coordinator
   [junit4]   2> 1622144 DEBUG (TEST-ShardSplitTest.testSplitAfterFailedSplit-seed#[635D9E93FFB1D67F]) [n:127.0.0.1:44125_     ] o.a.s.c.c.SolrZkClient makePath: /node_roles/coordinator/on
   [junit4]   2> 1622145 DEBUG (TEST-ShardSplitTest.testSplitAfterFailedSplit-seed#[635D9E93FFB1D67F]) [n:127.0.0.1:44125_     ] o.a.s.c.c.SolrZkClient makePath: /node_roles/coordinator/off
   [junit4]   2> 1622146 DEBUG (TEST-ShardSplitTest.testSplitAfterFailedSplit-seed#[635D9E93FFB1D67F]) [n:127.0.0.1:44125_     ] o.a.s.c.c.SolrZkClient makePath: /aliases.json
   [junit4]   2> 1622147 DEBUG (TEST-ShardSplitTest.testSplitAfterFailedSplit-seed#[635D9E93FFB1D67F]) [n:127.0.0.1:44125_     ] o.a.s.c.c.SolrZkClient makePath: /autoscaling/events
   [junit4]   2> 1622148 DEBUG (TEST-ShardSplitTest.testSplitAfterFailedSplit-seed#[635D9E93FFB1D67F]) [n:127.0.0.1:44125_     ] o.a.s.c.c.SolrZkClient makePath: /autoscaling/triggerState
   [junit4]   2> 1622150 DEBUG (TEST-ShardSplitTest.testSplitAfterFailedSplit-seed#[635D9E93FFB1D67F]) [n:127.0.0.1:44125_     ] o.a.s.c.c.SolrZkClient makePath: /autoscaling/nodeAdded
   [junit4]   2> 1622152 DEBUG (TEST-ShardSplitTest.testSplitAfterFailedSplit-seed#[635D9E93FFB1D67F]) [n:127.0.0.1:44125_     ] o.a.s.c.c.SolrZkClient makePath: /autoscaling/nodeLost
   [junit4]   2> 1622153 DEBUG (TEST-ShardSplitTest.testSplitAfterFailedSplit-seed#[635D9E93FFB1D67F]) [n:127.0.0.1:44125_     ] o.a.s.c.c.SolrZkClient makePath: /clusterstate.json
   [junit4]   2> 1622154 DEBUG (TEST-ShardSplitTest.testSplitAfterFailedSplit-seed#[635D9E93FFB1D67F]) [n:127.0.0.1:44125_     ] o.a.s.c.c.SolrZkClient makePath: /autoscaling.json
   [junit4]   2> 1622154 DEBUG (TEST-ShardSplitTest.testSplitAfterFailedSplit-seed#[635D9E93FFB1D67F]) [n:127.0.0.1:44125_     ] o.a.s.c.c.SolrZkClient makePath: /security.json
   [junit4]   2> 1622155 DEBUG (TEST-ShardSplitTest.testSplitAfterFailedSplit-seed#[635D9E93FFB1D67F]) [n:127.0.0.1:44125_     ] o.a.s.c.c.SolrZkClient makePath: /configs/_default/protwords.txt
   [junit4]   2> 1622157 DEBUG (TEST-ShardSplitTest.testSplitAfterFailedSplit-seed#[635D9E93FFB1D67F]) [n:127.0.0.1:44125_     ] o.a.s.c.c.SolrZkClient makePath: /configs/_default/solrconfig.xml
   [junit4]   2> 1622159 DEBUG (TEST-ShardSplitTest.testSplitAfterFailedSplit-seed#[635D9E93FFB1D67F]) [n:127.0.0.1:44125_     ] o.a.s.c.c.SolrZkClient makePath: /configs/_default/synonyms.txt
   [junit4]   2> 1622163 DEBUG (TEST-ShardSplitTest.testSplitAfterFailedSplit-seed#[635D9E93FFB1D67F]) [n:127.0.0.1:44125_     ] o.a.s.c.c.SolrZkClient makePath: /configs/_default/managed-schema
   [junit4]   2> 1622165 DEBUG (TEST-ShardSplitTest.testSplitAfterFailedSplit-seed#[635D9E93FFB1D67F]) [n:127.0.0.1:44125_     ] o.a.s.c.c.SolrZkClient makePath: /configs/_default/lang/stopwords_hi.txt
   [junit4]   2> 1622167 DEBUG (TEST-ShardSplitTest.testSplitAfterFailedSplit-seed#[635D9E93FFB1D67F]) [n:127.0.0.1:44125_     ] o.a.s.c.c.SolrZkClient makePath: /configs/_default/lang/stopwords_fa.txt
   [junit4]   2> 1622169 DEBUG (TEST-ShardSplitTest.testSplitAfterFailedSplit-seed#[635D9E93FFB1D67F]) [n:127.0.0.1:44125_     ] o.a.s.c.c.SolrZkClient makePath: /configs/_default/lang/stopwords_es.txt
   [junit4]   2> 1622170 DEBUG (TEST-ShardSplitTest.testSplitAfterFailedSplit-seed#[635D9E93FFB1D67F]) [n:127.0.0.1:44125_     ] o.a.s.c.c.SolrZkClient makePath: /configs/_default/lang/stopwords_sv.txt
   [junit4]   2> 1622171 DEBUG (TEST-ShardSplitTest.testSplitAfterFailedSplit-seed#[635D9E93FFB1D67F]) [n:127.0.0.1:44125_     ] o.a.s.c.c.SolrZkClient makePath: /configs/_default/lang/contractions_ca.txt
   [junit4]   2> 1622172 DEBUG (TEST-ShardSplitTest.testSplitAfterFailedSplit-seed#[635D9E93FFB1D67F]) [n:127.0.0.1:44125_     ] o.a.s.c.c.SolrZkClient makePath: /configs/_default/lang/stopwords_it.txt
   [junit4]   2> 1622173 DEBUG (TEST-ShardSplitTest.testSplitAfterFailedSplit-seed#[635D9E93FFB1D67F]) [n:127.0.0.1:44125_     ] o.a.s.c.c.SolrZkClient makePath: /configs/_default/lang/stopwords_eu.txt
   [junit4]   2> 1622174 DEBUG (TEST-ShardSplitTest.testSplitAfterFailedSplit-seed#[635D9E93FFB1D67F]) [n:127.0.0.1:44125_     ] o.a.s.c.c.SolrZkClient makePath: /configs/_default/lang/stopwords_no.txt
   [junit4]   2> 1622175 DEBUG (TEST-ShardSplitTest.testSplitAfterFailedSplit-seed#[635D9E93FFB1D67F]) [n:127.0.0.1:44125_     ] o.a.s.c.c.SolrZkClient makePath: /configs/_default/lang/stopwords_en.txt
   [junit4]   2> 1622177 DEBUG (TEST-ShardSplitTest.testSplitAfterFailedSplit-seed#[635D9E93FFB1D67F]) [n:127.0.0.1:44125_     ] o.a.s.c.c.SolrZkClient makePath: /configs/_default/lang/stopwords_et.txt
   [junit4]   2> 1622178 DEBUG (TEST-ShardSplitTest.testSplitAfterFailedSplit-seed#[635D9E93FFB1D67F]) [n:127.0.0.1:44125_     ] o.a.s.c.c.SolrZkClient makePath: /configs/_default/lang/stopwords_ar.txt
   [junit4]   2> 1622179 DEBUG (TEST-ShardSplitTest.testSplitAfterFailedSplit-seed#[635D9E93FFB1D67F]) [n:127.0.0.1:44125_     ] o.a.s.c.c.SolrZkClient makePath: /configs/_default/lang/stopwords_fi.txt
   [junit4]   2> 1622180 DEBUG (TEST-ShardSplitTest.testSplitAfterFailedSplit-seed#[635D9E93FFB1D67F]) [n:127.0.0.1:44125_     ] o.a.s.c.c.SolrZkClient makePath: /configs/_default/lang/stopwords_hu.txt
   [junit4]   2> 1622182 DEBUG (TEST-ShardSplitTest.testSplitAfterFailedSplit-seed#[635D9E93FFB1D67F]) [n:127.0.0.1:44125_     ] o.a.s.c.c.SolrZkClient makePath: /configs/_default/lang/hyphenations_ga.txt
   [junit4]   2> 1622183 DEBUG (TEST-ShardSplitTest.testSplitAfterFailedSplit-seed#[635D9E93FFB1D67F]) [n:127.0.0.1:44125_     ] o.a.s.c.c.SolrZkClient makePath: /configs/_default/lang/stopwords_nl.txt
   [junit4]   2> 1622184 DEBUG (TEST-ShardSplitTest.testSplitAfterFailedSplit-seed#[635D9E93FFB1D67F]) [n:127.0.0.1:44125_     ] o.a.s.c.c.SolrZkClient makePath: /configs/_default/lang/stopwords_de.txt
   [junit4]   2> 1622186 DEBUG (TEST-ShardSplitTest.testSplitAfterFailedSplit-seed#[635D9E93FFB1D67F]) [n:127.0.0.1:44125_     ] o.a.s.c.c.SolrZkClient makePath: /configs/_default/lang/stopwords_th.txt
   [junit4]   2> 1622187 DEBUG (TEST-ShardSplitTest.testSplitAfterFailedSplit-seed#[635D9E93FFB1D67F]) [n:127.0.0.1:44125_     ] o.a.s.c.c.SolrZkClient makePath: /configs/_default/lang/stemdict_nl.txt
   [junit4]   2> 1622188 DEBUG (TEST-ShardSplitTest.testSplitAfterFailedSplit-seed#[635D9E93FFB1D67F]) [n:127.0.0.1:44125_     ] o.a.s.c.c.SolrZkClient makePath: /configs/_default/lang/stopwords_ca.txt
   [junit4]   2> 1622189 DEBUG (TEST-ShardSplitTest.testSplitAfterFailedSplit-seed#[635D9E93FFB1D67F]) [n:127.0.0.1:44125_     ] o.a.s.c.c.SolrZkClient makePath: /configs/_default/lang/stopwords_bg.txt
   [junit4]   2> 1622190 DEBUG (TEST-ShardSplitTest.testSplitAfterFailedSplit-seed#[635D9E93FFB1D67F]) [n:127.0.0.1:44125_     ] o.a.s.c.c.SolrZkClient makePath: /configs/_default/lang/stopwords_gl.txt
   [junit4]   2> 1622192 DEBUG (TEST-ShardSplitTest.testSplitAfterFailedSplit-seed#[635D9E93FFB1D67F]) [n:127.0.0.1:44125_     ] o.a.s.c.c.SolrZkClient makePath: /configs/_default/lang/stopwords_da.txt
   [junit4]   2> 1622193 DEBUG (TEST-ShardSplitTest.testSplitAfterFailedSplit-seed#[635D9E93FFB1D67F]) [n:127.0.0.1:44125_     ] o.a.s.c.c.SolrZkClient makePath: /configs/_default/lang/stopwords_tr.txt
   [junit4]   2> 1622194 DEBUG (TEST-ShardSplitTest.testSplitAfterFailedSplit-seed#[635D9E93FFB1D67F]) [n:127.0.0.1:44125_     ] o.a.s.c.c.SolrZkClient makePath: /configs/_default/lang/contractions_fr.txt
   [junit4]   2> 1622195 DEBUG (TEST-ShardSplitTest.testSplitAfterFailedSplit-seed#[635D9E93FFB1D67F]) [n:127.0.0.1:44125_     ] o.a.s.c.c.SolrZkClient makePath: /configs/_default/lang/stopwords_ja.txt
   [junit4]   2> 1622196 DEBUG (TEST-ShardSplitTest.testSplitAfterFailedSplit-seed#[635D9E93FFB1D67F]) [n:127.0.0.1:44125_     ] o.a.s.c.c.SolrZkClient makePath: /configs/_default/lang/stopwords_hy.txt
   [junit4]   2> 1622197 DEBUG (TEST-ShardSplitTest.testSplitAfterFailedSplit-seed#[635D9E93FFB1D67F]) [n:127.0.0.1:44125_     ] o.a.s.c.c.SolrZkClient makePath: /configs/_default/lang/stoptags_ja.txt
   [junit4]   2> 1622199 DEBUG (TEST-ShardSplitTest.testSplitAfterFailedSplit-seed#[635D9E93FFB1D67F]) [n:127.0.0.1:44125_     ] o.a.s.c.c.SolrZkClient makePath: /configs/_default/lang/contractions_it.txt
   [junit4]   2> 1622200 DEBUG (TEST-ShardSplitTest.testSplitAfterFailedSplit-seed#[635D9E93FFB1D67F]) [n:127.0.0.1:44125_     ] o.a.s.c.c.SolrZkClient makePath: /configs/_default/lang/stopwords_cz.txt
   [junit4]   2> 1622201 DEBUG (TEST-ShardSplitTest.testSplitAfterFailedSplit-seed#[635D9E93FFB1D67F]) [n:127.0.0.1:44125_     ] o.a.s.c.c.SolrZkClient makePath: /configs/_default/lang/stopwords_id.txt
   [junit4]   2> 1622202 DEBUG (TEST-ShardSplitTest.testSplitAfterFailedSplit-seed#[635D9E93FFB1D67F]) [n:127.0.0.1:44125_     ] o.a.s.c.c.SolrZkClient makePath: /configs/_default/lang/stopwords_ro.txt
   [junit4]   2> 1622203 DEBUG (TEST-ShardSplitTest.testSplitAfterFailedSplit-seed#[635D9E93FFB1D67F]) [n:127.0.0.1:44125_     ] o.a.s.c.c.SolrZkClient makePath: /configs/_default/lang/userdict_ja.txt
   [junit4]   2> 1622204 DEBUG (TEST-ShardSplitTest.testSplitAfterFailedSplit-seed#[635D9E93FFB1D67F]) [n:127.0.0.1:44125_     ] o.a.s.c.c.SolrZkClient makePath: /configs/_default/lang/stopwords_el.txt
   [junit4]   2> 1622205 DEBUG (TEST-ShardSplitTest.testSplitAfterFailedSplit-seed#[635D9E93FFB1D67F]) [n:127.0.0.1:44125_     ] o.a.s.c.c.SolrZkClient makePath: /configs/_default/lang/stopwords_ga.txt
   [junit4]   2> 1622206 DEBUG (TEST-ShardSplitTest.testSplitAfterFailedSplit-seed#[635D9E93FFB1D67F]) [n:127.0.0.1:44125_     ] o.a.s.c.c.SolrZkClient makePath: /configs/_default/lang/stopwords_fr.txt
   [junit4]   2> 1622207 DEBUG (TEST-ShardSplitTest.testSplitAfterFailedSplit-seed#[635D9E93FFB1D67F]) [n:127.0.0.1:44125_     ] o.a.s.c.c.SolrZkClient makePath: /configs/_default/lang/contractions_ga.txt
   [junit4]   2> 1622209 DEBUG (TEST-ShardSplitTest.testSplitAfterFailedSplit-seed#[635D9E93FFB1D67F]) [n:127.0.0.1:44125_     ] o.a.s.c.c.SolrZkClient makePath: /configs/_default/lang/stopwords_lv.txt
   [junit4]   2> 1622210 DEBUG (TEST-ShardSplitTest.testSplitAfterFailedSplit-seed#[635D9E93FFB1D67F]) [n:127.0.0.1:44125_     ] o.a.s.c.c.SolrZkClient makePath: /configs/_default/lang/stopwords_ru.txt
   [junit4]   2> 1622211 DEBUG (TEST-ShardSplitTest.testSplitAfterFailedSplit-seed#[635D9E93FFB1D67F]) [n:127.0.0.1:44125_     ] o.a.s.c.c.SolrZkClient makePath: /configs/_default/lang/stopwords_pt.txt
   [junit4]   2> 1622212 DEBUG (TEST-ShardSplitTest.testSplitAfterFailedSplit-seed#[635D9E93FFB1D67F]) [n:127.0.0.1:44125_     ] o.a.s.c.c.SolrZkClient makePath: /configs/_default/stopwords.txt
   [junit4]   2> 1622213 WARN  (TEST-ShardSplitTest.testSplitAfterFailedSplit-seed#[635D9E93FFB1D67F]) [n:127.0.0.1:44125_     ] o.a.s.c.ZkController Contents of zookeeper /security.json are world-readable; consider setting up ACLs as described in https://solr.apache.org/guide/zookeeper-access-control.html
   [junit4]   2> 1622213 DEBUG (TEST-ShardSplitTest.testSplitAfterFailedSplit-seed#[635D9E93FFB1D67F]) [n:127.0.0.1:44125_     ] o.a.s.c.c.ZkStateReader Updating cluster state from ZooKeeper... 
   [junit4]   2> 1622214 DEBUG (TEST-ShardSplitTest.testSplitAfterFailedSplit-seed#[635D9E93FFB1D67F]) [n:127.0.0.1:44125_     ] o.a.s.c.c.ZkStateReader Loaded cluster properties: {legacyCloud=true}
   [junit4]   2> 1622214 DEBUG (TEST-ShardSplitTest.testSplitAfterFailedSplit-seed#[635D9E93FFB1D67F]) [n:127.0.0.1:44125_     ] o.a.s.c.c.ZkStateReader Updated live nodes from ZooKeeper... [] -> []
   [junit4]   2> 1622214 DEBUG (TEST-ShardSplitTest.testSplitAfterFailedSplit-seed#[635D9E93FFB1D67F]) [n:127.0.0.1:44125_     ] o.a.s.c.c.ZkStateReader clusterStateSet: legacy [0] interesting [0] watched [0] lazy [2] total [2]
   [junit4]   2> 1622215 DEBUG (TEST-ShardSplitTest.testSplitAfterFailedSplit-seed#[635D9E93FFB1D67F]) [n:127.0.0.1:44125_     ] o.a.s.c.c.ZkStateReader$AliasesManager Checking ZK for most up to date Aliases /aliases.json
   [junit4]   2> 1622215 DEBUG (TEST-ShardSplitTest.testSplitAfterFailedSplit-seed#[635D9E93FFB1D67F]) [n:127.0.0.1:44125_     ] o.a.s.c.c.ZkStateReader$AliasesManager Aliases: cmp=-1, new definition is: Aliases{collectionAliases={}, collectionAliasProperties={}, zNodeVersion=0}
   [junit4]   2> 1622216 DEBUG (TEST-ShardSplitTest.testSplitAfterFailedSplit-seed#[635D9E93FFB1D67F]) [n:127.0.0.1:44125_     ] o.a.s.c.c.SolrZkClient makePath: /overseer_elect
   [junit4]   2> 1622217 DEBUG (TEST-ShardSplitTest.testSplitAfterFailedSplit-seed#[635D9E93FFB1D67F]) [n:127.0.0.1:44125_     ] o.a.s.c.c.SolrZkClient makePath: /overseer_elect/election
   [junit4]   2> 1622218 INFO  (TEST-ShardSplitTest.testSplitAfterFailedSplit-seed#[635D9E93FFB1D67F]) [n:127.0.0.1:44125_     ] o.a.s.c.OverseerElectionContext I am going to be the leader 127.0.0.1:44125_
   [junit4]   2> 1622218 DEBUG (TEST-ShardSplitTest.testSplitAfterFailedSplit-seed#[635D9E93FFB1D67F]) [n:127.0.0.1:44125_     ] o.a.s.c.c.SolrZkClient makePath: /overseer_elect/leader
   [junit4]   2> 1622218 INFO  (TEST-ShardSplitTest.testSplitAfterFailedSplit-seed#[635D9E93FFB1D67F]) [n:127.0.0.1:44125_     ] o.a.s.c.Overseer Overseer (id=72242789420892164-127.0.0.1:44125_-n_0000000000) starting
   [junit4]   2> 1622219 DEBUG (TEST-ShardSplitTest.testSplitAfterFailedSplit-seed#[635D9E93FFB1D67F]) [n:127.0.0.1:44125_     ] o.a.s.c.c.SolrZkClient makePath: /overseer/queue
   [junit4]   2> 1622219 DEBUG (TEST-ShardSplitTest.testSplitAfterFailedSplit-seed#[635D9E93FFB1D67F]) [n:127.0.0.1:44125_     ] o.a.s.c.c.SolrZkClient makePath: /overseer/queue-work
   [junit4]   2> 1622221 DEBUG (TEST-ShardSplitTest.testSplitAfterFailedSplit-seed#[635D9E93FFB1D67F]) [n:127.0.0.1:44125_     ] o.a.s.c.c.SolrZkClient makePath: /overseer/collection-queue-work
   [junit4]   2> 1622223 DEBUG (OverseerCollectionConfigSetProcessor-72242789420892164-127.0.0.1:44125_-n_0000000000) [n:127.0.0.1:44125_     ] o.a.s.c.OverseerTaskProcessor Process current queue of overseer operations
   [junit4]   2> 1622223 INFO  (OverseerStateUpdate-72242789420892164-127.0.0.1:44125_-n_0000000000) [n:127.0.0.1:44125_     ] o.a.s.c.Overseer Starting to work on the main queue : 127.0.0.1:44125_
   [junit4]   2> 1622223 INFO  (TEST-ShardSplitTest.testSplitAfterFailedSplit-seed#[635D9E93FFB1D67F]) [n:127.0.0.1:44125_     ] o.a.s.c.ZkController Register node as live in ZooKeeper:/live_nodes/127.0.0.1:44125_
   [junit4]   2> 1622224 DEBUG (TEST-ShardSplitTest.testSplitAfterFailedSplit-seed#[635D9E93FFB1D67F]-EventThread) [     ] o.a.s.c.c.SolrZkClient Submitting job to respond to event WatchedEvent state:SyncConnected type:NodeChildrenChanged path:/live_nodes
   [junit4]   2> 1622224 DEBUG (zkCallback-18188-thread-1) [     ] o.a.s.c.c.ZkStateReader A live node change: [WatchedEvent state:SyncConnected type:NodeChildrenChanged path:/live_nodes], has occurred - updating... (live nodes size: [0])
   [junit4]   2> 1622224 INFO  (OverseerStateUpdate-72242789420892164-127.0.0.1:44125_-n_0000000000) [n:127.0.0.1:44125_     ] o.a.s.c.c.ZkStateReader Updated live nodes from ZooKeeper... (0) -> (1)
   [junit4]   2> 1622224 DEBUG (OverseerStateUpdate-72242789420892164-127.0.0.1:44125_-n_0000000000) [n:127.0.0.1:44125_     ] o.a.s.c.c.ZkStateReader Updated live nodes from ZooKeeper... [] -> [127.0.0.1:44125_]
   [junit4]   2> 1622224 DEBUG (OverseerCollectionConfigSetProcessor-72242789420892164-127.0.0.1:44125_-n_0000000000) [n:127.0.0.1:44125_     ] o.a.s.c.OverseerTaskProcessor Cleaning up work-queue. #Running tasks: 0 #Completed tasks: 0
   [junit4]   2> 1622224 DEBUG (OverseerCollectionConfigSetProcessor-72242789420892164-127.0.0.1:44125_-n_0000000000) [n:127.0.0.1:44125_     ] o.a.s.c.OverseerTaskProcessor RunningTasks: []
   [junit4]   2> 1622224 DEBUG (OverseerCollectionConfigSetProcessor-72242789420892164-127.0.0.1:44125_-n_0000000000) [n:127.0.0.1:44125_     ] o.a.s.c.OverseerTaskProcessor BlockedTasks: []
   [junit4]   2> 1622224 DEBUG (OverseerCollectionConfigSetProcessor-72242789420892164-127.0.0.1:44125_-n_0000000000) [n:127.0.0.1:44125_     ] o.a.s.c.OverseerTaskProcessor CompletedTasks: []
   [junit4]   2> 1622224 INFO  (OverseerCollectionConfigSetProcessor-72242789420892164-127.0.0.1:44125_-n_0000000000) [n:127.0.0.1:44125_     ] o.a.s.c.OverseerTaskProcessor RunningZKTasks: []
   [junit4]   2> 1622225 DEBUG (OverseerStateUpdate-72242789420892164-127.0.0.1:44125_-n_0000000000) [n:127.0.0.1:44125_     ] o.a.s.c.c.ZkStateReader clusterStateSet: legacy [0] interesting [0] watched [0] lazy [2] total [2]
   [junit4]   2> 1622225 DEBUG (zkCallback-18188-thread-1) [     ] o.a.s.c.c.ZkStateReader Updated live nodes from ZooKeeper... [127.0.0.1:44125_] -> [127.0.0.1:44125_]
   [junit4]   2> 1622225 DEBUG (OverseerAutoScalingTriggerThread-72242789420892164-127.0.0.1:44125_-n_0000000000) [     ] o.a.s.c.c.SolrZkClient makePath: /autoscaling/events/.scheduled_maintenance
   [junit4]   2> 1622226 INFO  (TEST-ShardSplitTest.testSplitAfterFailedSplit-seed#[635D9E93FFB1D67F]) [n:127.0.0.1:44125_     ] o.a.s.c.ZkController non-data nodes now []
   [junit4]   2> 1622227 DEBUG (OverseerAutoScalingTriggerThread-72242789420892164-127.0.0.1:44125_-n_0000000000) [     ] o.a.s.c.c.SolrZkClient makePath: /autoscaling/events/.auto_add_replicas
   [junit4]   2> 1622229 INFO  (TEST-ShardSplitTest.testSplitAfterFailedSplit-seed#[635D9E93FFB1D67F]) [n:127.0.0.1:44125_     ] o.a.s.p.PackageLoader /packages.json updated to version -1
   [junit4]   2> 1622229 WARN  (TEST-ShardSplitTest.testSplitAfterFailedSplit-seed#[635D9E93FFB1D67F]) [n:127.0.0.1:44125_     ] o.a.s.c.CoreContainer Not all security plugins configured!  authentication=disabled authorization=disabled.  Solr is only as secure as you make it. Consider configuring authentication/authorization before exposing Solr to users internal or external.  See https://s.apache.org/solrsecurity for more info
   [junit4]   2> 1622254 INFO  (TEST-ShardSplitTest.testSplitAfterFailedSplit-seed#[635D9E93FFB1D67F]) [n:127.0.0.1:44125_     ] o.a.s.h.a.MetricsHistoryHandler No .system collection, keeping metrics history in memory.
   [junit4]   2> 1622278 INFO  (TEST-ShardSplitTest.testSplitAfterFailedSplit-seed#[635D9E93FFB1D67F]) [n:127.0.0.1:44125_     ] o.a.s.m.r.SolrJmxReporter JMX monitoring for 'solr.node' (registry 'solr.node') enabled at server: com.sun.jmx.mbeanserver.JmxMBeanServer@20bff77f
   [junit4]   2> 1622287 INFO  (TEST-ShardSplitTest.testSplitAfterFailedSplit-seed#[635D9E93FFB1D67F]) [n:127.0.0.1:44125_     ] o.a.s.m.r.SolrJmxReporter JMX monitoring for 'solr.jvm' (registry 'solr.jvm') enabled at server: com.sun.jmx.mbeanserver.JmxMBeanServer@20bff77f
   [junit4]   2> 1622287 INFO  (TEST-ShardSplitTest.testSplitAfterFailedSplit-seed#[635D9E93FFB1D67F]) [n:127.0.0.1:44125_     ] o.a.s.m.r.SolrJmxReporter JMX monitoring for 'solr.jetty' (registry 'solr.jetty') enabled at server: com.sun.jmx.mbeanserver.JmxMBeanServer@20bff77f
   [junit4]   2> 1622288 INFO  (TEST-ShardSplitTest.testSplitAfterFailedSplit-seed#[635D9E93FFB1D67F]) [n:127.0.0.1:44125_     ] o.a.s.c.CorePropertiesLocator Found 0 core definitions underneath /home/jenkins/jenkins-slave/workspace/Lucene/Lucene-Solr-Tests-8.11/solr/build/solr-core/test/J1/temp/solr.cloud.api.collections.ShardSplitTest_635D9E93FFB1D67F-001/control-001/cores
   [junit4]   2> 1622301 DEBUG (TEST-ShardSplitTest.testSplitAfterFailedSplit-seed#[635D9E93FFB1D67F]) [     ] o.a.s.c.c.SolrZkClient Using default ZkCredentialsProvider
   [junit4]   2> 1622301 INFO  (TEST-ShardSplitTest.testSplitAfterFailedSplit-seed#[635D9E93FFB1D67F]) [     ] o.a.s.c.c.ConnectionManager Waiting for client to connect to ZooKeeper
   [junit4]   2> 1622302 DEBUG (TEST-ShardSplitTest.testSplitAfterFailedSplit-seed#[635D9E93FFB1D67F]-EventThread) [     ] o.a.s.c.c.SolrZkClient Submitting job to respond to event WatchedEvent state:SyncConnected type:None path:null
   [junit4]   2> 1622302 DEBUG (zkConnectionManagerCallback-18206-thread-1) [     ] o.a.s.c.c.ConnectionManager Watcher org.apache.solr.common.cloud.ConnectionManager@436e14e0 name: ZooKeeperConnection Watcher:127.0.0.1:40835/solr got event WatchedEvent state:SyncConnected type:None path:null path: null type: None
   [junit4]   2> 1622302 INFO  (zkConnectionManagerCallback-18206-thread-1) [     ] o.a.s.c.c.ConnectionManager zkClient has connected
   [junit4]   2> 1622302 INFO  (TEST-ShardSplitTest.testSplitAfterFailedSplit-seed#[635D9E93FFB1D67F]) [     ] o.a.s.c.c.ConnectionManager Client is connected to ZooKeeper
   [junit4]   2> 1622302 DEBUG (TEST-ShardSplitTest.testSplitAfterFailedSplit-seed#[635D9E93FFB1D67F]) [     ] o.a.s.c.c.SolrZkClient Using default ZkACLProvider
   [junit4]   2> 1622303 DEBUG (TEST-ShardSplitTest.testSplitAfterFailedSplit-seed#[635D9E93FFB1D67F]) [     ] o.a.s.c.c.ZkStateReader Updating cluster state from ZooKeeper... 
   [junit4]   2> 1622303 DEBUG (TEST-ShardSplitTest.testSplitAfterFailedSplit-seed#[635D9E93FFB1D67F]) [     ] o.a.s.c.c.ZkStateReader Loaded cluster properties: {legacyCloud=true}
   [junit4]   2> 1622303 INFO  (TEST-ShardSplitTest.testSplitAfterFailedSplit-seed#[635D9E93FFB1D67F]) [     ] o.a.s.c.c.ZkStateReader Updated live nodes from ZooKeeper... (0) -> (1)
   [junit4]   2> 1622303 DEBUG (TEST-ShardSplitTest.testSplitAfterFailedSplit-seed#[635D9E93FFB1D67F]) [     ] o.a.s.c.c.ZkStateReader Updated live nodes from ZooKeeper... [] -> [127.0.0.1:44125_]
   [junit4]   2> 1622304 DEBUG (TEST-ShardSplitTest.testSplitAfterFailedSplit-seed#[635D9E93FFB1D67F]) [     ] o.a.s.c.c.ZkStateReader clusterStateSet: legacy [0] interesting [0] watched [0] lazy [2] total [2]
   [junit4]   2> 1622304 DEBUG (TEST-ShardSplitTest.testSplitAfterFailedSplit-seed#[635D9E93FFB1D67F]) [     ] o.a.s.c.c.ZkStateReader$AliasesManager Checking ZK for most up to date Aliases /aliases.json
   [junit4]   2> 1622305 DEBUG (TEST-ShardSplitTest.testSplitAfterFailedSplit-seed#[635D9E93FFB1D67F]) [     ] o.a.s.c.c.ZkStateReader$AliasesManager Aliases: cmp=-1, new definition is: Aliases{collectionAliases={}, collectionAliasProperties={}, zNodeVersion=0}
   [junit4]   2> 1622305 INFO  (TEST-ShardSplitTest.testSplitAfterFailedSplit-seed#[635D9E93FFB1D67F]) [     ] o.a.s.c.s.i.ZkClientClusterStateProvider Cluster at 127.0.0.1:40835/solr ready
   [junit4]   2> 1622306 INFO  (qtp1558585633-30165) [n:127.0.0.1:44125_     ] o.a.s.s.HttpSolrCall HttpSolrCall.init(http://127.0.0.1:44125/admin/collections?action=CREATE&name=control_collection&collection.configName=conf1&createNodeSet=127.0.0.1%3A44125_&numShards=1&nrtReplicas=1&wt=javabin&version=2)
   [junit4]   2> 1622307 DEBUG (TEST-ShardSplitTest.testSplitAfterFailedSplit-seed#[635D9E93FFB1D67F]-EventThread) [     ] o.a.s.c.c.SolrZkClient Submitting job to respond to event WatchedEvent state:SyncConnected type:NodeChildrenChanged path:/overseer/collection-queue-work
   [junit4]   2> 1622308 DEBUG (TEST-ShardSplitTest.testSplitAfterFailedSplit-seed#[635D9E93FFB1D67F]-EventThread) [     ] o.a.s.c.c.SolrZkClient Submitting job to respond to event WatchedEvent state:SyncConnected type:NodeChildrenChanged path:/overseer/collection-queue-work
   [junit4]   2> 1622308 DEBUG (OverseerCollectionConfigSetProcessor-72242789420892164-127.0.0.1:44125_-n_0000000000) [n:127.0.0.1:44125_     ] o.a.s.c.OverseerTaskProcessor Got 1 tasks from work-queue : [[org.apache.solr.cloud.OverseerTaskQueue$QueueEvent@2e684ecf]]
   [junit4]   2> 1622309 DEBUG (OverseerCollectionConfigSetProcessor-72242789420892164-127.0.0.1:44125_-n_0000000000) [n:127.0.0.1:44125_     ] o.a.s.c.OverseerTaskProcessor Marked task [/overseer/collection-queue-work/qn-0000000000] as running
   [junit4]   2> 1622309 DEBUG (OverseerCollectionConfigSetProcessor-72242789420892164-127.0.0.1:44125_-n_0000000000) [n:127.0.0.1:44125_     ] o.a.s.c.OverseerTaskProcessor Overseer Collection Message Handler: Get the message id: /overseer/collection-queue-work/qn-0000000000 message: {
   [junit4]   2>   "name":"control_collection",
   [junit4]   2>   "fromApi":"true",
   [junit4]   2>   "collection.configName":"conf1",
   [junit4]   2>   "numShards":"1",
   [junit4]   2>   "createNodeSet":"127.0.0.1:44125_",
   [junit4]   2>   "nrtReplicas":"1",
   [junit4]   2>   "stateFormat":"2",
   [junit4]   2>   "replicationFactor":"1",
   [junit4]   2>   "operation":"create"}
   [junit4]   2> 1622309 DEBUG (OverseerThreadFactory-18196-thread-1-processing-n:127.0.0.1:44125_) [n:127.0.0.1:44125_     ] o.a.s.c.OverseerTaskProcessor Runner processing /overseer/collection-queue-work/qn-0000000000
   [junit4]   2> 1622309 DEBUG (OverseerThreadFactory-18196-thread-1-processing-n:127.0.0.1:44125_) [n:127.0.0.1:44125_     ] o.a.s.c.a.c.OverseerCollectionMessageHandler OverseerCollectionMessageHandler.processMessage : create , {
   [junit4]   2>   "name":"control_collection",
   [junit4]   2>   "fromApi":"true",
   [junit4]   2>   "collection.configName":"conf1",
   [junit4]   2>   "numShards":"1",
   [junit4]   2>   "createNodeSet":"127.0.0.1:44125_",
   [junit4]   2>   "nrtReplicas":"1",
   [junit4]   2>   "stateFormat":"2",
   [junit4]   2>   "replicationFactor":"1",
   [junit4]   2>   "operation":"create"}
   [junit4]   2> 1622309 DEBUG (OverseerThreadFactory-18196-thread-1-processing-n:127.0.0.1:44125_) [n:127.0.0.1:44125_     ] o.a.s.c.c.ZkStateReader$AliasesManager Checking ZK for most up to date Aliases /aliases.json
   [junit4]   2> 1622309 DEBUG (OverseerCollectionConfigSetProcessor-72242789420892164-127.0.0.1:44125_-n_0000000000) [n:127.0.0.1:44125_     ] o.a.s.c.OverseerTaskProcessor Cleaning up work-queue. #Running tasks: 1 #Completed tasks: 0
   [junit4]   2> 1622309 DEBUG (OverseerCollectionConfigSetProcessor-72242789420892164-127.0.0.1:44125_-n_0000000000) [n:127.0.0.1:44125_     ] o.a.s.c.OverseerTaskProcessor RunningTasks: [/overseer/collection-queue-work/qn-0000000000]
   [junit4]   2> 1622309 DEBUG (OverseerCollectionConfigSetProcessor-72242789420892164-127.0.0.1:44125_-n_0000000000) [n:127.0.0.1:44125_     ] o.a.s.c.OverseerTaskProcessor BlockedTasks: []
   [junit4]   2> 1622309 DEBUG (OverseerCollectionConfigSetProcessor-72242789420892164-127.0.0.1:44125_-n_0000000000) [n:127.0.0.1:44125_     ] o.a.s.c.OverseerTaskProcessor CompletedTasks: []
   [junit4]   2> 1622309 INFO  (OverseerCollectionConfigSetProcessor-72242789420892164-127.0.0.1:44125_-n_0000000000) [n:127.0.0.1:44125_     ] o.a.s.c.OverseerTaskProcessor RunningZKTasks: [/overseer/collection-queue-work/qn-0000000000]
   [junit4]   2> 1622309 DEBUG (OverseerThreadFactory-18196-thread-1-processing-n:127.0.0.1:44125_) [n:127.0.0.1:44125_     ] o.a.s.c.c.ZkStateReader$AliasesManager Aliases: cmp=0, not overwriting ZK version.
   [junit4]   2> 1622310 INFO  (OverseerThreadFactory-18196-thread-1-processing-n:127.0.0.1:44125_) [n:127.0.0.1:44125_     ] o.a.s.c.a.c.CreateCollectionCmd Create collection control_collection
   [junit4]   2> 1622310 DEBUG (OverseerThreadFactory-18196-thread-1-processing-n:127.0.0.1:44125_) [n:127.0.0.1:44125_     ] o.a.s.c.a.c.OverseerCollectionMessageHandler creating collections conf node /collections/control_collection 
   [junit4]   2> 1622311 DEBUG (OverseerThreadFactory-18196-thread-1-processing-n:127.0.0.1:44125_) [n:127.0.0.1:44125_     ] o.a.s.c.a.c.CreateCollectionCmd Check for collection zkNode: control_collection
   [junit4]   2> 1622311 DEBUG (OverseerThreadFactory-18196-thread-1-processing-n:127.0.0.1:44125_) [n:127.0.0.1:44125_     ] o.a.s.c.a.c.CreateCollectionCmd Collection zkNode exists
   [junit4]   2> 1622313 DEBUG (TEST-ShardSplitTest.testSplitAfterFailedSplit-seed#[635D9E93FFB1D67F]-EventThread) [     ] o.a.s.c.c.SolrZkClient Submitting job to respond to event WatchedEvent state:SyncConnected type:NodeChildrenChanged path:/overseer/queue
   [junit4]   2> 1622313 DEBUG (OverseerStateUpdate-72242789420892164-127.0.0.1:44125_-n_0000000000) [n:127.0.0.1:44125_     ] o.a.s.c.Overseer processMessage: queueSize: 1, message = {
   [junit4]   2>   "name":"control_collection",
   [junit4]   2>   "fromApi":"true",
   [junit4]   2>   "collection.configName":"conf1",
   [junit4]   2>   "numShards":"1",
   [junit4]   2>   "createNodeSet":"127.0.0.1:44125_",
   [junit4]   2>   "nrtReplicas":"1",
   [junit4]   2>   "stateFormat":"2",
   [junit4]   2>   "replicationFactor":"1",
   [junit4]   2>   "operation":"create"} current state version: 0
   [junit4]   2> 1622313 DEBUG (OverseerStateUpdate-72242789420892164-127.0.0.1:44125_-n_0000000000) [n:127.0.0.1:44125_     ] o.a.s.c.o.ClusterStateMutator building a new cName: control_collection
   [junit4]   2> 1622314 DEBUG (OverseerStateUpdate-72242789420892164-127.0.0.1:44125_-n_0000000000) [n:127.0.0.1:44125_     ] o.a.s.c.o.ZkStateWriter going to create_collection /collections/control_collection/state.json
   [junit4]   2> 1622315 DEBUG (TEST-ShardSplitTest.testSplitAfterFailedSplit-seed#[635D9E93FFB1D67F]-EventThread) [     ] o.a.s.c.c.SolrZkClient Submitting job to respond to event WatchedEvent state:SyncConnected type:NodeChildrenChanged path:/overseer/queue
   [junit4]   2> 1622415 DEBUG (OverseerThreadFactory-18196-thread-1-processing-n:127.0.0.1:44125_) [n:127.0.0.1:44125_     ] o.a.s.c.a.c.CreateCollectionCmd Creating SolrCores for new collection control_collection, shardNames [shard1] , message : {
   [junit4]   2>   "name":"control_collection",
   [junit4]   2>   "fromApi":"true",
   [junit4]   2>   "collection.configName":"conf1",
   [junit4]   2>   "numShards":"1",
   [junit4]   2>   "createNodeSet":"127.0.0.1:44125_",
   [junit4]   2>   "nrtReplicas":"1",
   [junit4]   2>   "stateFormat":"2",
   [junit4]   2>   "replicationFactor":"1",
   [junit4]   2>   "operation":"create"}
   [junit4]   2> 1622417 DEBUG (OverseerThreadFactory-18196-thread-1-processing-n:127.0.0.1:44125_) [n:127.0.0.1:44125_     ] o.a.s.c.a.c.CreateCollectionCmd Creating core control_collection_shard1_replica_n1 as part of shard shard1 of collection control_collection on 127.0.0.1:44125_
   [junit4]   2> 1622422 INFO  (qtp1558585633-30167) [n:127.0.0.1:44125_     ] o.a.s.s.HttpSolrCall HttpSolrCall.init(http://127.0.0.1:44125/admin/cores?null)
   [junit4]   2> 1622422 INFO  (qtp1558585633-30167) [n:127.0.0.1:44125_    x:control_collection_shard1_replica_n1 ] o.a.s.h.a.CoreAdminOperation core create command qt=/admin/cores&collection.configName=conf1&newCollection=true&name=control_collection_shard1_replica_n1&action=CREATE&numShards=1&collection=control_collection&shard=shard1&wt=javabin&version=2&replicaType=NRT
   [junit4]   2> 1622423 INFO  (qtp1558585633-30167) [n:127.0.0.1:44125_    x:control_collection_shard1_replica_n1 ] o.a.s.c.TransientSolrCoreCacheDefault Allocating transient core cache for max 4 cores with initial capacity of 4
   [junit4]   2> 1622425 DEBUG (TEST-ShardSplitTest.testSplitAfterFailedSplit-seed#[635D9E93FFB1D67F]-EventThread) [     ] o.a.s.c.c.SolrZkClient Submitting job to respond to event WatchedEvent state:SyncConnected type:NodeChildrenChanged path:/overseer/queue
   [junit4]   2> 1622426 DEBUG (OverseerStateUpdate-72242789420892164-127.0.0.1:44125_-n_0000000000) [n:127.0.0.1:44125_     ] o.a.s.c.Overseer processMessage: queueSize: 1, message = {
   [junit4]   2>   "core":"control_collection_shard1_replica_n1",
   [junit4]   2>   "roles":null,
   [junit4]   2>   "node_name":"127.0.0.1:44125_",
   [junit4]   2>   "base_url":"http://127.0.0.1:44125",
   [junit4]   2>   "numShards":"1",
   [junit4]   2>   "state":"down",
   [junit4]   2>   "shard":"shard1",
   [junit4]   2>   "collection":"control_collection",
   [junit4]   2>   "type":"NRT",
   [junit4]   2>   "operation":"state"} current state version: 0
   [junit4]   2> 1622426 DEBUG (OverseerStateUpdate-72242789420892164-127.0.0.1:44125_-n_0000000000) [n:127.0.0.1:44125_     ] o.a.s.c.o.ReplicaMutator Update state numShards=1 message={
   [junit4]   2>   "core":"control_collection_shard1_replica_n1",
   [junit4]   2>   "roles":null,
   [junit4]   2>   "node_name":"127.0.0.1:44125_",
   [junit4]   2>   "base_url":"http://127.0.0.1:44125",
   [junit4]   2>   "numShards":"1",
   [junit4]   2>   "state":"down",
   [junit4]   2>   "shard":"shard1",
   [junit4]   2>   "collection":"control_collection",
   [junit4]   2>   "type":"NRT",
   [junit4]   2>   "operation":"state"}
   [junit4]   2> 1622427 DEBUG (OverseerStateUpdate-72242789420892164-127.0.0.1:44125_-n_0000000000) [n:127.0.0.1:44125_     ] o.a.s.c.o.ReplicaMutator Will update state for replica: core_node2:{
   [junit4]   2>   "core":"control_collection_shard1_replica_n1",
   [junit4]   2>   "node_name":"127.0.0.1:44125_",
   [junit4]   2>   "base_url":"http://127.0.0.1:44125",
   [junit4]   2>   "state":"down",
   [junit4]   2>   "type":"NRT"}
   [junit4]   2> 1622428 DEBUG (OverseerStateUpdate-72242789420892164-127.0.0.1:44125_-n_0000000000) [n:127.0.0.1:44125_     ] o.a.s.c.o.ReplicaMutator Collection is now: DocCollection(control_collection//collections/control_collection/state.json/0 )={
   [junit4]   2>   "pullReplicas":"0",
   [junit4]   2>   "replicationFactor":"1",
   [junit4]   2>   "router":{"name":"compositeId"},
   [junit4]   2>   "maxShardsPerNode":"1",
   [junit4]   2>   "autoAddReplicas":"false",
   [junit4]   2>   "nrtReplicas":"1",
   [junit4]   2>   "tlogReplicas":"0",
   [junit4]   2>   "shards":{"shard1":{
   [junit4]   2>       "range":"80000000-7fffffff",
   [junit4]   2>       "state":"active",
   [junit4]   2>       "replicas":{"core_node2":{
   [junit4]   2>           "core":"control_collection_shard1_replica_n1",
   [junit4]   2>           "node_name":"127.0.0.1:44125_",
   [junit4]   2>           "base_url":"http://127.0.0.1:44125",
   [junit4]   2>           "state":"down",
   [junit4]   2>           "type":"NRT"}}}}}
   [junit4]   2> 1622528 DEBUG (OverseerStateUpdate-72242789420892164-127.0.0.1:44125_-n_0000000000) [n:127.0.0.1:44125_     ] o.a.s.c.o.ZkStateWriter going to update_collection /collections/control_collection/state.json version: 0
   [junit4]   2> 1622529 DEBUG (TEST-ShardSplitTest.testSplitAfterFailedSplit-seed#[635D9E93FFB1D67F]-EventThread) [     ] o.a.s.c.c.SolrZkClient Submitting job to respond to event WatchedEvent state:SyncConnected type:NodeChildrenChanged path:/overseer/queue
   [junit4]   2> 1623428 DEBUG (qtp1558585633-30167) [n:127.0.0.1:44125_ c:control_collection s:shard1  x:control_collection_shard1_replica_n1 ] o.a.s.c.c.ZkStateReader Loading collection config from: [/collections/control_collection]
   [junit4]   2> 1623436 INFO  (qtp1558585633-30167) [n:127.0.0.1:44125_ c:control_collection s:shard1  x:control_collection_shard1_replica_n1 ] o.a.s.c.SolrConfig Using Lucene MatchVersion: 8.11.3
   [junit4]   2> 1623436 WARN  (qtp1558585633-30167) [n:127.0.0.1:44125_ c:control_collection s:shard1  x:control_collection_shard1_replica_n1 ] o.a.s.c.SolrConfig solrconfig.xml: <jmx> is no longer supported, use solr.xml:/metrics/reporter section instead
   [junit4]   2> 1623441 INFO  (qtp1558585633-30167) [n:127.0.0.1:44125_ c:control_collection s:shard1  x:control_collection_shard1_replica_n1 ] o.a.s.s.IndexSchema Schema name=test
   [junit4]   2> 1623445 INFO  (qtp1558585633-30167) [n:127.0.0.1:44125_ c:control_collection s:shard1  x:control_collection_shard1_replica_n1 ] o.a.s.s.IndexSchema Loaded schema test/1.6 with uniqueid field id
   [junit4]   2> 1623468 INFO  (qtp1558585633-30167) [n:127.0.0.1:44125_ c:control_collection s:shard1  x:control_collection_shard1_replica_n1 ] o.a.s.c.CoreContainer Creating SolrCore 'control_collection_shard1_replica_n1' using configuration from configset conf1, trusted=true
   [junit4]   2> 1623468 INFO  (qtp1558585633-30167) [n:127.0.0.1:44125_ c:control_collection s:shard1  x:control_collection_shard1_replica_n1 ] o.a.s.m.r.SolrJmxReporter JMX monitoring for 'solr.core.control_collection.shard1.replica_n1' (registry 'solr.core.control_collection.shard1.replica_n1') enabled at server: com.sun.jmx.mbeanserver.JmxMBeanServer@20bff77f
   [junit4]   2> 1623469 INFO  (qtp1558585633-30167) [n:127.0.0.1:44125_ c:control_collection s:shard1  x:control_collection_shard1_replica_n1 ] o.a.s.c.SolrCore [[control_collection_shard1_replica_n1] ] Opening new SolrCore at [/home/jenkins/jenkins-slave/workspace/Lucene/Lucene-Solr-Tests-8.11/solr/build/solr-core/test/J1/temp/solr.cloud.api.collections.ShardSplitTest_635D9E93FFB1D67F-001/control-001/cores/control_collection_shard1_replica_n1], dataDir=[/home/jenkins/jenkins-slave/workspace/Lucene/Lucene-Solr-Tests-8.11/solr/build/solr-core/test/J1/temp/solr.cloud.api.collections.ShardSplitTest_635D9E93FFB1D67F-001/control-001/cores/control_collection_shard1_replica_n1/data/]
   [junit4]   2> 1623471 INFO  (qtp1558585633-30167) [n:127.0.0.1:44125_ c:control_collection s:shard1  x:control_collection_shard1_replica_n1 ] o.a.s.u.RandomMergePolicy RandomMergePolicy wrapping class org.apache.lucene.index.TieredMergePolicy: [TieredMergePolicy: maxMergeAtOnce=13, maxMergeAtOnceExplicit=16, maxMergedSegmentMB=24.6142578125, floorSegmentMB=1.03125, forceMergeDeletesPctAllowed=23.520535398139018, segmentsPerTier=17.0, maxCFSSegmentSizeMB=8.796093022207999E12, noCFSRatio=0.8808258878059431, deletesPctAllowed=45.763700410635295
   [junit4]   2> 1623479 WARN  (qtp1558585633-30167) [n:127.0.0.1:44125_ c:control_collection s:shard1  x:control_collection_shard1_replica_n1 ] o.a.s.c.RequestHandlers INVALID paramSet a in requestHandler {type = requestHandler,name = /dump,class = DumpRequestHandler,attributes = {initParams=a, name=/dump, class=DumpRequestHandler},args = {defaults={a=A,b=B}}}
   [junit4]   2> 1623545 INFO  (qtp1558585633-30167) [n:127.0.0.1:44125_ c:control_collection s:shard1  x:control_collection_shard1_replica_n1 ] o.a.s.u.UpdateHandler Using UpdateLog implementation: org.apache.solr.update.UpdateLog
   [junit4]   2> 1623545 INFO  (qtp1558585633-30167) [n:127.0.0.1:44125_ c:control_collection s:shard1  x:control_collection_shard1_replica_n1 ] o.a.s.u.UpdateLog Initializing UpdateLog: dataDir= defaultSyncLevel=FLUSH numRecordsToKeep=100 maxNumLogsToKeep=10 numVersionBuckets=65536
   [junit4]   2> 1623547 INFO  (qtp1558585633-30167) [n:127.0.0.1:44125_ c:control_collection s:shard1  x:control_collection_shard1_replica_n1 ] o.a.s.u.CommitTracker Hard AutoCommit: disabled
   [junit4]   2> 1623547 INFO  (qtp1558585633-30167) [n:127.0.0.1:44125_ c:control_collection s:shard1  x:control_collection_shard1_replica_n1 ] o.a.s.u.CommitTracker Soft AutoCommit: disabled
   [junit4]   2> 1623547 INFO  (qtp1558585633-30167) [n:127.0.0.1:44125_ c:control_collection s:shard1  x:control_collection_shard1_replica_n1 ] o.a.s.u.RandomMergePolicy RandomMergePolicy wrapping class org.apache.lucene.index.LogByteSizeMergePolicy: [LogByteSizeMergePolicy: minMergeSize=1677721, mergeFactor=17, maxMergeSize=2147483648, maxMergeSizeForForcedMerge=9223372036854775807, calibrateSizeByDeletes=false, maxMergeDocs=2147483647, maxCFSSegmentSizeMB=8.796093022207999E12, noCFSRatio=0.4598755228831978]
   [junit4]   2> 1623551 DEBUG (qtp1558585633-30167) [n:127.0.0.1:44125_ c:control_collection s:shard1  x:control_collection_shard1_replica_n1 ] o.a.s.c.c.ZkStateReader Loading collection config from: [/collections/control_collection]
   [junit4]   2> 1623553 INFO  (qtp1558585633-30167) [n:127.0.0.1:44125_ c:control_collection s:shard1  x:control_collection_shard1_replica_n1 ] o.a.s.r.ManagedResourceStorage Configured ZooKeeperStorageIO with znodeBase: /configs/conf1
   [junit4]   2> 1623555 INFO  (qtp1558585633-30167) [n:127.0.0.1:44125_ c:control_collection s:shard1  x:control_collection_shard1_replica_n1 ] o.a.s.r.ManagedResourceStorage Loaded null at path _rest_managed.json using ZooKeeperStorageIO:path=/configs/conf1
   [junit4]   2> 1623555 INFO  (qtp1558585633-30167) [n:127.0.0.1:44125_ c:control_collection s:shard1  x:control_collection_shard1_replica_n1 ] o.a.s.h.ReplicationHandler Commits will be reserved for 10000 ms
   [junit4]   2> 1623555 INFO  (qtp1558585633-30167) [n:127.0.0.1:44125_ c:control_collection s:shard1  x:control_collection_shard1_replica_n1 ] o.a.s.u.UpdateLog Could not find max version in index or recent updates, using new clock 1787655857838751744
   [junit4]   2> 1623558 DEBUG (qtp1558585633-30167) [n:127.0.0.1:44125_ c:control_collection s:shard1  x:control_collection_shard1_replica_n1 ] o.a.s.c.c.ZkStateReader Waiting up to 60000ms for state org.apache.solr.cloud.ZkController$$Lambda$561/363730435@1b6d2b79
   [junit4]   2> 1623559 INFO  (searcherExecutor-18208-thread-1-processing-n:127.0.0.1:44125_ x:control_collection_shard1_replica_n1 c:control_collection s:shard1) [n:127.0.0.1:44125_ c:control_collection s:shard1  x:control_collection_shard1_replica_n1 ] o.a.s.c.SolrCore [control_collection_shard1_replica_n1]  Registered new searcher autowarm time: 0 ms
   [junit4]   2> 1623559 DEBUG (qtp1558585633-30167) [n:127.0.0.1:44125_ c:control_collection s:shard1  x:control_collection_shard1_replica_n1 ] o.a.s.c.c.ZkStateReader Found org.apache.solr.cloud.ZkController$$Lambda$561/363730435@1b6d2b79 directly in clusterState
   [junit4]   2> 1623560 DEBUG (qtp1558585633-30167) [n:127.0.0.1:44125_ c:control_collection s:shard1  x:control_collection_shard1_replica_n1 ] o.a.s.c.c.SolrZkClient makePath: /collections/control_collection/terms/shard1
   [junit4]   2> 1623564 DEBUG (TEST-ShardSplitTest.testSplitAfterFailedSplit-seed#[635D9E93FFB1D67F]-EventThread) [     ] o.a.s.c.c.SolrZkClient Submitting job to respond to event WatchedEvent state:SyncConnected type:NodeDataChanged path:/collections/control_collection/terms/shard1
   [junit4]   2> 1623564 INFO  (qtp1558585633-30167) [n:127.0.0.1:44125_ c:control_collection s:shard1  x:control_collection_shard1_replica_n1 ] o.a.s.c.ZkShardTerms Successful update of terms at /collections/control_collection/terms/shard1 to Terms{values={core_node2=0}, version=0}
   [junit4]   2> 1623564 INFO  (qtp1558585633-30167) [n:127.0.0.1:44125_ c:control_collection s:shard1  x:control_collection_shard1_replica_n1 ] o.a.s.c.ShardLeaderElectionContextBase make sure parent is created /collections/control_collection/leaders/shard1
   [junit4]   2> 1623565 DEBUG (qtp1558585633-30167) [n:127.0.0.1:44125_ c:control_collection s:shard1  x:control_collection_shard1_replica_n1 ] o.a.s.c.c.SolrZkClient makePath: /collections/control_collection/leaders/shard1
   [junit4]   2> 1623566 DEBUG (qtp1558585633-30167) [n:127.0.0.1:44125_ c:control_collection s:shard1  x:control_collection_shard1_replica_n1 ] o.a.s.c.c.SolrZkClient makePath: /collections/control_collection/leader_elect/shard1/election
   [junit4]   2> 1623568 INFO  (qtp1558585633-30167) [n:127.0.0.1:44125_ c:control_collection s:shard1  x:control_collection_shard1_replica_n1 ] o.a.s.c.ShardLeaderElectionContext Enough replicas found to continue.
   [junit4]   2> 1623568 INFO  (qtp1558585633-30167) [n:127.0.0.1:44125_ c:control_collection s:shard1  x:control_collection_shard1_replica_n1 ] o.a.s.c.ShardLeaderElectionContext I may be the new leader - try and sync
   [junit4]   2> 1623568 INFO  (qtp1558585633-30167) [n:127.0.0.1:44125_ c:control_collection s:shard1  x:control_collection_shard1_replica_n1 ] o.a.s.c.SyncStrategy Sync replicas to http://127.0.0.1:44125/control_collection_shard1_replica_n1/
   [junit4]   2> 1623568 INFO  (qtp1558585633-30167) [n:127.0.0.1:44125_ c:control_collection s:shard1  x:control_collection_shard1_replica_n1 ] o.a.s.c.SyncStrategy Sync Success - now sync replicas to me
   [junit4]   2> 1623569 INFO  (qtp1558585633-30167) [n:127.0.0.1:44125_ c:control_collection s:shard1  x:control_collection_shard1_replica_n1 ] o.a.s.c.SyncStrategy http://127.0.0.1:44125/control_collection_shard1_replica_n1/ has no replicas
   [junit4]   2> 1623569 INFO  (qtp1558585633-30167) [n:127.0.0.1:44125_ c:control_collection s:shard1  x:control_collection_shard1_replica_n1 ] o.a.s.c.ShardLeaderElectionContextBase Creating leader registration node /collections/control_collection/leaders/shard1/leader after winning as /collections/control_collection/leader_elect/shard1/election/72242789420892164-core_node2-n_0000000000
   [junit4]   2> 1623571 DEBUG (TEST-ShardSplitTest.testSplitAfterFailedSplit-seed#[635D9E93FFB1D67F]-EventThread) [     ] o.a.s.c.c.SolrZkClient Submitting job to respond to event WatchedEvent state:SyncConnected type:NodeChildrenChanged path:/overseer/queue
   [junit4]   2> 1623571 INFO  (qtp1558585633-30167) [n:127.0.0.1:44125_ c:control_collection s:shard1  x:control_collection_shard1_replica_n1 ] o.a.s.c.ShardLeaderElectionContext I am the new leader: http://127.0.0.1:44125/control_collection_shard1_replica_n1/ shard1
   [junit4]   2> 1623572 DEBUG (OverseerStateUpdate-72242789420892164-127.0.0.1:44125_-n_0000000000) [n:127.0.0.1:44125_     ] o.a.s.c.Overseer processMessage: queueSize: 1, message = {
   [junit4]   2>   "operation":"leader",
   [junit4]   2>   "shard":"shard1",
   [junit4]   2>   "collection":"control_collection",
   [junit4]   2>   "node_name":"127.0.0.1:44125_",
   [junit4]   2>   "base_url":"http://127.0.0.1:44125",
   [junit4]   2>   "core":"control_collection_shard1_replica_n1",
   [junit4]   2>   "state":"active"} current state version: 0
   [junit4]   2> 1623572 DEBUG (qtp1558585633-30167) [n:127.0.0.1:44125_ c:control_collection s:shard1  x:control_collection_shard1_replica_n1 ] o.a.s.c.c.ZkStateReader already watching , added to stateWatchers
   [junit4]   2> 1623573 DEBUG (qtp1558585633-30167) [n:127.0.0.1:44125_ c:control_collection s:shard1  x:control_collection_shard1_replica_n1 ] o.a.s.c.c.ZkStateReader Add data for [control_collection] ver [1]
   [junit4]   2> 1623573 DEBUG (qtp1558585633-30167) [n:127.0.0.1:44125_ c:control_collection s:shard1  x:control_collection_shard1_replica_n1 ] o.a.s.c.c.ZkStateReader clusterStateSet: legacy [0] interesting [1] watched [1] lazy [2] total [2]
   [junit4]   2> 1623573 DEBUG (qtp1558585633-30167) [n:127.0.0.1:44125_ c:control_collection s:shard1  x:control_collection_shard1_replica_n1 ] o.a.s.c.c.ZkStateReader updated per-replica states changed for: control_collection, ver: 0 , new vals: []
   [junit4]   2> 1623573 DEBUG (watches-18190-thread-1-processing-n:127.0.0.1:44125_ x:control_collection_shard1_replica_n1 c:control_collection s:shard1) [n:127.0.0.1:44125_ c:control_collection s:shard1  x:control_collection_shard1_replica_n1 ] o.a.s.c.c.ZkStateReader  CollectionStatePredicate failed for control_collection, cversion : -1
   [junit4]   2> 1623573 DEBUG (qtp1558585633-30167) [n:127.0.0.1:44125_ c:control_collection s:shard1  x:control_collection_shard1_replica_n1 ] o.a.s.c.c.ZkStateReader clusterStateSet: legacy [0] interesting [1] watched [1] lazy [2] total [2]
   [junit4]   2> 1623573 DEBUG (qtp1558585633-30167) [n:127.0.0.1:44125_ c:control_collection s:shard1  x:control_collection_shard1_replica_n1 ] o.a.s.c.c.ZkStateReader  CollectionStatePredicate failed for control_collection, cversion : -1
   [junit4]   2> 1623573 DEBUG (qtp1558585633-30167) [n:127.0.0.1:44125_ c:control_collection s:shard1  x:control_collection_shard1_replica_n1 ] o.a.s.c.c.ZkStateReader  CollectionStatePredicate failed for control_collection, cversion : -1
   [junit4]   2> 1623573 DEBUG (watches-18190-thread-1-processing-n:127.

[...truncated too long message...]

doop-hdfs-3.2.4-tests.jar!/webapps/static,STOPPED}
   [junit4]   2> 2300948 WARN  (BP-1237962547-127.0.0.1-1704842100491 heartbeating to localhost/127.0.0.1:35951) [     ] o.a.h.h.s.d.DataNode Ending block pool service for: Block pool BP-1237962547-127.0.0.1-1704842100491 (Datanode Uuid ea61064b-776e-4d7c-adbb-7a04fdbd558a) service to localhost/127.0.0.1:35951
   [junit4]   2> 2300972 INFO  (Listener at localhost/33053) [     ] o.e.j.s.h.ContextHandler Stopped o.e.j.w.WebAppContext@3a78f9ad{hdfs,/,null,STOPPED}{jar:file:/home/jenkins/.ivy2/cache/org.apache.hadoop/hadoop-hdfs/tests/hadoop-hdfs-3.2.4-tests.jar!/webapps/hdfs}
   [junit4]   2> 2300972 INFO  (Listener at localhost/33053) [     ] o.e.j.s.AbstractConnector Stopped ServerConnector@3801e569{HTTP/1.1, (http/1.1)}{localhost:0}
   [junit4]   2> 2300972 INFO  (Listener at localhost/33053) [     ] o.e.j.s.session node0 Stopped scavenging
   [junit4]   2> 2300972 INFO  (Listener at localhost/33053) [     ] o.e.j.s.h.ContextHandler Stopped o.e.j.s.ServletContextHandler@5ad5c9ad{static,/static,jar:file:/home/jenkins/.ivy2/cache/org.apache.hadoop/hadoop-hdfs/tests/hadoop-hdfs-3.2.4-tests.jar!/webapps/static,STOPPED}
   [junit4]   2> 2301030 INFO  (Listener at localhost/33053) [     ] o.a.s.u.ErrorLogMuter Closing ErrorLogMuter-regex-483 after mutting 0 log messages
   [junit4]   2> 2301030 INFO  (Listener at localhost/33053) [     ] o.a.s.u.ErrorLogMuter Creating ErrorLogMuter-regex-484 for ERROR logs matching regex: ignore_exception
   [junit4]   2> 2301032 INFO  (Listener at localhost/33053) [     ] o.a.s.SolrTestCaseJ4 ------------------------------------------------------- Done waiting for tracked resources to be released
   [junit4]   2> Jan 09, 2024 11:15:55 PM com.carrotsearch.randomizedtesting.ThreadLeakControl checkThreadLeaks
   [junit4]   2> WARNING: Will linger awaiting termination of 33 leaked thread(s).
   [junit4]   2> Jan 09, 2024 11:16:05 PM com.carrotsearch.randomizedtesting.ThreadLeakControl checkThreadLeaks
   [junit4]   2> SEVERE: 1 thread leaked from SUITE scope at org.apache.solr.search.TestRecoveryHdfs: 
   [junit4]   2>    1) Thread[id=39031, name=Command processor, state=WAITING, group=TGRP-TestRecoveryHdfs]
   [junit4]   2>         at sun.misc.Unsafe.park(Native Method)
   [junit4]   2>         at java.util.concurrent.locks.LockSupport.park(LockSupport.java:175)
   [junit4]   2>         at java.util.concurrent.locks.AbstractQueuedSynchronizer$ConditionObject.await(AbstractQueuedSynchronizer.java:2039)
   [junit4]   2>         at java.util.concurrent.LinkedBlockingQueue.take(LinkedBlockingQueue.java:442)
   [junit4]   2>         at org.apache.hadoop.hdfs.server.datanode.BPServiceActor$CommandProcessingThread.processQueue(BPServiceActor.java:1291)
   [junit4]   2>         at org.apache.hadoop.hdfs.server.datanode.BPServiceActor$CommandProcessingThread.run(BPServiceActor.java:1275)
   [junit4]   2> Jan 09, 2024 11:16:05 PM com.carrotsearch.randomizedtesting.ThreadLeakControl tryToInterruptAll
   [junit4]   2> INFO: Starting to interrupt leaked threads:
   [junit4]   2>    1) Thread[id=39031, name=Command processor, state=WAITING, group=TGRP-TestRecoveryHdfs]
   [junit4]   2> 2311068 ERROR (Command processor) [     ] o.a.h.h.s.d.DataNode Command processor encountered interrupt and exit.
   [junit4]   2> 2311074 WARN  (Command processor) [     ] o.a.h.h.s.d.DataNode Ending command processor service for: Thread[Command processor,5,TGRP-TestRecoveryHdfs]
   [junit4]   2> Jan 09, 2024 11:16:05 PM com.carrotsearch.randomizedtesting.ThreadLeakControl tryToInterruptAll
   [junit4]   2> INFO: All leaked threads terminated.
   [junit4]   2> NOTE: test params are: codec=Lucene87, sim=Asserting(RandomSimilarity(queryNorm=false): {}), locale=es-MX, timezone=America/Lower_Princes
   [junit4]   2> NOTE: Linux 5.4.0-169-generic amd64/Temurin 1.8.0_362 (64-bit)/cpus=4,threads=2,free=269546944,total=527433728
   [junit4]   2> NOTE: All tests run in this JVM: [DeleteLastCustomShardedReplicaTest, TestSolrFieldCacheBean, AddReplicaTest, TestQuerySenderNoQuery, TestInitQParser, PolyFieldTest, ChangedSchemaMergeTest, SolrShardReporterTest, TestSizeLimitedDistributedMap, TestUnifiedSolrHighlighterWithoutStoredId, TestCoreContainer, DirectUpdateHandlerTest, ReplaceNodeNoTargetTest, FullHLLTest, CollectionsAPIDistributedZkTest, TestMaxScoreQueryParser, TestCloudRecovery2, TestMinMaxOnMultiValuedField, HttpPartitionWithTlogReplicasTest, TestSearchPerf, PhrasesIdentificationComponentTest, TestManagedSynonymGraphFilterFactory, TestSolrCLIRunExample, TriggerIntegrationTest, SignificantTermsQParserPluginTest, URLClassifyProcessorTest, RegexBytesRefFilterTest, DocumentAnalysisRequestHandlerTest, AddSchemaFieldsUpdateProcessorFactoryTest, SolrPluginUtilsTest, TestNumericRangeQuery32, DistributedFacetPivotWhiteBoxTest, FieldMutatingUpdateProcessorTest, TestManagedSchemaThreadSafety, ShardBackupIdTest, TestDistributedGrouping, DateMathParserTest, TestBadConfig, TestDynamicFieldNamesIndexCorrectly, OverseerTaskQueueTest, SaslZkACLProviderTest, ComputePlanActionTest, TestDocTermOrdsUninvertLimit, TestLegacyFieldReuse, TestSimPolicyCloud, RootFieldTest, BasicDistributedZkTest, SolrIndexMetricsTest, TlogReplayBufferedWhileIndexingTest, TestCollectionAPIs, EnumFieldTest, TestExportWriter, SpellCheckCollatorTest, TestDeprecatedFilters, DebugComponentTest, IndexSizeEstimatorTest, ZkShardTermsTest, ClassificationUpdateProcessorFactoryTest, AutoscalingHistoryHandlerTest, HdfsTlogReplayBufferedWhileIndexingTest, TestNoOpRegenerator, TestNamedUpdateProcessors, ConjunctionSolrSpellCheckerTest, BackupRestoreApiErrorConditionsTest, OverseerRolesTest, TestUtils, TestCollectionsAPIViaSolrCloudCluster, TestAuthorizationFramework, TestDeleteCollectionOnDownNodes, BJQParserTest, TestRawTransformer, SecurityConfHandlerTest, SplitHandlerTest, TestXmlQParserPlugin, XMLAtomicUpdateMultivalueTest, ChaosMonkeySafeLeaderTest, TestUtilizeNode, TestSimDistribStateManager, XmlInterpolationTest, TestCloudJSONFacetJoinDomain, MultiSolrCloudTestCaseTest, CursorPagingTest, StatsComponentTest, CachingDirectoryFactoryTest, IndexSizeTriggerMixedBoundsTest, ImplicitSnitchTest, TestStreamBody, TestStandardQParsers, SolrMetricManagerTest, TestSnapshotCloudManager, MissingSegmentRecoveryTest, CollectionPropsTest, V2StandaloneTest, ConnectionManagerTest, BufferStoreTest, CloudExitableDirectoryReaderTest, TestJsonRequest, TestSimGenericDistributedQueue, ForceLeaderWithTlogReplicasTest, TestPrepRecovery, MBeansHandlerTest, TestComplexPhraseLeadingWildcard, TestSchemaManager, AlternateDirectoryTest, TestZkAclsWithHadoopAuth, OutOfBoxZkACLAndCredentialsProvidersTest, ManagedSchemaDiffTest, OrderedExecutorTest, TestConfigOverlay, TestHighFrequencyDictionaryFactory, TestBulkSchemaAPI, JvmMetricsTest, TestExactStatsCache, TestIncrementalCoreBackup, BadComponentTest, TestBulkSchemaConcurrent, TestRequestForwarding, SOLR749Test, ResponseLogComponentTest, DistribCursorPagingTest, LeaderFailoverAfterPartitionTest, OverriddenZkACLAndCredentialsProvidersTest, OverseerCollectionConfigSetProcessorTest, OverseerModifyCollectionTest, RecoveryAfterSoftCommitTest, ShardTermsTest, SharedFSAutoReplicaFailoverTest, SliceStateTest, SolrCLIZkUtilsTest, SolrXmlInZkTest, TestCloudPhrasesIdentificationComponent, TestCloudPseudoReturnFields, TestCloudSearcherWarming, TestRandomFlRTGCloud, TestStressLiveNodes, AutoAddReplicasPlanActionTest, AutoScalingHandlerTest, HdfsAutoAddReplicasIntegrationTest, HttpTriggerListenerTest, IndexSizeTriggerTest, MetricTriggerIntegrationTest, NodeAddedTriggerIntegrationTest, NodeLostTriggerIntegrationTest, NodeLostTriggerTest, TestSimComputePlanAction, TestSimLargeCluster, TestImplicitCoreProperties, TestInfoStreamLogging, TestInitParams, TestJmxIntegration, TestMergePolicyConfig, TestSolrConfigHandler, TestSolrCoreSnapshots, FieldAnalysisRequestHandlerTest, JsonLoaderTest, MoreLikeThisHandlerTest, RequestLoggingTest, SearchHandlerTest, TestBlobHandler, TestHdfsBackupRestoreCore, TestReplicationHandler, TermVectorComponentTest, TermsComponentTest, TestExpandComponent, JavabinLoaderTest, SQLWithAuthzEnabledTest, TestSlowCompositeReaderWrapper, WrapperMergePolicyFactoryTest, CheckHdfsIndexTest, TestCollationField, TestCollationFieldDocValues, TestHalfAndHalfDocValues, TestManagedSchema, CursorMarkTest, MaxScoreCollectorTest, MergeStrategyTest, TestCustomSort, TestDocSet, TestElisionMultitermQuery, TestExtendedDismaxParser, TestMissingGroups, TestRecoveryHdfs]
   [junit4]   2> NOTE: reproduce with: ant test  -Dtestcase=TestRecoveryHdfs -Dtests.seed=635D9E93FFB1D67F -Dtests.multiplier=2 -Dtests.slow=true -Dtests.locale=es-MX -Dtests.timezone=America/Lower_Princes -Dtests.asserts=true -Dtests.file.encoding=ISO-8859-1
   [junit4] ERROR   0.00s J3 | TestRecoveryHdfs (suite) <<<
   [junit4]    > Throwable #1: com.carrotsearch.randomizedtesting.ThreadLeakError: 1 thread leaked from SUITE scope at org.apache.solr.search.TestRecoveryHdfs: 
   [junit4]    >    1) Thread[id=39031, name=Command processor, state=WAITING, group=TGRP-TestRecoveryHdfs]
   [junit4]    >         at sun.misc.Unsafe.park(Native Method)
   [junit4]    >         at java.util.concurrent.locks.LockSupport.park(LockSupport.java:175)
   [junit4]    >         at java.util.concurrent.locks.AbstractQueuedSynchronizer$ConditionObject.await(AbstractQueuedSynchronizer.java:2039)
   [junit4]    >         at java.util.concurrent.LinkedBlockingQueue.take(LinkedBlockingQueue.java:442)
   [junit4]    >         at org.apache.hadoop.hdfs.server.datanode.BPServiceActor$CommandProcessingThread.processQueue(BPServiceActor.java:1291)
   [junit4]    >         at org.apache.hadoop.hdfs.server.datanode.BPServiceActor$CommandProcessingThread.run(BPServiceActor.java:1275)
   [junit4]    > 	at __randomizedtesting.SeedInfo.seed([635D9E93FFB1D67F]:0)
   [junit4] Completed [839/959 (2!)] on J3 in 65.31s, 11 tests, 1 error, 1 skipped <<< FAILURES!

[...truncated 54724 lines...]