You are viewing a plain text version of this content. The canonical link for it is here.
Posted to builds@cassandra.apache.org by Apache Jenkins Server <je...@builds.apache.org> on 2024/06/17 22:10:19 UTC
Build complete: Cassandra-4.1 #499 [UNSTABLE] 53b06453b7dea147ef6369765e0b7ac7fb0990fd
-------------------------------------------------------------------------------
Build Cassandra-4.1 #499 Still unstable
URL: https://ci-cassandra.apache.org/job/Cassandra-4.1/499/
-------------------------------------------------------------------------------
Changes:
[Stefan Miklosovic] Reduce info logging from automatic paxos repair
[Benjamin Lerer] Refresh stale paxos commit
-------------------------------------------------------------------------------
Failed Tests:
17 tests failed.
FAILED: dtest-offheap.materialized_views_test.TestMaterializedViewsConsistency.test_multi_partition_consistent_reads_after_write
FAILED: org.apache.cassandra.distributed.test.GossipTest.nodeDownDuringMove
FAILED: org.apache.cassandra.net.ProxyHandlerConnectionsTest.testExpireSome-cdc
FAILED: dtest-novnode.largecolumn_test.TestLargeColumn.test_cleanup
FAILED: dtest-novnode.largecolumn_test.TestLargeColumn.test_cleanup
FAILED: dtest-offheap.largecolumn_test.TestLargeColumn.test_cleanup
FAILED: dtest-offheap.largecolumn_test.TestLargeColumn.test_cleanup
FAILED: dtest.largecolumn_test.TestLargeColumn.test_cleanup
FAILED: dtest.largecolumn_test.TestLargeColumn.test_cleanup
FAILED: org.apache.cassandra.distributed.test.ReadRepairTest.readRepairRTRangeMovementTest
FAILED: org.apache.cassandra.distributed.test.ReadRepairTest.readRepairRTRangeMovementTest
FAILED: org.apache.cassandra.distributed.test.ReadRepairTest.readRepairRTRangeMovementTest
FAILED: org.apache.cassandra.cql3.MemtableSizeTest.testSize[skiplist]-cdc
FAILED: org.apache.cassandra.cql3.MemtableSizeTest.testSize[skiplist]-cdc
FAILED: org.apache.cassandra.cql3.MemtableSizeTest.testSize[skiplist]-compression
FAILED: org.apache.cassandra.cql3.MemtableSizeTest.testSize[skiplist]
FAILED: org.apache.cassandra.cql3.MemtableSizeTest.testSize[skiplist]
-------------------------------------------------------------------------------
For complete test report and logs see https://nightlies.apache.org/cassandra/Cassandra-4.1/499/