You are viewing a plain text version of this content. The canonical link for it is here.
Posted to commits@tomee.apache.org by Apache Jenkins Server <je...@builds.apache.org> on 2022/11/18 18:49:29 UTC

Build failed in Jenkins: TomEE » master-build-full-itests #39

See <https://ci-builds.apache.org/job/Tomee/job/master-build-full-itests/39/display/redirect?page=changes>

Changes:

[Jean-Louis Monteiro] Cleanup CXF files to simplify further upgrade


------------------------------------------
[...truncated 457.34 KB...]
[INFO] --------------------------------[ jar ]---------------------------------
[INFO] 
[INFO] --- maven-clean-plugin:3.2.0:clean (default-clean) @ apache-tomee ---
[INFO] 
[INFO] --- maven-enforcer-plugin:3.0.0:enforce (enforce-maven-version) @ apache-tomee ---
[INFO] 
[INFO] --- maven-enforcer-plugin:3.0.0:enforce (enforce-java-version) @ apache-tomee ---
[INFO] 
[INFO] --- maven-remote-resources-plugin:1.5:process (process-resource-bundles) @ apache-tomee ---
[INFO] 
[INFO] --- maven-resources-plugin:3.0.2:resources (default-resources) @ apache-tomee ---
[INFO] Using 'UTF-8' encoding to copy filtered resources.
[INFO] Copying 18 resources
[INFO] Copying 19 resources
[INFO] Copying 3 resources
[INFO] 
[INFO] --- maven-resources-plugin:3.0.2:resources (filter-resources) @ apache-tomee ---
[INFO] Using 'UTF-8' encoding to copy filtered resources.
[INFO] Copying 18 resources
[INFO] Copying 19 resources
[INFO] Copying 3 resources
[INFO] 
[INFO] --- maven-dependency-plugin:3.3.0:copy (copy-tomcat-for-webprofile) @ apache-tomee ---
[INFO] Configured Artifact: org.apache.tomcat:tomcat:10.0.27:zip
[INFO] Copying tomcat-10.0.27.zip to <https://ci-builds.apache.org/job/Tomee/job/master-build-full-itests/ws/tomee/apache-tomee/target/webprofile-work-dir/apache-tomcat-10.0.27.zip>
[INFO] 
[INFO] --- maven-dependency-plugin:3.3.0:copy (copy-tomcat-for-plus) @ apache-tomee ---
[INFO] Configured Artifact: org.apache.tomcat:tomcat:10.0.27:zip
[INFO] Copying tomcat-10.0.27.zip to <https://ci-builds.apache.org/job/Tomee/job/master-build-full-itests/ws/tomee/apache-tomee/target/plus-work-dir/apache-tomcat-10.0.27.zip>
[INFO] 
[INFO] --- maven-dependency-plugin:3.3.0:copy (copy-tomcat-for-plume) @ apache-tomee ---
[INFO] Configured Artifact: org.apache.tomcat:tomcat:10.0.27:zip
[INFO] Copying tomcat-10.0.27.zip to <https://ci-builds.apache.org/job/Tomee/job/master-build-full-itests/ws/tomee/apache-tomee/target/plume-work-dir/apache-tomcat-10.0.27.zip>
[INFO] 
[INFO] --- maven-dependency-plugin:3.3.0:copy (copy-tomcat-for-microprofile) @ apache-tomee ---
[INFO] Configured Artifact: org.apache.tomcat:tomcat:10.0.27:zip
[INFO] Copying tomcat-10.0.27.zip to <https://ci-builds.apache.org/job/Tomee/job/master-build-full-itests/ws/tomee/apache-tomee/target/microprofile-work-dir/apache-tomcat-10.0.27.zip>
[INFO] 
[INFO] --- maven-compiler-plugin:3.6.2:compile (default-compile) @ apache-tomee ---
[INFO] Changes detected - recompiling the module!
[INFO] Compiling 1 source file to <https://ci-builds.apache.org/job/Tomee/job/master-build-full-itests/ws/tomee/apache-tomee/target/classes>
[INFO] 
[INFO] --- dependency-report-plugin:1.0.2:report (default) @ apache-tomee ---
[INFO] Couldn't find parent for org.codehaus.swizzle:swizzle-stream:jar:1.6.2
[INFO] Couldn't find parent for org.apache.xbean:xbean-naming:jar:4.22
[INFO] Couldn't find parent for org.apache.tomee:openejb-loader:jar:9.0.0-SNAPSHOT
[INFO] Couldn't find parent for org.apache.tomee:openejb-jpa-integration:jar:9.0.0-SNAPSHOT
[INFO] 
[INFO] --- maven-bundle-plugin:3.3.0:manifest (bundle-manifest) @ apache-tomee ---
[INFO] 
[INFO] --- maven-resources-plugin:3.0.2:testResources (default-testResources) @ apache-tomee ---
[INFO] Using 'UTF-8' encoding to copy filtered resources.
[INFO] Copying 2 resources
[INFO] Copying 3 resources
[INFO] 
[INFO] --- maven-compiler-plugin:3.6.2:testCompile (default-testCompile) @ apache-tomee ---
[INFO] Changes detected - recompiling the module!
[INFO] Compiling 6 source files to <https://ci-builds.apache.org/job/Tomee/job/master-build-full-itests/ws/tomee/apache-tomee/target/test-classes>
[INFO] 
[INFO] --- maven-surefire-plugin:3.0.0-M7:test (default-test) @ apache-tomee ---
[INFO] Tests are skipped.
[INFO] 
[INFO] --- groovy-maven-plugin:2.1.1:execute (execute-web-profile-installer) @ apache-tomee ---
[INFO] extracting <https://ci-builds.apache.org/job/Tomee/job/master-build-full-itests/ws/tomee/apache-tomee/target/webprofile-work-dir/apache-tomcat-10.0.27>
Expanding: <https://ci-builds.apache.org/job/Tomee/job/master-build-full-itests/ws/tomee/apache-tomee/target/webprofile-work-dir/apache-tomcat-10.0.27.zip> into <https://ci-builds.apache.org/job/Tomee/job/master-build-full-itests/ws/tomee/apache-tomee/target/webprofile-work-dir>
[INFO] Deploying the tomee war
Expanding: /home/jenkins/.m2/repository/org/apache/tomee/tomee-webapp/9.0.0-SNAPSHOT/tomee-webapp-9.0.0-SNAPSHOT.war into <https://ci-builds.apache.org/job/Tomee/job/master-build-full-itests/ws/tomee/apache-tomee/target/webprofile-work-dir/apache-tomcat-10.0.27/webapps/tomee>
[INFO] Installing to: <https://ci-builds.apache.org/job/Tomee/job/master-build-full-itests/ws/tomee/apache-tomee/target/webprofile-work-dir/apache-tomcat-10.0.27>
Nov 18, 2022 6:48:45 PM org.apache.openejb.javaagent.Agent checkInitialization
SEVERE: Unable to initialize agent: null
Deleting: <https://ci-builds.apache.org/job/Tomee/job/master-build-full-itests/ws/tomee/apache-tomee/target/webprofile-work-dir/apache-tomcat-10.0.27/lib/openejb-javaagent-9.0.0-SNAPSHOT.jar>
Deleting: <https://ci-builds.apache.org/job/Tomee/job/master-build-full-itests/ws/tomee/apache-tomee/target/webprofile-work-dir/apache-tomcat-10.0.27/webapps/tomee/WEB-INF/lib/tomee-loader-9.0.0-SNAPSHOT.jar>
Deleting: <https://ci-builds.apache.org/job/Tomee/job/master-build-full-itests/ws/tomee/apache-tomee/target/webprofile-work-dir/apache-tomcat-10.0.27/webapps/tomee/WEB-INF/lib/swizzle-stream-1.6.2.jar>
[INFO] Assigning execute privileges to scripts in Tomcat bin directory
Deleting directory <https://ci-builds.apache.org/job/Tomee/job/master-build-full-itests/ws/tomee/apache-tomee/target/webprofile-work-dir/apache-tomcat-10.0.27/webapps/examples>
Deleting directory <https://ci-builds.apache.org/job/Tomee/job/master-build-full-itests/ws/tomee/apache-tomee/target/webprofile-work-dir/apache-tomcat-10.0.27/webapps/tomee>
[INFO] 
[INFO] --- groovy-maven-plugin:2.1.1:execute (execute-plus-installer) @ apache-tomee ---
[INFO] extracting <https://ci-builds.apache.org/job/Tomee/job/master-build-full-itests/ws/tomee/apache-tomee/target/plus-work-dir/apache-tomcat-10.0.27>
Expanding: <https://ci-builds.apache.org/job/Tomee/job/master-build-full-itests/ws/tomee/apache-tomee/target/plus-work-dir/apache-tomcat-10.0.27.zip> into <https://ci-builds.apache.org/job/Tomee/job/master-build-full-itests/ws/tomee/apache-tomee/target/plus-work-dir>
[INFO] Deploying the tomee war
Expanding: /home/jenkins/.m2/repository/org/apache/tomee/tomee-plus-webapp/9.0.0-SNAPSHOT/tomee-plus-webapp-9.0.0-SNAPSHOT.war into <https://ci-builds.apache.org/job/Tomee/job/master-build-full-itests/ws/tomee/apache-tomee/target/plus-work-dir/apache-tomcat-10.0.27/webapps/tomee>
[INFO] Installing to: <https://ci-builds.apache.org/job/Tomee/job/master-build-full-itests/ws/tomee/apache-tomee/target/plus-work-dir/apache-tomcat-10.0.27>
Nov 18, 2022 6:48:47 PM org.apache.openejb.javaagent.Agent checkInitialization
SEVERE: Unable to initialize agent: null
Deleting: <https://ci-builds.apache.org/job/Tomee/job/master-build-full-itests/ws/tomee/apache-tomee/target/plus-work-dir/apache-tomcat-10.0.27/lib/openejb-javaagent-9.0.0-SNAPSHOT.jar>
Deleting: <https://ci-builds.apache.org/job/Tomee/job/master-build-full-itests/ws/tomee/apache-tomee/target/plus-work-dir/apache-tomcat-10.0.27/webapps/tomee/WEB-INF/lib/tomee-loader-9.0.0-SNAPSHOT.jar>
Deleting: <https://ci-builds.apache.org/job/Tomee/job/master-build-full-itests/ws/tomee/apache-tomee/target/plus-work-dir/apache-tomcat-10.0.27/webapps/tomee/WEB-INF/lib/swizzle-stream-1.6.2.jar>
[INFO] Assigning execute privileges to scripts in Tomcat bin directory
Deleting directory <https://ci-builds.apache.org/job/Tomee/job/master-build-full-itests/ws/tomee/apache-tomee/target/plus-work-dir/apache-tomcat-10.0.27/webapps/examples>
Deleting directory <https://ci-builds.apache.org/job/Tomee/job/master-build-full-itests/ws/tomee/apache-tomee/target/plus-work-dir/apache-tomcat-10.0.27/webapps/tomee>
[INFO] 
[INFO] --- groovy-maven-plugin:2.1.1:execute (execute-plume-installer) @ apache-tomee ---
[INFO] extracting <https://ci-builds.apache.org/job/Tomee/job/master-build-full-itests/ws/tomee/apache-tomee/target/plume-work-dir/apache-tomcat-10.0.27>
Expanding: <https://ci-builds.apache.org/job/Tomee/job/master-build-full-itests/ws/tomee/apache-tomee/target/plume-work-dir/apache-tomcat-10.0.27.zip> into <https://ci-builds.apache.org/job/Tomee/job/master-build-full-itests/ws/tomee/apache-tomee/target/plume-work-dir>
[INFO] Deploying the tomee war
Expanding: /home/jenkins/.m2/repository/org/apache/tomee/tomee-plume-webapp/9.0.0-SNAPSHOT/tomee-plume-webapp-9.0.0-SNAPSHOT.war into <https://ci-builds.apache.org/job/Tomee/job/master-build-full-itests/ws/tomee/apache-tomee/target/plume-work-dir/apache-tomcat-10.0.27/webapps/tomee>
[INFO] Installing to: <https://ci-builds.apache.org/job/Tomee/job/master-build-full-itests/ws/tomee/apache-tomee/target/plume-work-dir/apache-tomcat-10.0.27>
Nov 18, 2022 6:48:50 PM org.apache.openejb.javaagent.Agent checkInitialization
SEVERE: Unable to initialize agent: null
Deleting: <https://ci-builds.apache.org/job/Tomee/job/master-build-full-itests/ws/tomee/apache-tomee/target/plume-work-dir/apache-tomcat-10.0.27/lib/openejb-javaagent-9.0.0-SNAPSHOT.jar>
Deleting: <https://ci-builds.apache.org/job/Tomee/job/master-build-full-itests/ws/tomee/apache-tomee/target/plume-work-dir/apache-tomcat-10.0.27/webapps/tomee/WEB-INF/lib/tomee-loader-9.0.0-SNAPSHOT.jar>
Deleting: <https://ci-builds.apache.org/job/Tomee/job/master-build-full-itests/ws/tomee/apache-tomee/target/plume-work-dir/apache-tomcat-10.0.27/webapps/tomee/WEB-INF/lib/swizzle-stream-1.6.2.jar>
[INFO] Assigning execute privileges to scripts in Tomcat bin directory
Deleting directory <https://ci-builds.apache.org/job/Tomee/job/master-build-full-itests/ws/tomee/apache-tomee/target/plume-work-dir/apache-tomcat-10.0.27/webapps/examples>
Deleting directory <https://ci-builds.apache.org/job/Tomee/job/master-build-full-itests/ws/tomee/apache-tomee/target/plume-work-dir/apache-tomcat-10.0.27/webapps/tomee>
[INFO] 
[INFO] --- groovy-maven-plugin:2.1.1:execute (execute-microprofile-installer) @ apache-tomee ---
[INFO] extracting <https://ci-builds.apache.org/job/Tomee/job/master-build-full-itests/ws/tomee/apache-tomee/target/microprofile-work-dir/apache-tomcat-10.0.27>
Expanding: <https://ci-builds.apache.org/job/Tomee/job/master-build-full-itests/ws/tomee/apache-tomee/target/microprofile-work-dir/apache-tomcat-10.0.27.zip> into <https://ci-builds.apache.org/job/Tomee/job/master-build-full-itests/ws/tomee/apache-tomee/target/microprofile-work-dir>
[INFO] Deploying the tomee war
Expanding: /home/jenkins/.m2/repository/org/apache/tomee/tomee-microprofile-webapp/9.0.0-SNAPSHOT/tomee-microprofile-webapp-9.0.0-SNAPSHOT.war into <https://ci-builds.apache.org/job/Tomee/job/master-build-full-itests/ws/tomee/apache-tomee/target/microprofile-work-dir/apache-tomcat-10.0.27/webapps/tomee>
[INFO] Installing to: <https://ci-builds.apache.org/job/Tomee/job/master-build-full-itests/ws/tomee/apache-tomee/target/microprofile-work-dir/apache-tomcat-10.0.27>
Nov 18, 2022 6:48:52 PM org.apache.openejb.javaagent.Agent checkInitialization
SEVERE: Unable to initialize agent: null
Deleting: <https://ci-builds.apache.org/job/Tomee/job/master-build-full-itests/ws/tomee/apache-tomee/target/microprofile-work-dir/apache-tomcat-10.0.27/lib/openejb-javaagent-9.0.0-SNAPSHOT.jar>
Deleting: <https://ci-builds.apache.org/job/Tomee/job/master-build-full-itests/ws/tomee/apache-tomee/target/microprofile-work-dir/apache-tomcat-10.0.27/webapps/tomee/WEB-INF/lib/tomee-loader-9.0.0-SNAPSHOT.jar>
Deleting: <https://ci-builds.apache.org/job/Tomee/job/master-build-full-itests/ws/tomee/apache-tomee/target/microprofile-work-dir/apache-tomcat-10.0.27/webapps/tomee/WEB-INF/lib/swizzle-stream-1.6.2.jar>
[INFO] Assigning execute privileges to scripts in Tomcat bin directory
Deleting directory <https://ci-builds.apache.org/job/Tomee/job/master-build-full-itests/ws/tomee/apache-tomee/target/microprofile-work-dir/apache-tomcat-10.0.27/webapps/examples>
Deleting directory <https://ci-builds.apache.org/job/Tomee/job/master-build-full-itests/ws/tomee/apache-tomee/target/microprofile-work-dir/apache-tomcat-10.0.27/webapps/tomee>
[INFO] 
[INFO] --- maven-jar-plugin:3.0.2:jar (default-jar) @ apache-tomee ---
[INFO] Building jar: <https://ci-builds.apache.org/job/Tomee/job/master-build-full-itests/ws/tomee/apache-tomee/target/apache-tomee-9.0.0-SNAPSHOT.jar>
[INFO] 
[INFO] --- maven-site-plugin:3.11.0:attach-descriptor (attach-descriptor) @ apache-tomee ---
[INFO] Skipping because packaging 'jar' is not pom.
[INFO] 
[INFO] --- maven-assembly-plugin:2.4.1:single (webprofile) @ apache-tomee ---
[INFO] Reading assembly descriptor: src/main/assembly/tomee-webprofile.xml
[INFO] Building tar: <https://ci-builds.apache.org/job/Tomee/job/master-build-full-itests/ws/tomee/apache-tomee/target/apache-tomee-webprofile-9.0.0-SNAPSHOT.tar.gz>
[INFO] Building zip: <https://ci-builds.apache.org/job/Tomee/job/master-build-full-itests/ws/tomee/apache-tomee/target/apache-tomee-webprofile-9.0.0-SNAPSHOT.zip>
[INFO] 
[INFO] --- maven-assembly-plugin:2.4.1:single (plus) @ apache-tomee ---
[INFO] Reading assembly descriptor: src/main/assembly/tomee-plus.xml
[INFO] Building tar: <https://ci-builds.apache.org/job/Tomee/job/master-build-full-itests/ws/tomee/apache-tomee/target/apache-tomee-plus-9.0.0-SNAPSHOT.tar.gz>
[INFO] Building zip: <https://ci-builds.apache.org/job/Tomee/job/master-build-full-itests/ws/tomee/apache-tomee/target/apache-tomee-plus-9.0.0-SNAPSHOT.zip>
[INFO] 
[INFO] --- maven-assembly-plugin:2.4.1:single (plume) @ apache-tomee ---
[INFO] Reading assembly descriptor: src/main/assembly/tomee-plume.xml
[INFO] Building tar: <https://ci-builds.apache.org/job/Tomee/job/master-build-full-itests/ws/tomee/apache-tomee/target/apache-tomee-plume-9.0.0-SNAPSHOT.tar.gz>
[INFO] Building zip: <https://ci-builds.apache.org/job/Tomee/job/master-build-full-itests/ws/tomee/apache-tomee/target/apache-tomee-plume-9.0.0-SNAPSHOT.zip>
[INFO] 
[INFO] --- maven-assembly-plugin:2.4.1:single (microprofile) @ apache-tomee ---
[INFO] Reading assembly descriptor: src/main/assembly/tomee-microprofile.xml
[INFO] Building tar: <https://ci-builds.apache.org/job/Tomee/job/master-build-full-itests/ws/tomee/apache-tomee/target/apache-tomee-microprofile-9.0.0-SNAPSHOT.tar.gz>
[INFO] Building zip: <https://ci-builds.apache.org/job/Tomee/job/master-build-full-itests/ws/tomee/apache-tomee/target/apache-tomee-microprofile-9.0.0-SNAPSHOT.zip>
[INFO] 
[INFO] --- maven-antrun-plugin:3.0.0:run (default) @ apache-tomee ---
[INFO] Executing tasks
[INFO]      [copy] Copying 1 file to <https://ci-builds.apache.org/job/Tomee/job/master-build-full-itests/ws/tomee/apache-tomee/target/classes>
[INFO] Executed tasks
[INFO] 
[INFO] --- build-helper-maven-plugin:1.9.1:attach-artifact (attach-artifacts) @ apache-tomee ---
[INFO] 
[INFO] --- tomee-patch-plugin:0.9:run (default) @ apache-tomee ---
[INFO] ------------------------------------------------------------------------
[INFO] Reactor Summary for Apache OpenEJB 9.0.0-SNAPSHOT:
[INFO] 
[INFO] Apache OpenEJB ..................................... SUCCESS [  2.305 s]
[INFO] TomEE :: Deps ...................................... SUCCESS [  0.070 s]
[INFO] TomEE :: Deps :: Taglibs Shade ..................... SUCCESS [03:38 min]
[INFO] TomEE :: Deps :: CXF Shade ......................... SUCCESS [02:05 min]
[INFO] TomEE :: Deps :: CXF Rest Client Shade ............. SUCCESS [  3.605 s]
[INFO] TomEE :: Deps :: SXC Shade ......................... SUCCESS [  0.468 s]
[INFO] TomEE :: Deps :: Apache ActiveMQ Client shade ...... SUCCESS [  1.124 s]
[INFO] TomEE :: Deps :: Apache ActiveMQ Broker shade ...... SUCCESS [  1.213 s]
[INFO] TomEE :: Deps :: Apache ActiveMQ KahaDB Store shade  SUCCESS [  0.612 s]
[INFO] TomEE :: Deps :: Apache ActiveMQ RA shade .......... SUCCESS [  0.420 s]
[INFO] TomEE :: Deps :: Apache Commons DBCP2 shade ........ SUCCESS [  0.458 s]
[INFO] TomEE :: Deps :: Apache Commons FileUpload shade ... SUCCESS [  0.269 s]
[INFO] TomEE :: BOMs ...................................... SUCCESS [  0.048 s]
[INFO] TomEE :: BOMs :: JAXB Runtime ...................... SUCCESS [  0.269 s]
[INFO] TomEE :: Container ................................. SUCCESS [  0.037 s]
[INFO] TomEE :: Container :: Loader ....................... SUCCESS [  3.245 s]
[INFO] TomEE :: Container :: MBean Annotation API ......... SUCCESS [  0.449 s]
[INFO] TomEE :: Container :: JPA Integration .............. SUCCESS [  1.798 s]
[INFO] TomEE :: Container :: API .......................... SUCCESS [  0.515 s]
[INFO] TomEE :: Container :: Java Agent ................... SUCCESS [  0.366 s]
[INFO] TomEE :: Container :: Java EE ...................... SUCCESS [ 15.763 s]
[INFO] TomEE :: Container :: Java EE Accessors ............ SUCCESS [  8.666 s]
[INFO] TomEE :: iTests .................................... SUCCESS [  0.061 s]
[INFO] TomEE :: iTests :: Beans ........................... SUCCESS [  8.985 s]
[INFO] TomEE :: iTests :: Interceptor Beans ............... SUCCESS [  0.796 s]
[INFO] TomEE :: iTests :: Servlets ........................ SUCCESS [  0.571 s]
[INFO] TomEE :: iTests :: Client .......................... SUCCESS [  6.114 s]
[INFO] TomEE :: iTests :: App ............................. SUCCESS [  1.215 s]
[INFO] TomEE :: iTests :: Failover EJB .................... SUCCESS [  0.218 s]
[INFO] TomEE :: Container :: Core ......................... SUCCESS [ 42.460 s]
[INFO] TomEE :: TomEE ..................................... SUCCESS [  0.637 s]
[INFO] TomEE :: TomEE :: Config ........................... SUCCESS [  0.767 s]
[INFO] TomEE :: Server .................................... SUCCESS [  0.035 s]
[INFO] TomEE :: Server :: Client .......................... SUCCESS [  3.161 s]
[INFO] TomEE :: TomEE :: Common ........................... SUCCESS [  1.866 s]
[INFO] TomEE :: TomEE :: Juli ............................. SUCCESS [  2.037 s]
[INFO] TomEE :: TomEE :: Loader ........................... SUCCESS [  1.485 s]
[INFO] TomEE :: TomEE :: JDBC ............................. SUCCESS [  0.935 s]
[INFO] TomEE :: Server :: Core ............................ SUCCESS [  1.554 s]
[INFO] TomEE :: Server :: Multicast Discovery ............. SUCCESS [  1.550 s]
[INFO] TomEE :: Server :: EJBd ............................ SUCCESS [  2.061 s]
[INFO] TomEE :: Server :: Http ............................ SUCCESS [  2.617 s]
[INFO] TomEE :: TomEE :: Catalina ......................... SUCCESS [  4.753 s]
[INFO] TomEE :: Server :: REST ............................ SUCCESS [  1.072 s]
[INFO] TomEE :: Server :: CXF Transport ................... SUCCESS [  0.808 s]
[INFO] TomEE :: Server :: CXF RS .......................... SUCCESS [  2.599 s]
[INFO] TomEE :: Microprofile JWT .......................... SUCCESS [  3.736 s]
[INFO] TomEE :: TomEE :: MicroProfile ..................... SUCCESS [  0.525 s]
[INFO] TomEE :: TomEE :: MicroProfile Common .............. SUCCESS [  4.916 s]
[INFO] TomEE :: Server :: Webservices ..................... SUCCESS [  1.778 s]
[INFO] TomEE :: Server :: CXF ............................. SUCCESS [  3.127 s]
[INFO] TomEE :: Server :: Hsql ............................ SUCCESS [  0.751 s]
[INFO] TomEE :: TomEE :: RS Web Services .................. SUCCESS [  1.700 s]
[INFO] TomEE :: TomEE :: Mojarra .......................... SUCCESS [  0.950 s]
[INFO] TomEE :: TomEE :: MyFaces .......................... SUCCESS [  0.845 s]
[INFO] TomEE :: TomEE :: Util ............................. SUCCESS [  0.683 s]
[INFO] TomEE :: TomEE :: Web Services ..................... SUCCESS [  1.641 s]
[INFO] TomEE :: TomEE :: TomEE Embedded ................... SUCCESS [ 28.952 s]
[INFO] TomEE :: TomEE :: Security ......................... SUCCESS [  3.225 s]
[INFO] TomEE :: TomEE :: MicroProfile Webapp .............. SUCCESS [  7.523 s]
[INFO] TomEE :: TomEE :: Webapp ........................... SUCCESS [  6.041 s]
[INFO] TomEE :: Utils ..................................... SUCCESS [  0.136 s]
[INFO] TomEE :: Utils :: Core EclipseLink ................. SUCCESS [  0.516 s]
[INFO] TomEE :: TomEE :: Plume Webapp ..................... SUCCESS [  7.537 s]
[INFO] TomEE :: TomEE :: Plus Webapp ...................... SUCCESS [  7.149 s]
[INFO] TomEE :: TomEE :: Apache TomEE ..................... FAILURE [ 47.939 s]
[INFO] ------------------------------------------------------------------------
[INFO] BUILD FAILURE
[INFO] ------------------------------------------------------------------------
[INFO] Total time:  10:06 min
[INFO] Finished at: 2022-11-18T18:49:27Z
[INFO] ------------------------------------------------------------------------
[ERROR] Failed to execute goal org.apache.tomee.patch:tomee-patch-plugin:0.9:run (default) on project apache-tomee: Error occurred during execution: Unable to unzip java.io.BufferedInputStream@616a4d7: No space left on device -> [Help 1]
[ERROR] 
[ERROR] To see the full stack trace of the errors, re-run Maven with the -e switch.
[ERROR] Re-run Maven using the -X switch to enable full debug logging.
[ERROR] 
[ERROR] For more information about the errors and possible solutions, please read the following articles:
[ERROR] [Help 1] http://cwiki.apache.org/confluence/display/MAVEN/MojoExecutionException
[ERROR] 
[ERROR] After correcting the problems, you can resume the build with the command
[ERROR]   mvn <args> -rf :apache-tomee
Build step 'Execute shell' marked build as failure
INFO: Processing JUnit
INFO: [JUnit] - No test report file(s) were found with the pattern '**/target/surefire-reports/TEST-*.xml' relative to '<https://ci-builds.apache.org/job/Tomee/job/master-build-full-itests/ws/'> for the testing framework 'JUnit'.
Did you enter a pattern relative to (and within) the workspace directory?
Did you generate the result report(s) for 'JUnit'?"
WARNING: All test reports are empty.
[Checks API] No suitable checks publisher found.
INFO: Setting the build status to org.jenkinsci.plugins.xunit.XUnitProcessorResult@fc12d50

Jenkins build is back to normal : TomEE » master-build-full-itests #40

Posted by Apache Jenkins Server <je...@builds.apache.org>.
See <https://ci-builds.apache.org/job/Tomee/job/master-build-full-itests/40/display/redirect?page=changes>