You are viewing a plain text version of this content. The canonical link for it is here.
Posted to dev@lucene.apache.org by Policeman Jenkins Server <je...@thetaphi.de> on 2016/04/11 16:33:25 UTC

[JENKINS] Lucene-Solr-master-MacOSX (64bit/jdk1.8.0) - Build # 3201 - Failure!

Build: http://jenkins.thetaphi.de/job/Lucene-Solr-master-MacOSX/3201/
Java: 64bit/jdk1.8.0 -XX:-UseCompressedOops -XX:+UseConcMarkSweepGC

1 tests failed.
FAILED:  org.apache.solr.cloud.DistribDocExpirationUpdateProcessorTest.test

Error Message:
There are still nodes recoverying - waited for 45 seconds

Stack Trace:
java.lang.AssertionError: There are still nodes recoverying - waited for 45 seconds
	at __randomizedtesting.SeedInfo.seed([193C056F71DCA248:91683AB5DF20CFB0]:0)
	at org.junit.Assert.fail(Assert.java:93)
	at org.apache.solr.cloud.AbstractDistribZkTestBase.waitForRecoveriesToFinish(AbstractDistribZkTestBase.java:173)
	at org.apache.solr.cloud.AbstractFullDistribZkTestBase.waitForRecoveriesToFinish(AbstractFullDistribZkTestBase.java:856)
	at org.apache.solr.cloud.DistribDocExpirationUpdateProcessorTest.test(DistribDocExpirationUpdateProcessorTest.java:73)
	at sun.reflect.NativeMethodAccessorImpl.invoke0(Native Method)
	at sun.reflect.NativeMethodAccessorImpl.invoke(NativeMethodAccessorImpl.java:62)
	at sun.reflect.DelegatingMethodAccessorImpl.invoke(DelegatingMethodAccessorImpl.java:43)
	at java.lang.reflect.Method.invoke(Method.java:498)
	at com.carrotsearch.randomizedtesting.RandomizedRunner.invoke(RandomizedRunner.java:1764)
	at com.carrotsearch.randomizedtesting.RandomizedRunner$8.evaluate(RandomizedRunner.java:871)
	at com.carrotsearch.randomizedtesting.RandomizedRunner$9.evaluate(RandomizedRunner.java:907)
	at com.carrotsearch.randomizedtesting.RandomizedRunner$10.evaluate(RandomizedRunner.java:921)
	at org.apache.solr.BaseDistributedSearchTestCase$ShardsRepeatRule$ShardsFixedStatement.callStatement(BaseDistributedSearchTestCase.java:985)
	at org.apache.solr.BaseDistributedSearchTestCase$ShardsRepeatRule$ShardsStatement.evaluate(BaseDistributedSearchTestCase.java:960)
	at com.carrotsearch.randomizedtesting.rules.SystemPropertiesRestoreRule$1.evaluate(SystemPropertiesRestoreRule.java:57)
	at org.apache.lucene.util.TestRuleSetupTeardownChained$1.evaluate(TestRuleSetupTeardownChained.java:49)
	at org.apache.lucene.util.AbstractBeforeAfterRule$1.evaluate(AbstractBeforeAfterRule.java:45)
	at org.apache.lucene.util.TestRuleThreadAndTestName$1.evaluate(TestRuleThreadAndTestName.java:48)
	at org.apache.lucene.util.TestRuleIgnoreAfterMaxFailures$1.evaluate(TestRuleIgnoreAfterMaxFailures.java:64)
	at org.apache.lucene.util.TestRuleMarkFailure$1.evaluate(TestRuleMarkFailure.java:47)
	at com.carrotsearch.randomizedtesting.rules.StatementAdapter.evaluate(StatementAdapter.java:36)
	at com.carrotsearch.randomizedtesting.ThreadLeakControl$StatementRunner.run(ThreadLeakControl.java:367)
	at com.carrotsearch.randomizedtesting.ThreadLeakControl.forkTimeoutingTask(ThreadLeakControl.java:809)
	at com.carrotsearch.randomizedtesting.ThreadLeakControl$3.evaluate(ThreadLeakControl.java:460)
	at com.carrotsearch.randomizedtesting.RandomizedRunner.runSingleTest(RandomizedRunner.java:880)
	at com.carrotsearch.randomizedtesting.RandomizedRunner$5.evaluate(RandomizedRunner.java:781)
	at com.carrotsearch.randomizedtesting.RandomizedRunner$6.evaluate(RandomizedRunner.java:816)
	at com.carrotsearch.randomizedtesting.RandomizedRunner$7.evaluate(RandomizedRunner.java:827)
	at com.carrotsearch.randomizedtesting.rules.StatementAdapter.evaluate(StatementAdapter.java:36)
	at com.carrotsearch.randomizedtesting.rules.SystemPropertiesRestoreRule$1.evaluate(SystemPropertiesRestoreRule.java:57)
	at org.apache.lucene.util.AbstractBeforeAfterRule$1.evaluate(AbstractBeforeAfterRule.java:45)
	at com.carrotsearch.randomizedtesting.rules.StatementAdapter.evaluate(StatementAdapter.java:36)
	at org.apache.lucene.util.TestRuleStoreClassName$1.evaluate(TestRuleStoreClassName.java:41)
	at com.carrotsearch.randomizedtesting.rules.NoShadowingOrOverridesOnMethodsRule$1.evaluate(NoShadowingOrOverridesOnMethodsRule.java:40)
	at com.carrotsearch.randomizedtesting.rules.NoShadowingOrOverridesOnMethodsRule$1.evaluate(NoShadowingOrOverridesOnMethodsRule.java:40)
	at com.carrotsearch.randomizedtesting.rules.StatementAdapter.evaluate(StatementAdapter.java:36)
	at com.carrotsearch.randomizedtesting.rules.StatementAdapter.evaluate(StatementAdapter.java:36)
	at com.carrotsearch.randomizedtesting.rules.StatementAdapter.evaluate(StatementAdapter.java:36)
	at org.apache.lucene.util.TestRuleAssertionsRequired$1.evaluate(TestRuleAssertionsRequired.java:53)
	at org.apache.lucene.util.TestRuleMarkFailure$1.evaluate(TestRuleMarkFailure.java:47)
	at org.apache.lucene.util.TestRuleIgnoreAfterMaxFailures$1.evaluate(TestRuleIgnoreAfterMaxFailures.java:64)
	at org.apache.lucene.util.TestRuleIgnoreTestSuites$1.evaluate(TestRuleIgnoreTestSuites.java:54)
	at com.carrotsearch.randomizedtesting.rules.StatementAdapter.evaluate(StatementAdapter.java:36)
	at com.carrotsearch.randomizedtesting.ThreadLeakControl$StatementRunner.run(ThreadLeakControl.java:367)
	at java.lang.Thread.run(Thread.java:745)




Build Log:
[...truncated 11088 lines...]
   [junit4] Suite: org.apache.solr.cloud.DistribDocExpirationUpdateProcessorTest
   [junit4]   2> Creating dataDir: /Users/jenkins/workspace/Lucene-Solr-master-MacOSX/solr/build/solr-core/test/J0/temp/solr.cloud.DistribDocExpirationUpdateProcessorTest_193C056F71DCA248-001/init-core-data-001
   [junit4]   2> 860593 INFO  (SUITE-DistribDocExpirationUpdateProcessorTest-seed#[193C056F71DCA248]-worker) [    ] o.a.s.SolrTestCaseJ4 Randomized ssl (false) and clientAuth (false)
   [junit4]   2> 860594 INFO  (SUITE-DistribDocExpirationUpdateProcessorTest-seed#[193C056F71DCA248]-worker) [    ] o.a.s.BaseDistributedSearchTestCase Setting hostContext system property: /
   [junit4]   2> 860598 INFO  (TEST-DistribDocExpirationUpdateProcessorTest.test-seed#[193C056F71DCA248]) [    ] o.a.s.c.ZkTestServer STARTING ZK TEST SERVER
   [junit4]   2> 860599 INFO  (Thread-1847) [    ] o.a.s.c.ZkTestServer client port:0.0.0.0/0.0.0.0:0
   [junit4]   2> 860599 INFO  (Thread-1847) [    ] o.a.s.c.ZkTestServer Starting server
   [junit4]   2> 860699 INFO  (TEST-DistribDocExpirationUpdateProcessorTest.test-seed#[193C056F71DCA248]) [    ] o.a.s.c.ZkTestServer start zk server on port:57157
   [junit4]   2> 860699 INFO  (TEST-DistribDocExpirationUpdateProcessorTest.test-seed#[193C056F71DCA248]) [    ] o.a.s.c.c.SolrZkClient Using default ZkCredentialsProvider
   [junit4]   2> 860700 INFO  (TEST-DistribDocExpirationUpdateProcessorTest.test-seed#[193C056F71DCA248]) [    ] o.a.s.c.c.ConnectionManager Waiting for client to connect to ZooKeeper
   [junit4]   2> 860710 INFO  (zkCallback-1638-thread-1) [    ] o.a.s.c.c.ConnectionManager Watcher org.apache.solr.common.cloud.ConnectionManager@6334d7f7 name:ZooKeeperConnection Watcher:127.0.0.1:57157 got event WatchedEvent state:SyncConnected type:None path:null path:null type:None
   [junit4]   2> 860711 INFO  (TEST-DistribDocExpirationUpdateProcessorTest.test-seed#[193C056F71DCA248]) [    ] o.a.s.c.c.ConnectionManager Client is connected to ZooKeeper
   [junit4]   2> 860711 INFO  (TEST-DistribDocExpirationUpdateProcessorTest.test-seed#[193C056F71DCA248]) [    ] o.a.s.c.c.SolrZkClient Using default ZkACLProvider
   [junit4]   2> 860711 INFO  (TEST-DistribDocExpirationUpdateProcessorTest.test-seed#[193C056F71DCA248]) [    ] o.a.s.c.c.SolrZkClient makePath: /solr
   [junit4]   2> 860715 INFO  (TEST-DistribDocExpirationUpdateProcessorTest.test-seed#[193C056F71DCA248]) [    ] o.a.s.c.c.SolrZkClient Using default ZkCredentialsProvider
   [junit4]   2> 860715 INFO  (TEST-DistribDocExpirationUpdateProcessorTest.test-seed#[193C056F71DCA248]) [    ] o.a.s.c.c.ConnectionManager Waiting for client to connect to ZooKeeper
   [junit4]   2> 860717 INFO  (zkCallback-1639-thread-1) [    ] o.a.s.c.c.ConnectionManager Watcher org.apache.solr.common.cloud.ConnectionManager@1ea51076 name:ZooKeeperConnection Watcher:127.0.0.1:57157/solr got event WatchedEvent state:SyncConnected type:None path:null path:null type:None
   [junit4]   2> 860717 INFO  (TEST-DistribDocExpirationUpdateProcessorTest.test-seed#[193C056F71DCA248]) [    ] o.a.s.c.c.ConnectionManager Client is connected to ZooKeeper
   [junit4]   2> 860717 INFO  (TEST-DistribDocExpirationUpdateProcessorTest.test-seed#[193C056F71DCA248]) [    ] o.a.s.c.c.SolrZkClient Using default ZkACLProvider
   [junit4]   2> 860717 INFO  (TEST-DistribDocExpirationUpdateProcessorTest.test-seed#[193C056F71DCA248]) [    ] o.a.s.c.c.SolrZkClient makePath: /collections/collection1
   [junit4]   2> 860720 INFO  (TEST-DistribDocExpirationUpdateProcessorTest.test-seed#[193C056F71DCA248]) [    ] o.a.s.c.c.SolrZkClient makePath: /collections/collection1/shards
   [junit4]   2> 860723 INFO  (TEST-DistribDocExpirationUpdateProcessorTest.test-seed#[193C056F71DCA248]) [    ] o.a.s.c.c.SolrZkClient makePath: /collections/control_collection
   [junit4]   2> 860725 INFO  (TEST-DistribDocExpirationUpdateProcessorTest.test-seed#[193C056F71DCA248]) [    ] o.a.s.c.c.SolrZkClient makePath: /collections/control_collection/shards
   [junit4]   2> 860728 INFO  (TEST-DistribDocExpirationUpdateProcessorTest.test-seed#[193C056F71DCA248]) [    ] o.a.s.c.AbstractZkTestCase put /Users/jenkins/workspace/Lucene-Solr-master-MacOSX/solr/core/src/test-files/solr/collection1/conf/solrconfig-doc-expire-update-processor.xml to /configs/conf1/solrconfig.xml
   [junit4]   2> 860728 INFO  (TEST-DistribDocExpirationUpdateProcessorTest.test-seed#[193C056F71DCA248]) [    ] o.a.s.c.c.SolrZkClient makePath: /configs/conf1/solrconfig.xml
   [junit4]   2> 860732 INFO  (TEST-DistribDocExpirationUpdateProcessorTest.test-seed#[193C056F71DCA248]) [    ] o.a.s.c.AbstractZkTestCase put /Users/jenkins/workspace/Lucene-Solr-master-MacOSX/solr/core/src/test-files/solr/collection1/conf/schema15.xml to /configs/conf1/schema.xml
   [junit4]   2> 860732 INFO  (TEST-DistribDocExpirationUpdateProcessorTest.test-seed#[193C056F71DCA248]) [    ] o.a.s.c.c.SolrZkClient makePath: /configs/conf1/schema.xml
   [junit4]   2> 860735 INFO  (TEST-DistribDocExpirationUpdateProcessorTest.test-seed#[193C056F71DCA248]) [    ] o.a.s.c.AbstractZkTestCase put /Users/jenkins/workspace/Lucene-Solr-master-MacOSX/solr/core/src/test-files/solr/collection1/conf/solrconfig.snippet.randomindexconfig.xml to /configs/conf1/solrconfig.snippet.randomindexconfig.xml
   [junit4]   2> 860735 INFO  (TEST-DistribDocExpirationUpdateProcessorTest.test-seed#[193C056F71DCA248]) [    ] o.a.s.c.c.SolrZkClient makePath: /configs/conf1/solrconfig.snippet.randomindexconfig.xml
   [junit4]   2> 860739 INFO  (TEST-DistribDocExpirationUpdateProcessorTest.test-seed#[193C056F71DCA248]) [    ] o.a.s.c.AbstractZkTestCase put /Users/jenkins/workspace/Lucene-Solr-master-MacOSX/solr/core/src/test-files/solr/collection1/conf/stopwords.txt to /configs/conf1/stopwords.txt
   [junit4]   2> 860739 INFO  (TEST-DistribDocExpirationUpdateProcessorTest.test-seed#[193C056F71DCA248]) [    ] o.a.s.c.c.SolrZkClient makePath: /configs/conf1/stopwords.txt
   [junit4]   2> 860742 INFO  (TEST-DistribDocExpirationUpdateProcessorTest.test-seed#[193C056F71DCA248]) [    ] o.a.s.c.AbstractZkTestCase put /Users/jenkins/workspace/Lucene-Solr-master-MacOSX/solr/core/src/test-files/solr/collection1/conf/protwords.txt to /configs/conf1/protwords.txt
   [junit4]   2> 860742 INFO  (TEST-DistribDocExpirationUpdateProcessorTest.test-seed#[193C056F71DCA248]) [    ] o.a.s.c.c.SolrZkClient makePath: /configs/conf1/protwords.txt
   [junit4]   2> 860745 INFO  (TEST-DistribDocExpirationUpdateProcessorTest.test-seed#[193C056F71DCA248]) [    ] o.a.s.c.AbstractZkTestCase put /Users/jenkins/workspace/Lucene-Solr-master-MacOSX/solr/core/src/test-files/solr/collection1/conf/currency.xml to /configs/conf1/currency.xml
   [junit4]   2> 860745 INFO  (TEST-DistribDocExpirationUpdateProcessorTest.test-seed#[193C056F71DCA248]) [    ] o.a.s.c.c.SolrZkClient makePath: /configs/conf1/currency.xml
   [junit4]   2> 860747 INFO  (TEST-DistribDocExpirationUpdateProcessorTest.test-seed#[193C056F71DCA248]) [    ] o.a.s.c.AbstractZkTestCase put /Users/jenkins/workspace/Lucene-Solr-master-MacOSX/solr/core/src/test-files/solr/collection1/conf/enumsConfig.xml to /configs/conf1/enumsConfig.xml
   [junit4]   2> 860748 INFO  (TEST-DistribDocExpirationUpdateProcessorTest.test-seed#[193C056F71DCA248]) [    ] o.a.s.c.c.SolrZkClient makePath: /configs/conf1/enumsConfig.xml
   [junit4]   2> 860751 INFO  (TEST-DistribDocExpirationUpdateProcessorTest.test-seed#[193C056F71DCA248]) [    ] o.a.s.c.AbstractZkTestCase put /Users/jenkins/workspace/Lucene-Solr-master-MacOSX/solr/core/src/test-files/solr/collection1/conf/open-exchange-rates.json to /configs/conf1/open-exchange-rates.json
   [junit4]   2> 860751 INFO  (TEST-DistribDocExpirationUpdateProcessorTest.test-seed#[193C056F71DCA248]) [    ] o.a.s.c.c.SolrZkClient makePath: /configs/conf1/open-exchange-rates.json
   [junit4]   2> 860754 INFO  (TEST-DistribDocExpirationUpdateProcessorTest.test-seed#[193C056F71DCA248]) [    ] o.a.s.c.AbstractZkTestCase put /Users/jenkins/workspace/Lucene-Solr-master-MacOSX/solr/core/src/test-files/solr/collection1/conf/mapping-ISOLatin1Accent.txt to /configs/conf1/mapping-ISOLatin1Accent.txt
   [junit4]   2> 860754 INFO  (TEST-DistribDocExpirationUpdateProcessorTest.test-seed#[193C056F71DCA248]) [    ] o.a.s.c.c.SolrZkClient makePath: /configs/conf1/mapping-ISOLatin1Accent.txt
   [junit4]   2> 860757 INFO  (TEST-DistribDocExpirationUpdateProcessorTest.test-seed#[193C056F71DCA248]) [    ] o.a.s.c.AbstractZkTestCase put /Users/jenkins/workspace/Lucene-Solr-master-MacOSX/solr/core/src/test-files/solr/collection1/conf/old_synonyms.txt to /configs/conf1/old_synonyms.txt
   [junit4]   2> 860757 INFO  (TEST-DistribDocExpirationUpdateProcessorTest.test-seed#[193C056F71DCA248]) [    ] o.a.s.c.c.SolrZkClient makePath: /configs/conf1/old_synonyms.txt
   [junit4]   2> 860761 INFO  (TEST-DistribDocExpirationUpdateProcessorTest.test-seed#[193C056F71DCA248]) [    ] o.a.s.c.AbstractZkTestCase put /Users/jenkins/workspace/Lucene-Solr-master-MacOSX/solr/core/src/test-files/solr/collection1/conf/synonyms.txt to /configs/conf1/synonyms.txt
   [junit4]   2> 860761 INFO  (TEST-DistribDocExpirationUpdateProcessorTest.test-seed#[193C056F71DCA248]) [    ] o.a.s.c.c.SolrZkClient makePath: /configs/conf1/synonyms.txt
   [junit4]   2> 861153 INFO  (TEST-DistribDocExpirationUpdateProcessorTest.test-seed#[193C056F71DCA248]) [    ] o.a.s.SolrTestCaseJ4 Writing core.properties file to /Users/jenkins/workspace/Lucene-Solr-master-MacOSX/solr/build/solr-core/test/J0/temp/solr.cloud.DistribDocExpirationUpdateProcessorTest_193C056F71DCA248-001/control-001/cores/collection1
   [junit4]   2> 861155 INFO  (TEST-DistribDocExpirationUpdateProcessorTest.test-seed#[193C056F71DCA248]) [    ] o.e.j.s.Server jetty-9.3.8.v20160314
   [junit4]   2> 861159 INFO  (TEST-DistribDocExpirationUpdateProcessorTest.test-seed#[193C056F71DCA248]) [    ] o.e.j.s.h.ContextHandler Started o.e.j.s.ServletContextHandler@43c7ac49{/,null,AVAILABLE}
   [junit4]   2> 861162 INFO  (TEST-DistribDocExpirationUpdateProcessorTest.test-seed#[193C056F71DCA248]) [    ] o.e.j.s.ServerConnector Started ServerConnector@37b9fdc1{HTTP/1.1,[http/1.1]}{127.0.0.1:57161}
   [junit4]   2> 861162 INFO  (TEST-DistribDocExpirationUpdateProcessorTest.test-seed#[193C056F71DCA248]) [    ] o.e.j.s.Server Started @865739ms
   [junit4]   2> 861163 INFO  (TEST-DistribDocExpirationUpdateProcessorTest.test-seed#[193C056F71DCA248]) [    ] o.a.s.c.s.e.JettySolrRunner Jetty properties: {solr.data.dir=/Users/jenkins/workspace/Lucene-Solr-master-MacOSX/solr/build/solr-core/test/J0/temp/solr.cloud.DistribDocExpirationUpdateProcessorTest_193C056F71DCA248-001/tempDir-001/control/data, hostContext=/, hostPort=57161, coreRootDirectory=/Users/jenkins/workspace/Lucene-Solr-master-MacOSX/solr/build/solr-core/test/J0/../../../../../../../../../Users/jenkins/workspace/Lucene-Solr-master-MacOSX/solr/build/solr-core/test/J0/temp/solr.cloud.DistribDocExpirationUpdateProcessorTest_193C056F71DCA248-001/control-001/cores}
   [junit4]   2> 861163 INFO  (TEST-DistribDocExpirationUpdateProcessorTest.test-seed#[193C056F71DCA248]) [    ] o.a.s.s.SolrDispatchFilter SolrDispatchFilter.init(): sun.misc.Launcher$AppClassLoader@4554617c
   [junit4]   2> 861163 INFO  (TEST-DistribDocExpirationUpdateProcessorTest.test-seed#[193C056F71DCA248]) [    ] o.a.s.c.SolrResourceLoader new SolrResourceLoader for directory: '/Users/jenkins/workspace/Lucene-Solr-master-MacOSX/solr/build/solr-core/test/J0/temp/solr.cloud.DistribDocExpirationUpdateProcessorTest_193C056F71DCA248-001/control-001'
   [junit4]   2> 861163 INFO  (TEST-DistribDocExpirationUpdateProcessorTest.test-seed#[193C056F71DCA248]) [    ] o.a.s.c.SolrResourceLoader JNDI not configured for solr (NoInitialContextEx)
   [junit4]   2> 861163 INFO  (TEST-DistribDocExpirationUpdateProcessorTest.test-seed#[193C056F71DCA248]) [    ] o.a.s.c.SolrResourceLoader solr home defaulted to 'solr/' (could not find system property or JNDI)
   [junit4]   2> 861164 INFO  (TEST-DistribDocExpirationUpdateProcessorTest.test-seed#[193C056F71DCA248]) [    ] o.a.s.c.c.SolrZkClient Using default ZkCredentialsProvider
   [junit4]   2> 861166 INFO  (TEST-DistribDocExpirationUpdateProcessorTest.test-seed#[193C056F71DCA248]) [    ] o.a.s.c.c.ConnectionManager Waiting for client to connect to ZooKeeper
   [junit4]   2> 861166 INFO  (zkCallback-1640-thread-1) [    ] o.a.s.c.c.ConnectionManager Watcher org.apache.solr.common.cloud.ConnectionManager@8960e22 name:ZooKeeperConnection Watcher:127.0.0.1:57157/solr got event WatchedEvent state:SyncConnected type:None path:null path:null type:None
   [junit4]   2> 861167 INFO  (TEST-DistribDocExpirationUpdateProcessorTest.test-seed#[193C056F71DCA248]) [    ] o.a.s.c.c.ConnectionManager Client is connected to ZooKeeper
   [junit4]   2> 861167 INFO  (TEST-DistribDocExpirationUpdateProcessorTest.test-seed#[193C056F71DCA248]) [    ] o.a.s.c.c.SolrZkClient Using default ZkACLProvider
   [junit4]   2> 861169 INFO  (TEST-DistribDocExpirationUpdateProcessorTest.test-seed#[193C056F71DCA248]) [    ] o.a.s.s.SolrDispatchFilter Loading solr.xml from SolrHome (not found in ZooKeeper)
   [junit4]   2> 861169 INFO  (TEST-DistribDocExpirationUpdateProcessorTest.test-seed#[193C056F71DCA248]) [    ] o.a.s.c.SolrXmlConfig Loading container configuration from /Users/jenkins/workspace/Lucene-Solr-master-MacOSX/solr/build/solr-core/test/J0/temp/solr.cloud.DistribDocExpirationUpdateProcessorTest_193C056F71DCA248-001/control-001/solr.xml
   [junit4]   2> 861195 INFO  (TEST-DistribDocExpirationUpdateProcessorTest.test-seed#[193C056F71DCA248]) [    ] o.a.s.c.CorePropertiesLocator Config-defined core root directory: /Users/jenkins/workspace/Lucene-Solr-master-MacOSX/solr/build/solr-core/test/J0/../../../../../../../../../Users/jenkins/workspace/Lucene-Solr-master-MacOSX/solr/build/solr-core/test/J0/temp/solr.cloud.DistribDocExpirationUpdateProcessorTest_193C056F71DCA248-001/control-001/cores
   [junit4]   2> 861195 INFO  (TEST-DistribDocExpirationUpdateProcessorTest.test-seed#[193C056F71DCA248]) [    ] o.a.s.c.CoreContainer New CoreContainer 375270978
   [junit4]   2> 861195 INFO  (TEST-DistribDocExpirationUpdateProcessorTest.test-seed#[193C056F71DCA248]) [    ] o.a.s.c.CoreContainer Loading cores into CoreContainer [instanceDir=/Users/jenkins/workspace/Lucene-Solr-master-MacOSX/solr/build/solr-core/test/J0/temp/solr.cloud.DistribDocExpirationUpdateProcessorTest_193C056F71DCA248-001/control-001]
   [junit4]   2> 861195 WARN  (TEST-DistribDocExpirationUpdateProcessorTest.test-seed#[193C056F71DCA248]) [    ] o.a.s.c.CoreContainer Couldn't add files from /Users/jenkins/workspace/Lucene-Solr-master-MacOSX/solr/build/solr-core/test/J0/temp/solr.cloud.DistribDocExpirationUpdateProcessorTest_193C056F71DCA248-001/control-001/lib to classpath: /Users/jenkins/workspace/Lucene-Solr-master-MacOSX/solr/build/solr-core/test/J0/temp/solr.cloud.DistribDocExpirationUpdateProcessorTest_193C056F71DCA248-001/control-001/lib
   [junit4]   2> 861196 INFO  (TEST-DistribDocExpirationUpdateProcessorTest.test-seed#[193C056F71DCA248]) [    ] o.a.s.h.c.HttpShardHandlerFactory created with socketTimeout : 90000,urlScheme : ,connTimeout : 15000,maxConnectionsPerHost : 20,maxConnections : 10000,corePoolSize : 0,maximumPoolSize : 2147483647,maxThreadIdleTime : 5,sizeOfQueue : -1,fairnessPolicy : false,
   [junit4]   2> 861201 INFO  (TEST-DistribDocExpirationUpdateProcessorTest.test-seed#[193C056F71DCA248]) [    ] o.a.s.u.UpdateShardHandler Creating UpdateShardHandler HTTP client with params: 
   [junit4]   2> 861202 INFO  (TEST-DistribDocExpirationUpdateProcessorTest.test-seed#[193C056F71DCA248]) [    ] o.a.s.l.LogWatcher SLF4J impl is org.slf4j.impl.Log4jLoggerFactory
   [junit4]   2> 861202 INFO  (TEST-DistribDocExpirationUpdateProcessorTest.test-seed#[193C056F71DCA248]) [    ] o.a.s.l.LogWatcher Registering Log Listener [Log4j (org.slf4j.impl.Log4jLoggerFactory)]
   [junit4]   2> 861202 INFO  (TEST-DistribDocExpirationUpdateProcessorTest.test-seed#[193C056F71DCA248]) [    ] o.a.s.c.ZkContainer Zookeeper client=127.0.0.1:57157/solr
   [junit4]   2> 861202 INFO  (TEST-DistribDocExpirationUpdateProcessorTest.test-seed#[193C056F71DCA248]) [    ] o.a.s.c.ZkController zkHost includes chroot
   [junit4]   2> 861202 INFO  (TEST-DistribDocExpirationUpdateProcessorTest.test-seed#[193C056F71DCA248]) [    ] o.a.s.c.c.SolrZkClient Using default ZkCredentialsProvider
   [junit4]   2> 861203 INFO  (TEST-DistribDocExpirationUpdateProcessorTest.test-seed#[193C056F71DCA248]) [    ] o.a.s.c.c.ConnectionManager Waiting for client to connect to ZooKeeper
   [junit4]   2> 861205 INFO  (zkCallback-1643-thread-1) [    ] o.a.s.c.c.ConnectionManager Watcher org.apache.solr.common.cloud.ConnectionManager@11292ae2 name:ZooKeeperConnection Watcher:127.0.0.1:57157 got event WatchedEvent state:SyncConnected type:None path:null path:null type:None
   [junit4]   2> 861205 INFO  (TEST-DistribDocExpirationUpdateProcessorTest.test-seed#[193C056F71DCA248]) [    ] o.a.s.c.c.ConnectionManager Client is connected to ZooKeeper
   [junit4]   2> 861206 INFO  (TEST-DistribDocExpirationUpdateProcessorTest.test-seed#[193C056F71DCA248]) [    ] o.a.s.c.c.SolrZkClient Using default ZkACLProvider
   [junit4]   2> 861208 INFO  (TEST-DistribDocExpirationUpdateProcessorTest.test-seed#[193C056F71DCA248]) [n:127.0.0.1:57161_    ] o.a.s.c.c.ConnectionManager Waiting for client to connect to ZooKeeper
   [junit4]   2> 861209 INFO  (zkCallback-1644-thread-1-processing-n:127.0.0.1:57161_) [n:127.0.0.1:57161_    ] o.a.s.c.c.ConnectionManager Watcher org.apache.solr.common.cloud.ConnectionManager@6476dfc2 name:ZooKeeperConnection Watcher:127.0.0.1:57157/solr got event WatchedEvent state:SyncConnected type:None path:null path:null type:None
   [junit4]   2> 861210 INFO  (TEST-DistribDocExpirationUpdateProcessorTest.test-seed#[193C056F71DCA248]) [n:127.0.0.1:57161_    ] o.a.s.c.c.ConnectionManager Client is connected to ZooKeeper
   [junit4]   2> 861211 INFO  (TEST-DistribDocExpirationUpdateProcessorTest.test-seed#[193C056F71DCA248]) [n:127.0.0.1:57161_    ] o.a.s.c.c.SolrZkClient makePath: /overseer/queue
   [junit4]   2> 861214 INFO  (TEST-DistribDocExpirationUpdateProcessorTest.test-seed#[193C056F71DCA248]) [n:127.0.0.1:57161_    ] o.a.s.c.c.SolrZkClient makePath: /overseer/collection-queue-work
   [junit4]   2> 861220 INFO  (TEST-DistribDocExpirationUpdateProcessorTest.test-seed#[193C056F71DCA248]) [n:127.0.0.1:57161_    ] o.a.s.c.c.SolrZkClient makePath: /overseer/collection-map-running
   [junit4]   2> 861224 INFO  (TEST-DistribDocExpirationUpdateProcessorTest.test-seed#[193C056F71DCA248]) [n:127.0.0.1:57161_    ] o.a.s.c.c.SolrZkClient makePath: /overseer/collection-map-completed
   [junit4]   2> 861228 INFO  (TEST-DistribDocExpirationUpdateProcessorTest.test-seed#[193C056F71DCA248]) [n:127.0.0.1:57161_    ] o.a.s.c.c.SolrZkClient makePath: /overseer/collection-map-failure
   [junit4]   2> 861233 INFO  (TEST-DistribDocExpirationUpdateProcessorTest.test-seed#[193C056F71DCA248]) [n:127.0.0.1:57161_    ] o.a.s.c.c.SolrZkClient makePath: /live_nodes
   [junit4]   2> 861238 INFO  (TEST-DistribDocExpirationUpdateProcessorTest.test-seed#[193C056F71DCA248]) [n:127.0.0.1:57161_    ] o.a.s.c.c.SolrZkClient makePath: /aliases.json
   [junit4]   2> 861263 INFO  (TEST-DistribDocExpirationUpdateProcessorTest.test-seed#[193C056F71DCA248]) [n:127.0.0.1:57161_    ] o.a.s.c.c.SolrZkClient makePath: /clusterstate.json
   [junit4]   2> 861265 INFO  (TEST-DistribDocExpirationUpdateProcessorTest.test-seed#[193C056F71DCA248]) [n:127.0.0.1:57161_    ] o.a.s.c.c.SolrZkClient makePath: /security.json
   [junit4]   2> 861266 INFO  (TEST-DistribDocExpirationUpdateProcessorTest.test-seed#[193C056F71DCA248]) [n:127.0.0.1:57161_    ] o.a.s.c.c.ZkStateReader Updating cluster state from ZooKeeper... 
   [junit4]   2> 861269 INFO  (TEST-DistribDocExpirationUpdateProcessorTest.test-seed#[193C056F71DCA248]) [n:127.0.0.1:57161_    ] o.a.s.c.c.ZkStateReader Updated live nodes from ZooKeeper... (0) -> (0)
   [junit4]   2> 861278 INFO  (TEST-DistribDocExpirationUpdateProcessorTest.test-seed#[193C056F71DCA248]) [n:127.0.0.1:57161_    ] o.a.s.c.c.SolrZkClient makePath: /overseer_elect
   [junit4]   2> 861281 INFO  (TEST-DistribDocExpirationUpdateProcessorTest.test-seed#[193C056F71DCA248]) [n:127.0.0.1:57161_    ] o.a.s.c.c.SolrZkClient makePath: /overseer_elect/election
   [junit4]   2> 861282 INFO  (TEST-DistribDocExpirationUpdateProcessorTest.test-seed#[193C056F71DCA248]) [n:127.0.0.1:57161_    ] o.a.s.c.Overseer Overseer (id=null) closing
   [junit4]   2> 861283 INFO  (TEST-DistribDocExpirationUpdateProcessorTest.test-seed#[193C056F71DCA248]) [n:127.0.0.1:57161_    ] o.a.s.c.LeaderElector Joined leadership election with path: /overseer_elect/election/95707645856841732-127.0.0.1:57161_-n_0000000000
   [junit4]   2> 861284 INFO  (TEST-DistribDocExpirationUpdateProcessorTest.test-seed#[193C056F71DCA248]) [n:127.0.0.1:57161_    ] o.a.s.c.OverseerElectionContext I am going to be the leader 127.0.0.1:57161_
   [junit4]   2> 861284 INFO  (TEST-DistribDocExpirationUpdateProcessorTest.test-seed#[193C056F71DCA248]) [n:127.0.0.1:57161_    ] o.a.s.c.c.SolrZkClient makePath: /overseer_elect/leader
   [junit4]   2> 861286 INFO  (TEST-DistribDocExpirationUpdateProcessorTest.test-seed#[193C056F71DCA248]) [n:127.0.0.1:57161_    ] o.a.s.c.Overseer Overseer (id=95707645856841732-127.0.0.1:57161_-n_0000000000) starting
   [junit4]   2> 861288 INFO  (TEST-DistribDocExpirationUpdateProcessorTest.test-seed#[193C056F71DCA248]) [n:127.0.0.1:57161_    ] o.a.s.c.c.SolrZkClient makePath: /overseer/queue-work
   [junit4]   2> 861303 INFO  (TEST-DistribDocExpirationUpdateProcessorTest.test-seed#[193C056F71DCA248]) [n:127.0.0.1:57161_    ] o.a.s.c.OverseerAutoReplicaFailoverThread Starting OverseerAutoReplicaFailoverThread autoReplicaFailoverWorkLoopDelay=10000 autoReplicaFailoverWaitAfterExpiration=30000 autoReplicaFailoverBadNodeExpiration=60000
   [junit4]   2> 861304 INFO  (OverseerCollectionConfigSetProcessor-95707645856841732-127.0.0.1:57161_-n_0000000000) [n:127.0.0.1:57161_    ] o.a.s.c.OverseerTaskProcessor Process current queue of overseer operations
   [junit4]   2> 861304 INFO  (OverseerStateUpdate-95707645856841732-127.0.0.1:57161_-n_0000000000) [n:127.0.0.1:57161_    ] o.a.s.c.Overseer Starting to work on the main queue
   [junit4]   2> 861306 INFO  (TEST-DistribDocExpirationUpdateProcessorTest.test-seed#[193C056F71DCA248]) [n:127.0.0.1:57161_    ] o.a.s.c.ZkController Register node as live in ZooKeeper:/live_nodes/127.0.0.1:57161_
   [junit4]   2> 861308 INFO  (OverseerStateUpdate-95707645856841732-127.0.0.1:57161_-n_0000000000) [n:127.0.0.1:57161_    ] o.a.s.c.c.ZkStateReader Updated live nodes from ZooKeeper... (0) -> (0)
   [junit4]   2> 861309 INFO  (TEST-DistribDocExpirationUpdateProcessorTest.test-seed#[193C056F71DCA248]) [n:127.0.0.1:57161_    ] o.a.s.c.c.SolrZkClient makePath: /live_nodes/127.0.0.1:57161_
   [junit4]   2> 861310 INFO  (zkCallback-1644-thread-1-processing-n:127.0.0.1:57161_) [n:127.0.0.1:57161_    ] o.a.s.c.c.ZkStateReader A live node change: [WatchedEvent state:SyncConnected type:NodeChildrenChanged path:/live_nodes], has occurred - updating... (live nodes size: [0])
   [junit4]   2> 861311 INFO  (zkCallback-1644-thread-1-processing-n:127.0.0.1:57161_) [n:127.0.0.1:57161_    ] o.a.s.c.c.ZkStateReader Updated live nodes from ZooKeeper... (0) -> (1)
   [junit4]   2> 861339 INFO  (TEST-DistribDocExpirationUpdateProcessorTest.test-seed#[193C056F71DCA248]) [n:127.0.0.1:57161_    ] o.a.s.c.CoreContainer Security conf doesn't exist. Skipping setup for authorization module.
   [junit4]   2> 861339 INFO  (TEST-DistribDocExpirationUpdateProcessorTest.test-seed#[193C056F71DCA248]) [n:127.0.0.1:57161_    ] o.a.s.c.CoreContainer No authentication plugin used.
   [junit4]   2> 861347 INFO  (TEST-DistribDocExpirationUpdateProcessorTest.test-seed#[193C056F71DCA248]) [n:127.0.0.1:57161_    ] o.a.s.c.CorePropertiesLocator Looking for core definitions underneath /Users/jenkins/workspace/Lucene-Solr-master-MacOSX/solr/build/solr-core/test/J0/../../../../../../../../../Users/jenkins/workspace/Lucene-Solr-master-MacOSX/solr/build/solr-core/test/J0/temp/solr.cloud.DistribDocExpirationUpdateProcessorTest_193C056F71DCA248-001/control-001/cores
   [junit4]   2> 861374 INFO  (TEST-DistribDocExpirationUpdateProcessorTest.test-seed#[193C056F71DCA248]) [n:127.0.0.1:57161_    ] o.a.s.c.CoreDescriptor Created CoreDescriptor: {name=collection1, config=solrconfig.xml, transient=false, schema=schema.xml, loadOnStartup=true, configSetProperties=configsetprops.json, collection=control_collection, coreNodeName=, dataDir=data/, shard=}
   [junit4]   2> 861375 INFO  (TEST-DistribDocExpirationUpdateProcessorTest.test-seed#[193C056F71DCA248]) [n:127.0.0.1:57161_    ] o.a.s.c.CorePropertiesLocator Found core collection1 in /Users/jenkins/workspace/Lucene-Solr-master-MacOSX/solr/build/solr-core/test/J0/../../../../../../../../../Users/jenkins/workspace/Lucene-Solr-master-MacOSX/solr/build/solr-core/test/J0/temp/solr.cloud.DistribDocExpirationUpdateProcessorTest_193C056F71DCA248-001/control-001/cores/collection1
   [junit4]   2> 861375 INFO  (TEST-DistribDocExpirationUpdateProcessorTest.test-seed#[193C056F71DCA248]) [n:127.0.0.1:57161_    ] o.a.s.c.CorePropertiesLocator Found 1 core definitions
   [junit4]   2> 861377 INFO  (coreLoadExecutor-2639-thread-1-processing-n:127.0.0.1:57161_) [n:127.0.0.1:57161_ c:control_collection   x:collection1] o.a.s.c.ZkController publishing state=down
   [junit4]   2> 861377 INFO  (coreLoadExecutor-2639-thread-1-processing-n:127.0.0.1:57161_) [n:127.0.0.1:57161_ c:control_collection   x:collection1] o.a.s.c.ZkController numShards not found on descriptor - reading it from system property
   [junit4]   2> 861378 INFO  (TEST-DistribDocExpirationUpdateProcessorTest.test-seed#[193C056F71DCA248]) [n:127.0.0.1:57161_    ] o.a.s.s.SolrDispatchFilter user.dir=/Users/jenkins/workspace/Lucene-Solr-master-MacOSX/solr/build/solr-core/test/J0
   [junit4]   2> 861378 INFO  (TEST-DistribDocExpirationUpdateProcessorTest.test-seed#[193C056F71DCA248]) [n:127.0.0.1:57161_    ] o.a.s.s.SolrDispatchFilter SolrDispatchFilter.init() done
   [junit4]   2> 861380 INFO  (OverseerStateUpdate-95707645856841732-127.0.0.1:57161_-n_0000000000) [n:127.0.0.1:57161_    ] o.a.s.c.Overseer processMessage: queueSize: 1, message = {
   [junit4]   2>   "core":"collection1",
   [junit4]   2>   "roles":null,
   [junit4]   2>   "base_url":"http://127.0.0.1:57161",
   [junit4]   2>   "node_name":"127.0.0.1:57161_",
   [junit4]   2>   "numShards":"1",
   [junit4]   2>   "state":"down",
   [junit4]   2>   "shard":null,
   [junit4]   2>   "collection":"control_collection",
   [junit4]   2>   "operation":"state"} current state version: 0
   [junit4]   2> 861380 INFO  (coreLoadExecutor-2639-thread-1-processing-n:127.0.0.1:57161_) [n:127.0.0.1:57161_ c:control_collection   x:collection1] o.a.s.c.ZkController look for our core node name
   [junit4]   2> 861381 INFO  (OverseerStateUpdate-95707645856841732-127.0.0.1:57161_-n_0000000000) [n:127.0.0.1:57161_    ] o.a.s.c.o.ReplicaMutator Update state numShards=1 message={
   [junit4]   2>   "core":"collection1",
   [junit4]   2>   "roles":null,
   [junit4]   2>   "base_url":"http://127.0.0.1:57161",
   [junit4]   2>   "node_name":"127.0.0.1:57161_",
   [junit4]   2>   "numShards":"1",
   [junit4]   2>   "state":"down",
   [junit4]   2>   "shard":null,
   [junit4]   2>   "collection":"control_collection",
   [junit4]   2>   "operation":"state"}
   [junit4]   2> 861381 INFO  (OverseerStateUpdate-95707645856841732-127.0.0.1:57161_-n_0000000000) [n:127.0.0.1:57161_    ] o.a.s.c.o.ClusterStateMutator building a new cName: control_collection
   [junit4]   2> 861382 INFO  (OverseerStateUpdate-95707645856841732-127.0.0.1:57161_-n_0000000000) [n:127.0.0.1:57161_    ] o.a.s.c.o.ReplicaMutator Assigning new node to shard shard=shard1
   [junit4]   2> 861384 INFO  (zkCallback-1644-thread-1-processing-n:127.0.0.1:57161_) [n:127.0.0.1:57161_    ] o.a.s.c.c.ZkStateReader A cluster state change: [WatchedEvent state:SyncConnected type:NodeDataChanged path:/clusterstate.json], has occurred - updating... (live nodes size: [1])
   [junit4]   2> 862382 INFO  (coreLoadExecutor-2639-thread-1-processing-n:127.0.0.1:57161_) [n:127.0.0.1:57161_ c:control_collection   x:collection1] o.a.s.c.ZkController waiting to find shard id in clusterstate for collection1
   [junit4]   2> 862382 INFO  (coreLoadExecutor-2639-thread-1-processing-n:127.0.0.1:57161_) [n:127.0.0.1:57161_ c:control_collection   x:collection1] o.a.s.c.ZkController Check for collection zkNode:control_collection
   [junit4]   2> 862383 INFO  (coreLoadExecutor-2639-thread-1-processing-n:127.0.0.1:57161_) [n:127.0.0.1:57161_ c:control_collection   x:collection1] o.a.s.c.ZkController Collection zkNode exists
   [junit4]   2> 862383 INFO  (coreLoadExecutor-2639-thread-1-processing-n:127.0.0.1:57161_) [n:127.0.0.1:57161_ c:control_collection   x:collection1] o.a.s.c.c.ZkStateReader Load collection config from: [/collections/control_collection]
   [junit4]   2> 862384 INFO  (coreLoadExecutor-2639-thread-1-processing-n:127.0.0.1:57161_) [n:127.0.0.1:57161_ c:control_collection   x:collection1] o.a.s.c.c.ZkStateReader path=[/collections/control_collection] [configName]=[conf1] specified config exists in ZooKeeper
   [junit4]   2> 862384 INFO  (coreLoadExecutor-2639-thread-1-processing-n:127.0.0.1:57161_) [n:127.0.0.1:57161_ c:control_collection   x:collection1] o.a.s.c.SolrResourceLoader new SolrResourceLoader for directory: '/Users/jenkins/workspace/Lucene-Solr-master-MacOSX/solr/build/solr-core/test/J0/temp/solr.cloud.DistribDocExpirationUpdateProcessorTest_193C056F71DCA248-001/control-001/cores/collection1'
   [junit4]   2> 862385 INFO  (coreLoadExecutor-2639-thread-1-processing-n:127.0.0.1:57161_) [n:127.0.0.1:57161_ c:control_collection   x:collection1] o.a.s.c.SolrResourceLoader JNDI not configured for solr (NoInitialContextEx)
   [junit4]   2> 862385 INFO  (coreLoadExecutor-2639-thread-1-processing-n:127.0.0.1:57161_) [n:127.0.0.1:57161_ c:control_collection   x:collection1] o.a.s.c.SolrResourceLoader solr home defaulted to 'solr/' (could not find system property or JNDI)
   [junit4]   2> 862388 INFO  (coreLoadExecutor-2639-thread-1-processing-n:127.0.0.1:57161_) [n:127.0.0.1:57161_ c:control_collection   x:collection1] o.a.s.c.Config loaded config solrconfig.xml with version 0 
   [junit4]   2> 862397 INFO  (coreLoadExecutor-2639-thread-1-processing-n:127.0.0.1:57161_) [n:127.0.0.1:57161_ c:control_collection   x:collection1] o.a.s.c.SolrConfig current version of requestparams : -1
   [junit4]   2> 862406 INFO  (coreLoadExecutor-2639-thread-1-processing-n:127.0.0.1:57161_) [n:127.0.0.1:57161_ c:control_collection   x:collection1] o.a.s.c.SolrConfig Using Lucene MatchVersion: 7.0.0
   [junit4]   2> 862419 INFO  (coreLoadExecutor-2639-thread-1-processing-n:127.0.0.1:57161_) [n:127.0.0.1:57161_ c:control_collection   x:collection1] o.a.s.c.SolrConfig Loaded SolrConfig: solrconfig.xml
   [junit4]   2> 862425 INFO  (coreLoadExecutor-2639-thread-1-processing-n:127.0.0.1:57161_) [n:127.0.0.1:57161_ c:control_collection   x:collection1] o.a.s.s.IndexSchema [collection1] Schema name=test
   [junit4]   2> 862546 INFO  (coreLoadExecutor-2639-thread-1-processing-n:127.0.0.1:57161_) [n:127.0.0.1:57161_ c:control_collection   x:collection1] o.a.s.s.IndexSchema default search field in schema is text
   [junit4]   2> 862547 INFO  (coreLoadExecutor-2639-thread-1-processing-n:127.0.0.1:57161_) [n:127.0.0.1:57161_ c:control_collection   x:collection1] o.a.s.s.IndexSchema unique key field: id
   [junit4]   2> 862548 INFO  (coreLoadExecutor-2639-thread-1-processing-n:127.0.0.1:57161_) [n:127.0.0.1:57161_ c:control_collection   x:collection1] o.a.s.s.FileExchangeRateProvider Reloading exchange rates from file currency.xml
   [junit4]   2> 862551 INFO  (coreLoadExecutor-2639-thread-1-processing-n:127.0.0.1:57161_) [n:127.0.0.1:57161_ c:control_collection   x:collection1] o.a.s.s.FileExchangeRateProvider Reloading exchange rates from file currency.xml
   [junit4]   2> 862581 INFO  (coreLoadExecutor-2639-thread-1-processing-n:127.0.0.1:57161_) [n:127.0.0.1:57161_ c:control_collection   x:collection1] o.a.s.c.ConfigSetProperties Did not find ConfigSet properties, assuming default properties: Can't find resource 'configsetprops.json' in classpath or '/configs/conf1', cwd=/Users/jenkins/workspace/Lucene-Solr-master-MacOSX/solr/build/solr-core/test/J0
   [junit4]   2> 862582 INFO  (coreLoadExecutor-2639-thread-1-processing-n:127.0.0.1:57161_) [n:127.0.0.1:57161_ c:control_collection   x:collection1] o.a.s.c.CoreContainer Creating SolrCore 'collection1' using configuration from collection control_collection
   [junit4]   2> 862582 INFO  (coreLoadExecutor-2639-thread-1-processing-n:127.0.0.1:57161_) [n:127.0.0.1:57161_ c:control_collection s:shard1 r:core_node1 x:collection1] o.a.s.c.SolrCore org.apache.solr.core.MockDirectoryFactory
   [junit4]   2> 862582 INFO  (coreLoadExecutor-2639-thread-1-processing-n:127.0.0.1:57161_) [n:127.0.0.1:57161_ c:control_collection s:shard1 r:core_node1 x:collection1] o.a.s.c.SolrCore [[collection1] ] Opening new SolrCore at [/Users/jenkins/workspace/Lucene-Solr-master-MacOSX/solr/build/solr-core/test/J0/temp/solr.cloud.DistribDocExpirationUpdateProcessorTest_193C056F71DCA248-001/control-001/cores/collection1], dataDir=[/Users/jenkins/workspace/Lucene-Solr-master-MacOSX/solr/build/solr-core/test/J0/../../../../../../../../../Users/jenkins/workspace/Lucene-Solr-master-MacOSX/solr/build/solr-core/test/J0/temp/solr.cloud.DistribDocExpirationUpdateProcessorTest_193C056F71DCA248-001/control-001/cores/collection1/data/]
   [junit4]   2> 862582 INFO  (coreLoadExecutor-2639-thread-1-processing-n:127.0.0.1:57161_) [n:127.0.0.1:57161_ c:control_collection s:shard1 r:core_node1 x:collection1] o.a.s.c.SolrCore JMX monitoring not detected for core: collection1
   [junit4]   2> 862583 INFO  (coreLoadExecutor-2639-thread-1-processing-n:127.0.0.1:57161_) [n:127.0.0.1:57161_ c:control_collection s:shard1 r:core_node1 x:collection1] o.a.s.c.CachingDirectoryFactory return new directory for /Users/jenkins/workspace/Lucene-Solr-master-MacOSX/solr/build/solr-core/test/J0/../../../../../../../../../Users/jenkins/workspace/Lucene-Solr-master-MacOSX/solr/build/solr-core/test/J0/temp/solr.cloud.DistribDocExpirationUpdateProcessorTest_193C056F71DCA248-001/control-001/cores/collection1/data
   [junit4]   2> 862583 INFO  (coreLoadExecutor-2639-thread-1-processing-n:127.0.0.1:57161_) [n:127.0.0.1:57161_ c:control_collection s:shard1 r:core_node1 x:collection1] o.a.s.c.SolrCore New index directory detected: old=null new=/Users/jenkins/workspace/Lucene-Solr-master-MacOSX/solr/build/solr-core/test/J0/../../../../../../../../../Users/jenkins/workspace/Lucene-Solr-master-MacOSX/solr/build/solr-core/test/J0/temp/solr.cloud.DistribDocExpirationUpdateProcessorTest_193C056F71DCA248-001/control-001/cores/collection1/data/index/
   [junit4]   2> 862583 WARN  (coreLoadExecutor-2639-thread-1-processing-n:127.0.0.1:57161_) [n:127.0.0.1:57161_ c:control_collection s:shard1 r:core_node1 x:collection1] o.a.s.c.SolrCore [collection1] Solr index directory '/Users/jenkins/workspace/Lucene-Solr-master-MacOSX/solr/build/solr-core/test/J0/../../../../../../../../../Users/jenkins/workspace/Lucene-Solr-master-MacOSX/solr/build/solr-core/test/J0/temp/solr.cloud.DistribDocExpirationUpdateProcessorTest_193C056F71DCA248-001/control-001/cores/collection1/data/index' doesn't exist. Creating new index...
   [junit4]   2> 862583 INFO  (coreLoadExecutor-2639-thread-1-processing-n:127.0.0.1:57161_) [n:127.0.0.1:57161_ c:control_collection s:shard1 r:core_node1 x:collection1] o.a.s.c.CachingDirectoryFactory return new directory for /Users/jenkins/workspace/Lucene-Solr-master-MacOSX/solr/build/solr-core/test/J0/../../../../../../../../../Users/jenkins/workspace/Lucene-Solr-master-MacOSX/solr/build/solr-core/test/J0/temp/solr.cloud.DistribDocExpirationUpdateProcessorTest_193C056F71DCA248-001/control-001/cores/collection1/data/index
   [junit4]   2> 862584 INFO  (coreLoadExecutor-2639-thread-1-processing-n:127.0.0.1:57161_) [n:127.0.0.1:57161_ c:control_collection s:shard1 r:core_node1 x:collection1] o.a.s.u.RandomMergePolicy RandomMergePolicy wrapping class org.apache.lucene.index.AlcoholicMergePolicy: [AlcoholicMergePolicy: minMergeSize=0, mergeFactor=10, maxMergeSize=452847925, maxMergeSizeForForcedMerge=9223372036854775807, calibrateSizeByDeletes=true, maxMergeDocs=2147483647, maxCFSSegmentSizeMB=8.796093022207999E12, noCFSRatio=0.1]
   [junit4]   2> 862584 INFO  (coreLoadExecutor-2639-thread-1-processing-n:127.0.0.1:57161_) [n:127.0.0.1:57161_ c:control_collection s:shard1 r:core_node1 x:collection1] o.a.s.c.SolrDeletionPolicy SolrDeletionPolicy.onCommit: commits: num=1
   [junit4]   2> 	commit{dir=MockDirectoryWrapper(RAMDirectory@70c07c84 lockFactory=org.apache.lucene.store.SingleInstanceLockFactory@5eb6976f),segFN=segments_1,generation=1}
   [junit4]   2> 862584 INFO  (coreLoadExecutor-2639-thread-1-processing-n:127.0.0.1:57161_) [n:127.0.0.1:57161_ c:control_collection s:shard1 r:core_node1 x:collection1] o.a.s.c.SolrDeletionPolicy newest commit generation = 1
   [junit4]   2> 862585 INFO  (OldIndexDirectoryCleanupThreadForCore-collection1) [n:127.0.0.1:57161_ c:control_collection s:shard1 r:core_node1 x:collection1] o.a.s.c.SolrCore Looking for old index directories to cleanup for core collection1 in /Users/jenkins/workspace/Lucene-Solr-master-MacOSX/solr/build/solr-core/test/J0/../../../../../../../../../Users/jenkins/workspace/Lucene-Solr-master-MacOSX/solr/build/solr-core/test/J0/temp/solr.cloud.DistribDocExpirationUpdateProcessorTest_193C056F71DCA248-001/control-001/cores/collection1/data/
   [junit4]   2> 862585 WARN  (OldIndexDirectoryCleanupThreadForCore-collection1) [n:127.0.0.1:57161_ c:control_collection s:shard1 r:core_node1 x:collection1] o.a.s.c.DirectoryFactory /Users/jenkins/workspace/Lucene-Solr-master-MacOSX/solr/build/solr-core/test/J0/../../../../../../../../../Users/jenkins/workspace/Lucene-Solr-master-MacOSX/solr/build/solr-core/test/J0/temp/solr.cloud.DistribDocExpirationUpdateProcessorTest_193C056F71DCA248-001/control-001/cores/collection1/data/ does not point to a valid data directory; skipping clean-up of old index directories.
   [junit4]   2> 862587 INFO  (coreLoadExecutor-2639-thread-1-processing-n:127.0.0.1:57161_) [n:127.0.0.1:57161_ c:control_collection s:shard1 r:core_node1 x:collection1] o.a.s.u.p.UpdateRequestProcessorChain creating updateRequestProcessorChain "convert-ttl-defaults"
   [junit4]   2> 862625 INFO  (coreLoadExecutor-2639-thread-1-processing-n:127.0.0.1:57161_) [n:127.0.0.1:57161_ c:control_collection s:shard1 r:core_node1 x:collection1] o.a.s.u.p.UpdateRequestProcessorChain creating updateRequestProcessorChain "convert-ttl-field"
   [junit4]   2> 862668 INFO  (coreLoadExecutor-2639-thread-1-processing-n:127.0.0.1:57161_) [n:127.0.0.1:57161_ c:control_collection s:shard1 r:core_node1 x:collection1] o.a.s.u.p.UpdateRequestProcessorChain creating updateRequestProcessorChain "convert-ttl-param"
   [junit4]   2> 862668 INFO  (coreLoadExecutor-2639-thread-1-processing-n:127.0.0.1:57161_) [n:127.0.0.1:57161_ c:control_collection s:shard1 r:core_node1 x:collection1] o.a.s.u.p.UpdateRequestProcessorChain creating updateRequestProcessorChain "convert-ttl-field-with-param-default"
   [junit4]   2> 862668 INFO  (coreLoadExecutor-2639-thread-1-processing-n:127.0.0.1:57161_) [n:127.0.0.1:57161_ c:control_collection s:shard1 r:core_node1 x:collection1] o.a.s.u.p.UpdateRequestProcessorChain creating updateRequestProcessorChain "scheduled-delete" (default)
   [junit4]   2> 862711 INFO  (coreLoadExecutor-2639-thread-1-processing-n:127.0.0.1:57161_) [n:127.0.0.1:57161_ c:control_collection s:shard1 r:core_node1 x:collection1] o.a.s.u.p.UpdateRequestProcessorChain inserting DistributedUpdateProcessorFactory into updateRequestProcessorChain "scheduled-delete" (default)
   [junit4]   2> 862716 INFO  (coreLoadExecutor-2639-thread-1-processing-n:127.0.0.1:57161_) [n:127.0.0.1:57161_ c:control_collection s:shard1 r:core_node1 x:collection1] o.a.s.h.l.XMLLoader xsltCacheLifetimeSeconds=60
   [junit4]   2> 862717 INFO  (coreLoadExecutor-2639-thread-1-processing-n:127.0.0.1:57161_) [n:127.0.0.1:57161_ c:control_collection s:shard1 r:core_node1 x:collection1] o.a.s.h.l.XMLLoader xsltCacheLifetimeSeconds=60
   [junit4]   2> 862718 INFO  (coreLoadExecutor-2639-thread-1-processing-n:127.0.0.1:57161_) [n:127.0.0.1:57161_ c:control_collection s:shard1 r:core_node1 x:collection1] o.a.s.h.l.XMLLoader xsltCacheLifetimeSeconds=60
   [junit4]   2> 862719 INFO  (coreLoadExecutor-2639-thread-1-processing-n:127.0.0.1:57161_) [n:127.0.0.1:57161_ c:control_collection s:shard1 r:core_node1 x:collection1] o.a.s.h.l.XMLLoader xsltCacheLifetimeSeconds=60
   [junit4]   2> 862721 INFO  (coreLoadExecutor-2639-thread-1-processing-n:127.0.0.1:57161_) [n:127.0.0.1:57161_ c:control_collection s:shard1 r:core_node1 x:collection1] o.a.s.c.RequestHandlers Registered paths: /admin/mbeans,,/update/csv,/sql,/update/json/docs,/admin/luke,/export,/select,/admin/segments,/get,/admin/system,/replication,/admin/properties,/config,/stream,/schema,/admin/plugins,/admin/logging,/update/json,/admin/ping,/admin/threads,/update,/admin/file
   [junit4]   2> 862721 INFO  (coreLoadExecutor-2639-thread-1-processing-n:127.0.0.1:57161_) [n:127.0.0.1:57161_ c:control_collection s:shard1 r:core_node1 x:collection1] o.a.s.c.SolrCore Using default statsCache cache: org.apache.solr.search.stats.LocalStatsCache
   [junit4]   2> 862722 INFO  (coreLoadExecutor-2639-thread-1-processing-n:127.0.0.1:57161_) [n:127.0.0.1:57161_ c:control_collection s:shard1 r:core_node1 x:collection1] o.a.s.u.UpdateHandler Using UpdateLog implementation: org.apache.solr.update.UpdateLog
   [junit4]   2> 862722 INFO  (coreLoadExecutor-2639-thread-1-processing-n:127.0.0.1:57161_) [n:127.0.0.1:57161_ c:control_collection s:shard1 r:core_node1 x:collection1] o.a.s.u.UpdateLog Initializing UpdateLog: dataDir= defaultSyncLevel=FLUSH numRecordsToKeep=100 maxNumLogsToKeep=10 numVersionBuckets=65536
   [junit4]   2> 862724 INFO  (coreLoadExecutor-2639-thread-1-processing-n:127.0.0.1:57161_) [n:127.0.0.1:57161_ c:control_collection s:shard1 r:core_node1 x:collection1] o.a.s.u.CommitTracker Hard AutoCommit: disabled
   [junit4]   2> 862724 INFO  (coreLoadExecutor-2639-thread-1-processing-n:127.0.0.1:57161_) [n:127.0.0.1:57161_ c:control_collection s:shard1 r:core_node1 x:collection1] o.a.s.u.CommitTracker Soft AutoCommit: disabled
   [junit4]   2> 862724 INFO  (coreLoadExecutor-2639-thread-1-processing-n:127.0.0.1:57161_) [n:127.0.0.1:57161_ c:control_collection s:shard1 r:core_node1 x:collection1] o.a.s.u.RandomMergePolicy RandomMergePolicy wrapping class org.apache.lucene.index.LogByteSizeMergePolicy: [LogByteSizeMergePolicy: minMergeSize=1677721, mergeFactor=35, maxMergeSize=2147483648, maxMergeSizeForForcedMerge=9223372036854775807, calibrateSizeByDeletes=true, maxMergeDocs=2147483647, maxCFSSegmentSizeMB=8.796093022207999E12, noCFSRatio=1.0]
   [junit4]   2> 862724 INFO  (coreLoadExecutor-2639-thread-1-processing-n:127.0.0.1:57161_) [n:127.0.0.1:57161_ c:control_collection s:shard1 r:core_node1 x:collection1] o.a.s.c.SolrDeletionPolicy SolrDeletionPolicy.onInit: commits: num=1
   [junit4]   2> 	commit{dir=MockDirectoryWrapper(RAMDirectory@70c07c84 lockFactory=org.apache.lucene.store.SingleInstanceLockFactory@5eb6976f),segFN=segments_1,generation=1}
   [junit4]   2> 862724 INFO  (coreLoadExecutor-2639-thread-1-processing-n:127.0.0.1:57161_) [n:127.0.0.1:57161_ c:control_collection s:shard1 r:core_node1 x:collection1] o.a.s.c.SolrDeletionPolicy newest commit generation = 1
   [junit4]   2> 862725 INFO  (coreLoadExecutor-2639-thread-1-processing-n:127.0.0.1:57161_) [n:127.0.0.1:57161_ c:control_collection s:shard1 r:core_node1 x:collection1] o.a.s.s.SolrIndexSearcher Opening [Searcher@5c74306f[collection1] main]
   [junit4]   2> 862725 INFO  (coreLoadExecutor-2639-thread-1-processing-n:127.0.0.1:57161_) [n:127.0.0.1:57161_ c:control_collection s:shard1 r:core_node1 x:collection1] o.a.s.c.c.ZkStateReader Load collection config from: [/collections/control_collection]
   [junit4]   2> 862726 INFO  (coreLoadExecutor-2639-thread-1-processing-n:127.0.0.1:57161_) [n:127.0.0.1:57161_ c:control_collection s:shard1 r:core_node1 x:collection1] o.a.s.c.c.ZkStateReader path=[/collections/control_collection] [configName]=[conf1] specified config exists in ZooKeeper
   [junit4]   2> 862726 INFO  (coreLoadExecutor-2639-thread-1-processing-n:127.0.0.1:57161_) [n:127.0.0.1:57161_ c:control_collection s:shard1 r:core_node1 x:collection1] o.a.s.r.ManagedResourceStorage Setting up ZooKeeper-based storage for the RestManager with znodeBase: /configs/conf1
   [junit4]   2> 862727 INFO  (coreLoadExecutor-2639-thread-1-processing-n:127.0.0.1:57161_) [n:127.0.0.1:57161_ c:control_collection s:shard1 r:core_node1 x:collection1] o.a.s.r.ManagedResourceStorage Configured ZooKeeperStorageIO with znodeBase: /configs/conf1
   [junit4]   2> 862727 INFO  (coreLoadExecutor-2639-thread-1-processing-n:127.0.0.1:57161_) [n:127.0.0.1:57161_ c:control_collection s:shard1 r:core_node1 x:collection1] o.a.s.r.RestManager Initializing RestManager with initArgs: {}
   [junit4]   2> 862727 INFO  (coreLoadExecutor-2639-thread-1-processing-n:127.0.0.1:57161_) [n:127.0.0.1:57161_ c:control_collection s:shard1 r:core_node1 x:collection1] o.a.s.r.ManagedResourceStorage Reading _rest_managed.json using ZooKeeperStorageIO:path=/configs/conf1
   [junit4]   2> 862727 INFO  (coreLoadExecutor-2639-thread-1-processing-n:127.0.0.1:57161_) [n:127.0.0.1:57161_ c:control_collection s:shard1 r:core_node1 x:collection1] o.a.s.r.ManagedResourceStorage No data found for znode /configs/conf1/_rest_managed.json
   [junit4]   2> 862728 INFO  (coreLoadExecutor-2639-thread-1-processing-n:127.0.0.1:57161_) [n:127.0.0.1:57161_ c:control_collection s:shard1 r:core_node1 x:collection1] o.a.s.r.ManagedResourceStorage Loaded null at path _rest_managed.json using ZooKeeperStorageIO:path=/configs/conf1
   [junit4]   2> 862728 INFO  (coreLoadExecutor-2639-thread-1-processing-n:127.0.0.1:57161_) [n:127.0.0.1:57161_ c:control_collection s:shard1 r:core_node1 x:collection1] o.a.s.r.RestManager Initializing 0 registered ManagedResources
   [junit4]   2> 862745 INFO  (coreLoadExecutor-2639-thread-1-processing-n:127.0.0.1:57161_) [n:127.0.0.1:57161_ c:control_collection s:shard1 r:core_node1 x:collection1] o.a.s.h.ReplicationHandler Commits will be reserved for  10000
   [junit4]   2> 862745 INFO  (coreLoadExecutor-2639-thread-1-processing-n:127.0.0.1:57161_) [n:127.0.0.1:57161_ c:control_collection s:shard1 r:core_node1 x:collection1] o.a.s.u.UpdateLog Looking up max value of version field to seed version buckets
   [junit4]   2> 862745 INFO  (coreLoadExecutor-2639-thread-1-processing-n:127.0.0.1:57161_) [n:127.0.0.1:57161_ c:control_collection s:shard1 r:core_node1 x:collection1] o.a.s.u.VersionInfo Refreshing highest value of _version_ for 65536 version buckets from index
   [junit4]   2> 862745 INFO  (coreLoadExecutor-2639-thread-1-processing-n:127.0.0.1:57161_) [n:127.0.0.1:57161_ c:control_collection s:shard1 r:core_node1 x:collection1] o.a.s.u.VersionInfo No terms found for _version_, cannot seed version bucket highest value from index
   [junit4]   2> 862745 INFO  (coreLoadExecutor-2639-thread-1-processing-n:127.0.0.1:57161_) [n:127.0.0.1:57161_ c:control_collection s:shard1 r:core_node1 x:collection1] o.a.s.u.UpdateLog Could not find max version in index or recent updates, using new clock 1531322335956566016
   [junit4]   2> 862746 INFO  (searcherExecutor-2640-thread-1-processing-n:127.0.0.1:57161_ x:collection1 s:shard1 c:control_collection r:core_node1) [n:127.0.0.1:57161_ c:control_collection s:shard1 r:core_node1 x:collection1] o.a.s.c.SolrCore [collection1] Registered new searcher Searcher@5c74306f[collection1] main{ExitableDirectoryReader(UninvertingDirectoryReader())}
   [junit4]   2> 862747 INFO  (coreLoadExecutor-2639-thread-1-processing-n:127.0.0.1:57161_) [n:127.0.0.1:57161_ c:control_collection s:shard1 r:core_node1 x:collection1] o.a.s.u.UpdateLog Took 2.0ms to seed version buckets with highest version 1531322335956566016
   [junit4]   2> 862747 INFO  (coreLoadExecutor-2639-thread-1-processing-n:127.0.0.1:57161_) [n:127.0.0.1:57161_ c:control_collection s:shard1 r:core_node1 x:collection1] o.a.s.c.ZkController watch zkdir /configs/conf1
   [junit4]   2> 862748 INFO  (coreLoadExecutor-2639-thread-1-processing-n:127.0.0.1:57161_) [n:127.0.0.1:57161_ c:control_collection s:shard1 r:core_node1 x:collection1] o.a.s.c.CoreContainer registering core: collection1
   [junit4]   2> 862749 INFO  (coreZkRegister-2633-thread-1-processing-n:127.0.0.1:57161_ x:collection1 s:shard1 c:control_collection r:core_node1) [n:127.0.0.1:57161_ c:control_collection s:shard1 r:core_node1 x:collection1] o.a.s.c.ZkController Register replica - core:collection1 address:http://127.0.0.1:57161 collection:control_collection shard:shard1
   [junit4]   2> 862750 INFO  (coreZkRegister-2633-thread-1-processing-n:127.0.0.1:57161_ x:collection1 s:shard1 c:control_collection r:core_node1) [n:127.0.0.1:57161_ c:control_collection s:shard1 r:core_node1 x:collection1] o.a.s.c.c.SolrZkClient makePath: /collections/control_collection/leader_elect/shard1/election
   [junit4]   2> 862756 INFO  (coreZkRegister-2633-thread-1-processing-n:127.0.0.1:57161_ x:collection1 s:shard1 c:control_collection r:core_node1) [n:127.0.0.1:57161_ c:control_collection s:shard1 r:core_node1 x:collection1] o.a.s.c.LeaderElector Joined leadership election with path: /collections/control_collection/leader_elect/shard1/election/95707645856841732-core_node1-n_0000000000
   [junit4]   2> 862757 INFO  (coreZkRegister-2633-thread-1-processing-n:127.0.0.1:57161_ x:collection1 s:shard1 c:control_collection r:core_node1) [n:127.0.0.1:57161_ c:control_collection s:shard1 r:core_node1 x:collection1] o.a.s.c.ShardLeaderElectionContext Running the leader process for shard=shard1 and weAreReplacement=false and leaderVoteWait=10000
   [junit4]   2> 862760 INFO  (coreZkRegister-2633-thread-1-processing-n:127.0.0.1:57161_ x:collection1 s:shard1 c:control_collection r:core_node1) [n:127.0.0.1:57161_ c:control_collection s:shard1 r:core_node1 x:collection1] o.a.s.c.ShardLeaderElectionContext Enough replicas found to continue.
   [junit4]   2> 862761 INFO  (coreZkRegister-2633-thread-1-processing-n:127.0.0.1:57161_ x:collection1 s:shard1 c:control_collection r:core_node1) [n:127.0.0.1:57161_ c:control_collection s:shard1 r:core_node1 x:collection1] o.a.s.c.ShardLeaderElectionContext I may be the new leader - try and sync
   [junit4]   2> 862761 INFO  (coreZkRegister-2633-thread-1-processing-n:127.0.0.1:57161_ x:collection1 s:shard1 c:control_collection r:core_node1) [n:127.0.0.1:57161_ c:control_collection s:shard1 r:core_node1 x:collection1] o.a.s.c.SyncStrategy Sync replicas to http://127.0.0.1:57161/collection1/
   [junit4]   2> 862761 INFO  (coreZkRegister-2633-thread-1-processing-n:127.0.0.1:57161_ x:collection1 s:shard1 c:control_collection r:core_node1) [n:127.0.0.1:57161_ c:control_collection s:shard1 r:core_node1 x:collection1] o.a.s.c.SyncStrategy Sync Success - now sync replicas to me
   [junit4]   2> 862761 INFO  (coreZkRegister-2633-thread-1-processing-n:127.0.0.1:57161_ x:collection1 s:shard1 c:control_collection r:core_node1) [n:127.0.0.1:57161_ c:control_collection s:shard1 r:core_node1 x:collection1] o.a.s.c.SyncStrategy http://127.0.0.1:57161/collection1/ has no replicas
   [junit4]   2> 862761 INFO  (OverseerStateUpdate-95707645856841732-127.0.0.1:57161_-n_0000000000) [n:127.0.0.1:57161_    ] o.a.s.c.Overseer processMessage: queueSize: 1, message = {
   [junit4]   2>   "operation":"leader",
   [junit4]   2>   "shard":"shard1",
   [junit4]   2>   "collection":"control_collection"} current state version: 1
   [junit4]   2> 862762 INFO  (coreZkRegister-2633-thread-1-processing-n:127.0.0.1:57161_ x:collection1 s:shard1 c:control_collection r:core_node1) [n:127.0.0.1:57161_ c:control_collection s:shard1 r:core_node1 x:collection1] o.a.s.c.c.SolrZkClient makePath: /collections/control_collection/leaders/shard1
   [junit4]   2> 862767 INFO  (coreZkRegister-2633-thread-1-processing-n:127.0.0.1:57161_ x:collection1 s:shard1 c:control_collection r:core_node1) [n:127.0.0.1:57161_ c:control_collection s:shard1 r:core_node1 x:collection1] o.a.s.c.ShardLeaderElectionContextBase Creating leader registration node /collections/control_collection/leaders/shard1/leader after winning as /collections/control_collection/leader_elect/shard1/election/95707645856841732-core_node1-n_0000000000
   [junit4]   2> 862770 INFO  (coreZkRegister-2633-thread-1-processing-n:127.0.0.1:57161_ x:collection1 s:shard1 c:control_collection r:core_node1) [n:127.0.0.1:57161_ c:control_collection s:shard1 r:core_node1 x:collection1] o.a.s.c.ShardLeaderElectionContext I am the new leader: http://127.0.0.1:57161/collection1/ shard1
   [junit4]   2> 862771 INFO  (OverseerStateUpdate-95707645856841732-127.0.0.1:57161_-n_0000000000) [n:127.0.0.1:57161_    ] o.a.s.c.Overseer processMessage: queueSize: 1, message = {
   [junit4]   2>   "operation":"leader",
   [junit4]   2>   "shard":"shard1",
   [junit4]   2>   "collection":"control_collection",
   [junit4]   2>   "base_url":"http://127.0.0.1:57161",
   [junit4]   2>   "core":"collection1",
   [junit4]   2>   "state":"active"} current state version: 1
   [junit4]   2> 862874 INFO  (zkCallback-1644-thread-1-processing-n:127.0.0.1:57161_) [n:127.0.0.1:57161_    ] o.a.s.c.c.ZkStateReader A cluster state change: [WatchedEvent state:SyncConnected type:NodeDataChanged path:/clusterstate.json], has occurred - updating... (live nodes size: [1])
   [junit4]   2> 862882 INFO  (TEST-DistribDocExpirationUpdateProcessorTest.test-seed#[193C056F71DCA248]) [    ] o.a.s.c.s.i.CloudSolrClient Final constructed zkHost string: 127.0.0.1:57157/solr
   [junit4]   2> 862883 INFO  (TEST-DistribDocExpirationUpdateProcessorTest.test-seed#[193C056F71DCA248]) [    ] o.a.s.c.c.SolrZkClient Using default ZkCredentialsProvider
   [junit4]   2> 862884 INFO  (TEST-DistribDocExpirationUpdateProcessorTest.test-seed#[193C056F71DCA248]) [    ] o.a.s.c.c.ConnectionManager Waiting for client to connect to ZooKeeper
   [junit4]   2> 862886 INFO  (zkCallback-1646-thread-1) [    ] o.a.s.c.c.ConnectionManager Watcher org.apache.solr.common.cloud.ConnectionManager@6a2a5261 name:ZooKeeperConnection Watcher:127.0.0.1:57157/solr got event WatchedEvent state:SyncConnected type:None path:null path:null type:None
   [junit4]   2> 862886 INFO  (TEST-DistribDocExpirationUpdateProcessorTest.test-seed#[193C056F71DCA248]) [    ] o.a.s.c.c.ConnectionManager Client is connected to ZooKeeper
   [junit4]   2> 862886 INFO  (TEST-DistribDocExpirationUpdateProcessorTest.test-seed#[193C056F71DCA248]) [    ] o.a.s.c.c.SolrZkClient Using default ZkACLProvider
   [junit4]   2> 862886 INFO  (TEST-DistribDocExpirationUpdateProcessorTest.test-seed#[193C056F71DCA248]) [    ] o.a.s.c.c.ZkStateReader Updating cluster state from ZooKeeper... 
   [junit4]   2> 862889 INFO  (TEST-DistribDocExpirationUpdateProcessorTest.test-seed#[193C056F71DCA248]) [    ] o.a.s.c.c.ZkStateReader Updated live nodes from ZooKeeper... (0) -> (1)
   [junit4]   2> 862890 INFO  (TEST-DistribDocExpirationUpdateProcessorTest.test-seed#[193C056F71DCA248]) [    ] o.a.s.c.ChaosMonkey monkey: init - expire sessions:false cause connection loss:false
   [junit4]   2> 862890 INFO  (TEST-DistribDocExpirationUpdateProcessorTest.test-seed#[193C056F71DCA248]) [    ] o.a.s.c.AbstractFullDistribZkTestBase Creating collection1 with stateFormat=2
   [junit4]   2> 862890 INFO  (TEST-DistribDocExpirationUpdateProcessorTest.test-seed#[193C056F71DCA248]) [    ] o.a.s.c.c.SolrZkClient Using default ZkCredentialsProvider
   [junit4]   2> 862891 INFO  (TEST-DistribDocExpirationUpdateProcessorTest.test-seed#[193C056F71DCA248]) [    ] o.a.s.c.c.ConnectionManager Waiting for client to connect to ZooKeeper
   [junit4]   2> 862893 INFO  (zkCallback-1647-thread-1) [    ] o.a.s.c.c.ConnectionManager Watcher org.apache.solr.common.cloud.ConnectionManager@5ffa3086 name:ZooKeeperConnection Watcher:127.0.0.1:57157/solr got event WatchedEvent state:SyncConnected type:None path:null path:null type:None
   [junit4]   2> 862893 INFO  (TEST-DistribDocExpirationUpdateProcessorTest.test-seed#[193C056F71DCA248]) [    ] o.a.s.c.c.ConnectionManager Client is connected to ZooKeeper
   [junit4]   2> 862893 INFO  (TEST-DistribDocExpirationUpdateProcessorTest.test-seed#[193C056F71DCA248]) [    ] o.a.s.c.c.SolrZkClient Using default ZkACLProvider
   [junit4]   2> 862897 INFO  (OverseerStateUpdate-95707645856841732-127.0.0.1:57161_-n_0000000000) [n:127.0.0.1:57161_    ] o.a.s.c.Overseer processMessage: queueSize: 1, message = {
   [junit4]   2>   "operation":"create",
   [junit4]   2>   "name":"collection1",
   [junit4]   2>   "numShards":"2",
   [junit4]   2>   "stateFormat":"2"} current state version: 2
   [junit4]   2> 862897 INFO  (OverseerStateUpdate-95707645856841732-127.0.0.1:57161_-n_0000000000) [n:127.0.0.1:57161_    ] o.a.s.c.o.ClusterStateMutator building a new cName: collection1
   [junit4]   2> 862922 INFO  (coreZkRegister-2633-thread-1-processing-n:127.0.0.1:57161_ x:collection1 s:shard1 c:control_collection r:core_node1) [n:127.0.0.1:57161_ c:control_collection s:shard1 r:core_node1 x:collection1] o.a.s.c.ZkController We are http://127.0.0.1:57161/collection1/ and leader is http://127.0.0.1:57161/collection1/
   [junit4]   2> 862922 INFO  (coreZkRegister-2633-thread-1-processing-n:127.0.0.1:57161_ x:collection1 s:shard1 c:control_collection r:core_node1) [n:127.0.0.1:57161_ c:control_collection s:shard1 r:core_node1 x:collection1] o.a.s.c.ZkController No LogReplay needed for core=collection1 baseURL=http://127.0.0.1:57161
   [junit4]   2> 862923 INFO  (coreZkRegister-2633-thread-1-processing-n:127.0.0.1:57161_ x:collection1 s:shard1 c:control_collection r:core_node1) [n:127.0.0.1:57161_ c:control_collection s:shard1 r:core_node1 x:collection1] o.a.s.c.ZkController I am the leader, no recovery necessary
   [junit4]   2> 862923 INFO  (coreZkRegister-2633-thread-1-processing-n:127.0.0.1:57161_ x:collection1 s:shard1 c:control_collection r:core_node1) [n:127.0.0.1:57161_ c:control_collection s:shard1 r:core_node1 x:collection1] o.a.s.c.ZkController publishing state=active
   [junit4]   2> 862923 INFO  (coreZkRegister-2633-thread-1-processing-n:127.0.0.1:57161_ x:collection1 s:shard1 c:control_collection r:core_node1) [n:127.0.0.1:57161_ c:control_collection s:shard1 r:core_node1 x:collection1] o.a.s.c.ZkController numShards not found on descriptor - reading it from system property
   [junit4]   2> 862926 INFO  (OverseerStateUpdate-95707645856841732-127.0.0.1:57161_-n_0000000000) [n:127.0.0.1:57161_    ] o.a.s.c.Overseer processMessage: queueSize: 1, message = {
   [junit4]   2>   "core":"collection1",
   [junit4]   2>   "core_node_name":"core_node1",
   [junit4]   2>   "roles":null,
   [junit4]   2>   "base_url":"http://127.0.0.1:57161",
   [junit4]   2>   "node_name":"127.0.0.1:57161_",
   [junit4]   2>   "numShards":"2",
   [junit4]   2>   "state":"active",
   [junit4]   2>   "shard":"shard1",
   [junit4]   2>   "collection":"control_collection",
   [junit4]   2>   "operation":"state"} current state version: 2
   [junit4]   2> 862926 INFO  (OverseerStateUpdate-95707645856841732-127.0.0.1:57161_-n_0000000000) [n:127.0.0.1:57161_    ] o.a.s.c.o.ReplicaMutator Update state numShards=2 message={
   [junit4]   2>   "core":"collection1",
   [junit4]   2>   "core_node_name":"core_node1",
   [junit4]   2>   "roles":null,
   [junit4]   2>   "base_url":"http://127.0.0.1:57161",
   [junit4]   2>   "node_name":"127.0.0.1:57161_",
   [junit4]   2>   "numShards":"2",
   [junit4]   2>   "state":"active",
   [junit4]   2>   "shard":"shard1",
   [junit4]   2>   "collection":"control_collection",
   [junit4]   2>   "operation":"state"}
   [junit4]   2> 862927 INFO  (OverseerStateUpdate-95707645856841732-127.0.0.1:57161_-n_0000000000) [n:127.0.0.1:57161_    ] o.a.s.c.o.ZkStateWriter going to create_collection /collections/collection1/state.json
   [junit4]   2> 863042 INFO  (zkCallback-1644-thread-1-processing-n:127.0.0.1:57161_) [n:127.0.0.1:57161_    ] o.a.s.c.c.ZkStateReader A cluster state change: [WatchedEvent state:SyncConnected type:NodeDataChanged path:/clusterstate.json], has occurred - updating... (live nodes size: [1])
   [junit4]   2> 863042 INFO  (zkCallback-1646-thread-1) [    ] o.a.s.c.c.ZkStateReader A cluster state change: [WatchedEvent state:SyncConnected type:NodeDataChanged path:/clusterstate.json], has occurred - updating... (live nodes size: [1])
   [junit4]   2> 863200 INFO  (TEST-DistribDocExpirationUpdateProcessorTest.test-seed#[193C056F71DCA248]) [    ] o.a.s.SolrTestCaseJ4 Writing core.properties file to /Users/jenkins/workspace/Lucene-Solr-master-MacOSX/solr/build/solr-core/test/J0/temp/solr.cloud.DistribDocExpirationUpdateProcessorTest_193C056F71DCA248-001/shard-1-001/cores/collection1
   [junit4]   2> 863203 INFO  (TEST-DistribDocExpirationUpdateProcessorTest.test-seed#[193C056F71DCA248]) [    ] o.a.s.c.AbstractFullDistribZkTestBase create jetty 1 in directory /Users/jenkins/workspace/Lucene-Solr-master-MacOSX/solr/build/solr-core/test/J0/temp/solr.cloud.DistribDocExpirationUpdateProcessorTest_193C056F71DCA248-001/shard-1-001
   [junit4]   2> 863205 INFO  (TEST-DistribDocExpirationUpdateProcessorTest.test-seed#[193C056F71DCA248]) [    ] o.e.j.s.Server jetty-9.3.8.v20160314
   [junit4]   2> 863207 INFO  (TEST-DistribDocExpirationUpdateProcessorTest.test-seed#[193C056F71DCA248]) [    ] o.e.j.s.h.ContextHandler Started o.e.j.s.ServletContextHandler@45178d9d{/,null,AVAILABLE}
   [junit4]   2> 863209 INFO  (TEST-DistribDocExpirationUpdateProcessorTest.test-seed#[193C056F71DCA248]) [    ] o.e.j.s.ServerConnector Started ServerConnector@1b71625e{HTTP/1.1,[http/1.1]}{127.0.0.1:57168}
   [junit4]   2> 863210 INFO  (TEST-DistribDocExpirationUpdateProcessorTest.test-seed#[193C056F71DCA248]) [    ] o.e.j.s.Server Started @867786ms
   [junit4]   2> 863210 INFO  (TEST-DistribDocExpirationUpdateProcessorTest.test-seed#[193C056F71DCA248]) [    ] o.a.s.c.s.e.JettySolrRunner Jetty properties: {solr.data.dir=/Users/jenkins/workspace/Lucene-Solr-master-MacOSX/solr/build/solr-core/test/J0/temp/solr.cloud.DistribDocExpirationUpdateProcessorTest_193C056F71DCA248-001/tempDir-001/jetty1, solrconfig=solrconfig.xml, hostContext=/, hostPort=57168, coreRootDirectory=/Users/jenkins/workspace/Lucene-Solr-master-MacOSX/solr/build/solr-core/test/J0/../../../../../../../../../Users/jenkins/workspace/Lucene-Solr-master-MacOSX/solr/build/solr-core/test/J0/temp/solr.cloud.DistribDocExpirationUpdateProcessorTest_193C056F71DCA248-001/shard-1-001/cores}
   [junit4]   2> 863211 INFO  (TEST-DistribDocExpirationUpdateProcessorTest.test-seed#[193C056F71DCA248]) [    ] o.a.s.s.SolrDispatchFilter SolrDispatchFilter.init(): sun.misc.Launcher$AppClassLoader@4554617c
   [junit4]   2> 863211 INFO  (TEST-DistribDocExpirationUpdateProcessorTest.test-seed#[193C056F71DCA248]) [    ] o.a.s.c.SolrResourceLoader new SolrResourceLoader for directory: '/Users/jenkins/workspace/Lucene-Solr-master-MacOSX/solr/build/solr-core/test/J0/temp/solr.cloud.DistribDocExpirationUpdateProcessorTest_193C056F71DCA248-001/shard-1-001'
   [junit4]   2> 863211 INFO  (TEST-DistribDocExpirationUpdateProcessorTest.test-seed#[193C056F71DCA248]) [    ] o.a.s.c.SolrResourceLoader JNDI not configured for solr (NoInitialContextEx)
   [junit4]   2> 863211 INFO  (TEST-DistribDocExpirationUpdateProcessorTest.test-seed#[193C056F71DCA248]) [    ] o.a.s.c.SolrResourceLoader solr home defaulted to 'solr/' (could not find system property or JNDI)
   [junit4]   2> 863211 INFO  (TEST-DistribDocExpirationUpdateProcessorTest.test-seed#[193C056F71DCA248]) [    ] o.a.s.c.c.SolrZkClient Using default ZkCredentialsProvider
   [junit4]   2> 863212 INFO  (TEST-DistribDocExpirationUpdateProcessorTest.test-seed#[193C056F71DCA248]) [    ] o.a.s.c.c.ConnectionManager Waiting for client to connect to ZooKeeper
   [junit4]   2> 863226 INFO  (zkCallback-1648-thread-1) [    ] o.a.s.c.c.ConnectionManager Watcher org.apache.solr.common.cloud.ConnectionManager@57c3a0d7 name:ZooKeeperConnection Watcher:127.0.0.1:57157/solr got event WatchedEvent state:SyncConnected type:None path:null path:null type:None
   [junit4]   2> 863226 INFO  (TEST-DistribDocExpirationUpdateProcessorTest.test-seed#[193C056F71DCA248]) [    ] o.a.s.c.c.ConnectionManager Client is connected to ZooKeeper
   [junit4]   2> 863227 INFO  (TEST-DistribDocExpirationUpdateProcessorTest.test-seed#[193C056F71DCA248]) [    ] o.a.s.c.c.SolrZkClient Using default ZkACLProvider
   [junit4]   2> 863228 INFO  (TEST-DistribDocExpirationUpdateProcessorTest.test-seed#[193C056F71DCA248]) [    ] o.a.s.s.SolrDispatchFilter Loading solr.xml from SolrHome (not found in ZooKeeper)
   [junit4]   2> 863228 INFO  (TEST-DistribDocExpirationUpdateProcessorTest.test-seed#[193C056F71DCA248]) [    ] o.a.s.c.SolrXmlConfig Loading container configuration from /Users/jenkins/workspace/Lucene-Solr-master-MacOSX/solr/build/solr-core/test/J0/temp/solr.cloud.DistribDocExpirationUpdateProcessorTest_193C056F71DCA248-001/shard-1-001/solr.xml
   [junit4]   2> 863237 INFO  (TEST-DistribDocExpirationUpdateProcessorTest.test-seed#[193C056F71DCA248]) [    ] o.a.s.c.CorePropertiesLocator Config-defined core root directory: /Users/jenkins/workspace/Lucene-Solr-master-MacOSX/solr/build/solr-core/test/J0/../../../../../../../../../Users/jenkins/workspace/Lucene-Solr-master-MacOSX/solr/build/solr-core/test/J0/temp/solr.cloud.DistribDocExpirationUpdateProcessorTest_193C056F71DCA248-001/shard-1-001/cores
   [junit4]   2> 863237 INFO  (TEST-DistribDocExpirationUpdateProcessorTest.test-seed#[193C056F71DCA248]) [    ] o.a.s.c.CoreContainer New CoreContainer 305061543
   [junit4]   2> 863237 INFO  (TEST-DistribDocExpirationUpdateProcessorTest.test-seed#[193C056F71DCA248]) [    ] o.a.s.c.CoreContainer Loading cores into CoreContainer [instanceDir=/Users/jenkins/workspace/Lucene-Solr-master-MacOSX/solr/build/solr-core/test/J0/temp/solr.cloud.DistribDocExpirationUpdateProcessorTest_193C056F71DCA248-001/shard-1-001]
   [junit4]   2> 863238 WARN  (TEST-DistribDocExpirationUpdateProcessorTest.test-seed#[193C056F71DCA248]) [    ] o.a.s.c.CoreContainer Couldn't add files from /Users/jenkins/workspace/Lucene-Solr-master-MacOSX/solr/build/solr-core/test/J0/temp/solr.cloud.DistribDocExpirationUpdateProcessorTest_193C056F71DCA248-001/shard-1-001/lib to classpath: /Users/jenkins/workspace/Lucene-Solr-master-MacOSX/solr/build/solr-core/test/J0/temp/solr.cloud.DistribDocExpirationUpdateProcessorTest_193C056F71DCA248-001/shard-1-001/lib
   [junit4]   2> 863238 INFO  (TEST-DistribDocExpirationUpdateProcessorTest.test-seed#[193C056F71DCA248]) [    ] o.a.s.h.c.HttpShardHandlerFactory created with socketTimeout : 90000,urlScheme : ,connTimeout : 15000,maxConnectionsPerHost : 20,maxConnections : 10000,corePoolSize : 0,maximumPoolSize : 2147483647,maxThreadIdleTime : 5,sizeOfQueue : -1,fairnessPolicy : false,
   [junit4]   2> 863241 INFO  (TEST-DistribDocExpirationUpdateProcessorTest.test-seed#[193C056F71DCA248]) [    ] o.a.s.u.UpdateShardHandler Creating UpdateShardHandler HTTP client with params: 
   [junit4]   2> 863242 INFO  (TEST-DistribDocExpirationUpdateProcessorTest.test-seed#[193C056F71DCA248]) [    ] o.a.s.l.LogWatcher SLF4J impl is org.slf4j.impl.Log4jLoggerFactory
   [junit4]   2> 863242 INFO  (TEST-DistribDocExpirationUpdateProcessorTest.test-seed#[193C056F71DCA248]) [    ] o.a.s.l.LogWatcher Registering Log Listener [Log4j (org.slf4j.impl.Log4jLoggerFactory)]
   [junit4]   2> 863242 INFO  (TEST-DistribDocExpirationUpdateProcessorTest.test-seed#[193C056F71DCA248]) [    ] o.a.s.c.ZkContainer Zookeeper client=127.0.0.1:57157/solr
   [junit4]   2> 863242 INFO  (TEST-DistribDocExpirationUpdateProcessorTest.test-seed#[193C056F71DCA248]) [    ] o.a.s.c.ZkController zkHost includes chroot
   [junit4]   2> 863242 INFO  (TEST-DistribDocExpirationUpdateProcessorTest.test-seed#[193C056F71DCA248]) [    ] o.a.s.c.c.SolrZkClient Using default ZkCredentialsProvider
   [junit4]   2> 863243 INFO  (TEST-DistribDocExpirationUpdateProcessorTest.test-seed#[193C056F71DCA248]) [    ] o.a.s.c.c.ConnectionManager Waiting for client to connect to ZooKeeper
   [junit4]   2> 863245 INFO  (zkCallback-1651-thread-1) [    ] o.a.s.c.c.ConnectionManager Watcher org.apache.solr.common.cloud.ConnectionManager@17b168d name:ZooKeeperConnection Watcher:127.0.0.1:57157 got event WatchedEvent state:SyncConnected type:None path:null path:null type:None
   [junit4]   2> 863246 INFO  (TEST-DistribDocExpirationUpdateProcessorTest.test-seed#[193C056F71DCA248]) [    ] o.a.s.c.c.ConnectionManager Client is connected to ZooKeeper
   [junit4]   2> 863246 INFO  (TEST-DistribDocExpirationUpdateProcessorTest.test-seed#[193C056F71DCA248]) [    ] o.a.s.c.c.SolrZkClient Using default ZkACLProvider
   [junit4]   2> 863250 INFO  (TEST-DistribDocExpirationUpdateProcessorTest.test-seed#[193C056F71DCA248]) [n:127.0.0.1:57168_    ] o.a.s.c.c.ConnectionManager Waiting for client to connect to ZooKeeper
   [junit4]   2> 863252 INFO  (zkCallback-1652-thread-1-processing-n:127.0.0.1:57168_) [n:127.0.0.1:57168_    ] o.a.s.c.c.ConnectionManager Watcher org.apache.solr.common.cloud.ConnectionManager@6899f12 name:ZooKeeperConnection Watcher:127.0.0.1:57157/solr got event WatchedEvent state:SyncConnected type:None path:null path:null type:None
   [junit4]   2> 863252 INFO  (TEST-DistribDocExpirationUpdateProcessorTest.test-seed#[193C056F71DCA248]) [n:127.0.0.1:57168_    ] o.a.s.c.c.ConnectionManager Client is connected to ZooKeeper
   [junit4]   2> 863264 INFO  (TEST-DistribDocExpirationUpdateProcessorTest.test-seed#[193C056F71DCA248]) [n:127.0.0.1:57168_    ] o.a.s.c.c.ZkStateReader Updating cluster state from ZooKeeper... 
   [junit4]   2> 863267 INFO  (TEST-DistribDocExpirationUpdateProcessorTest.test-seed#[193C056F71DCA248]) [n:127.0.0.1:57168_    ] o.a.s.c.c.ZkStateReader Updated live nodes from ZooKeeper... (0) -> (1)
   [junit4]   2> 863272 INFO  (TEST-DistribDocExpirationUpdateProcessorTest.test-seed#[193C056F71DCA248]) [n:127.0.0.1:57168_    ] o.a.s.c.Overseer Overseer (id=null) closing
   [junit4]   2> 863273 INFO  (TEST-DistribDocExpirationUpdateProcessorTest.test-seed#[193C056F71DCA248]) [n:127.0.0.1:57168_    ] o.a.s.c.LeaderElector Joined leadership election with path: /overseer_elect/election/95707645856841737-127.0.0.1:57168_-n_0000000001
   [junit4]   2> 863274 INFO  (TEST-DistribDocExpirationUpdateProcessorTest.test-seed#[193C056F71DCA248]) [n:127.0.0.1:57168_    ] o.a.s.c.LeaderElector Watching path /overseer_elect/election/95707645856841732-127.0.0.1:57161_-n_0000000000 to know if I could be the leader
   [junit4]   2> 863275 INFO  (TEST-DistribDocExpirationUpdateProcessorTest.test-seed#[193C056F71DCA248]) [n:127.0.0.1:57168_    ] o.a.s.c.ZkController Publish node=127.0.0.1:57168_ as DOWN
   [junit4]   2> 863279 INFO  (OverseerStateUpdate-95707645856841732-127.0.0.1:57161_-n_0000000000) [n:127.0.0.1:57161_    ] o.a.s.c.Overseer processMessage: queueSize: 1, message = {
   [junit4]   2>   "operation":"downnode",
   [junit4]   2>   "node_name":"127.0.0.1:57168_"} current state version: 3
   [junit4]   2> 863279 INFO  (OverseerStateUpdate-95707645856841732-127.0.0.1:57161_-n_0000000000) [n:127.0.0.1:57161_    ] o.a.s.c.o.NodeMutator DownNode state invoked for node: 127.0.0.1:57168_
   [junit4]   2> 863282 INFO  (OverseerStateUpdate-95707645856841732-127.0.0.1:57161_-n_0000000000) [n:127.0.0.1:57161_    ] o.a.s.c.o.ZkStateWriter going to update_collection /collections/collection1/state.json version: 0
   [junit4]   2> 863394 INFO  (zkCallback-1644-thread-1-processing-n:127.0.0.1:57161_) [n:127.0.0.1:57161_    ] o.a.s.c.c.ZkStateReader A cluster state change: [WatchedEvent state:SyncConnected type:NodeDataChanged path:/clusterstate.json], has occurred - updating... (live nodes size: [1])
   [junit4]   2> 863394 INFO  (zkCallback-1652-thread-1-processing-n:127.0.0.1:57168_) [n:127.0.0.1:57168_    ] o.a.s.c.c.ZkStateReader A cluster state change: [WatchedEvent state:SyncConnected type:NodeDataChanged path:/clusterstate.json], has occurred - updating... (live nodes size: [1])
   [junit4]   2> 863394 INFO  (zkCallback-1646-thread-1) [    ] o.a.s.c.c.ZkStateReader A cluster state change: [WatchedEvent state:SyncConnected type:NodeDataChanged path:/clusterstate.json], has occurred - updating... (live nodes size: [1])
   [junit4]   2> 864280 INFO  (TEST-DistribDocExpirationUpdateProcessorTest.test-seed#[193C056F71DCA248]) [n:127.0.0.1:57168_    ] o.a.s.c.ZkController Register node as live in ZooKeeper:/live_nodes/127.0.0.1:57168_
   [junit4]   2> 864281 INFO  (TEST-DistribDocExpirationUpdateProcessorTest.test-seed#[193C056F71DCA248]) [n:127.0.0.1:57168_    ] o.a.s.c.c.SolrZkClient makePath: /live_nodes/127.0.0.1:57168_
   [junit4]   2> 864284 INFO  (zkCallback-1644-thread-1-processing-n:127.0.0.1:57161_) [n:127.0.0.1:57161_    ] o.a.s.c.c.ZkStateReader A live node change: [WatchedEvent state:SyncConnected type:NodeChildrenChanged path:/live_nodes], has occurred - updating... (live nodes size: [1])
   [junit4]   2> 864284 INFO  (zkCallback-1652-thread-1-processing-n:127.0.0.1:57168_) [n:127.0.0.1:57168_    ] o.a.s.c.c.ZkStateReader A live node change: [WatchedEvent state:SyncConnected type:NodeChildrenChanged path:/live_nodes], has occurred - updating... (live nodes size: [1])
   [junit4]   2> 864284 INFO  (zkCallback-1646-thread-1) [    ] o.a.s.c.c.ZkStateReader A live node change: [WatchedEvent state:SyncConnected type:NodeChildrenChanged path:/live_nodes], has occurred - updating... (live nodes size: [1])
   [junit4]   2> 864285 INFO  (zkCallback-1644-thread-1-processing-n:127.0.0.1:57161_) [n:127.0.0.1:57161_    ] o.a.s.c.c.ZkStateReader Updated live nodes from ZooKeeper... (1) -> (2)
   [junit4]   2> 864285 INFO  (zkCallback-1652-thread-1-processing-n:127.0.0.1:57168_) [n:127.0.0.1:57168_    ] o.a.s.c.c.ZkStateReader Updated live nodes from ZooKeeper... (1) -> (2)
   [junit4]   2> 864285 INFO  (zkCallback-1646-thread-1) [    ] o.a.s.c.c.ZkStateReader Updated live nodes from ZooKeeper... (1) -> (2)
   [junit4]   2> 864296 INFO  (TEST-DistribDocExpirationUpdateProcessorTest.test-seed#[193C056F71DCA248]) [n:127.0.0.1:57168_    ] o.a.s.c.CoreContainer Security conf doesn't exist. Skipping setup for authorization module.
   [junit4]   2> 864296 INFO  (TEST-DistribDocExpirationUpdateProcessorTest.test-seed#[193C056F71DCA248]) [n:127.0.0.1:57168_    ] o.a.s.c.CoreContainer No authentication plugin used.
   [junit4]   2> 864297 INFO  (TEST-DistribDocExpirationUpdateProcessorTest.test-seed#[193C056F71DCA248]) [n:127.0.0.1:57168_    ] o.a.s.c.CorePropertiesLocator Looking for core definitions underneath /Users/jenkins/workspace/Lucene-Solr-master-MacOSX/solr/build/solr-core/test/J0/../../../../../../../../../Users/jenkins/workspace/Lucene-Solr-master-MacOSX/solr/build/solr-core/test/J0/temp/solr.cloud.DistribDocExpirationUpdateProcessorTest_193C056F71DCA248-001/shard-1-001/cores
   [junit4]   2> 864299 INFO  (TEST-DistribDocExpirationUpdateProcessorTest.test-seed#[193C056F71DCA248]) [n:127.0.0.1:57168_    ] o.a.s.c.CoreDescriptor Created CoreDescriptor: {name=collection1, config=solrconfig.xml, transient=false, schema=schema.xml, loadOnStartup=true, configSetProperties=configsetprops.json, collection=collection1, coreNodeName=, dataDir=data/, shard=}
   [junit4]   2> 864300 INFO  (TEST-DistribDocExpirationUpdateProcessorTest.test-seed#[193C056F71DCA248]) [n:127.0.0.1:57168_    ] o.a.s.c.CorePropertiesLocator Found core collection1 in /Users/jenkins/workspace/Lucene-Solr-master-MacOSX/solr/build/solr-core/test/J0/../../../../../../../../../Users/jenkins/workspace/Lucene-Solr-master-MacOSX/solr/build/solr-core/test/J0/temp/solr.cloud.DistribDocExpirationUpdateProcessorTest_193C056F71DCA248-001/shard-1-001/cores/collection1
   [junit4]   2> 864300 INFO  (TEST-DistribDocExpirationUpdateProcessorTest.test-seed#[193C056F71DCA248]) [n:127.0.0.1:57168_    ] o.a.s.c.CorePropertiesLocator Found 1 core definitions
   [junit4]   2> 864302 INFO  (TEST-DistribDocExpirationUpdateProcessorTest.test-seed#[193C056F71DCA248]) [n:127.0.0.1:57168_    ] o.a.s.s.SolrDispatchFilter user.dir=/Users/jenkins/workspace/Lucene-Solr-master-MacOSX/solr/build/solr-core/test/J0
   [junit4]   2> 864302 INFO  (TEST-DistribDocExpirationUpdateProcessorTest.test-seed#[193C056F71DCA248]) [n:127.0.0.1:57168_    ] o.a.s.s.SolrDispatchFilter SolrDispatchFilter.init() done
   [junit4]   2> 864303 INFO  (coreLoadExecutor-2651-thread-1-processing-n:127.0.0.1:57168_) [n:127.0.0.1:57168_ c:collection1   x:collection1] o.a.s.c.ZkController publishing state=down
   [junit4]   2> 864303 INFO  (coreLoadExecutor-2651-thread-1-processing-n:127.0.0.1:57168_) [n:127.0.0.1:57168_ c:collection1   x:collection1] o.a.s.c.ZkController numShards not found on descriptor - reading it from system property
   [junit4]   2> 864306 INFO  (coreLoadExecutor-2651-thread-1-processing-n:127.0.0.1:57168_) [n:127.0.0.1:57168_ c:collection1   x:collection1] o.a.s.c.ZkController Registering watch for collection collection1
   [junit4]   2> 864306 INFO  (coreLoadExecutor-2651-thread-1-processing-n:127.0.0.1:57168_) [n:127.0.0.1:57168_ c:collection1   x:collection1] o.a.s.c.c.ZkStateReader addZkWatch [collection1]
   [junit4]   2> 864307 INFO  (coreLoadExecutor-2651-thread-1-processing-n:127.0.0.1:57168_) [n:127.0.0.1:57168_ c:collection1   x:collection1] o.a.s.c.c.ZkStateReader Add data for [collection1] ver [1]
   [junit4]   2> 864307 INFO  (OverseerStateUpdate-95707645856841732-127.0.0.1:57161_-n_0000000000) [n:127.0.0.1:57161_    ] o.a.s.c.Overseer processMessage: queueSize: 1, message = {
   [junit4]   2>   "core":"collection1",
   [junit4]   2>   "roles":null,
   [junit4]   2>   "base_url":"http://127.0.0.1:57168",
   [junit4]   2>   "node_name":"127.0.0.1:57168_",
   [junit4]   2>   "numShards":"2",
   [junit4]   2>   "state":"down",
   [junit4]   2>   "shard":null,
   [junit4]   2>   "collection":"collection1",
   [junit4]   2>   "operation":"state"} current state version: 4
   [junit4]   2> 864307 INFO  (coreLoadExecutor-2651-thread-1-processing-n:127.0.0.1:57168_) [n:127.0.0.1:57168_ c:collection1   x:collection1] o.a.s.c.ZkController look for our core node name
   [junit4]   2> 864308 INFO  (OverseerStateUpdate-95707645856841732-127.0.0.1:57161_-n_0000000000) [n:127.0.0.1:57161_    ] o.a.s.c.o.ReplicaMutator Update state numShards=2 message={
   [junit4]   2>   "core":"collection1",
   [junit4]   2>   "roles":null,
   [junit4]   2>   "base_url":"http://127.0.0.1:57168",
   [junit4]   2>   "node_name":"127.0.0.1:57168_",
   [junit4]   2>   "numShards":"2",
   [junit4]   2>   "state":"down",
   [junit4]   2>   "shard":null,
   [junit4]   2>   "collection":"collection1",
   [junit4]   2>   "operation":"state"}
   [junit4]   2> 864308 INFO  (OverseerStateUpdate-95707645856841732-127.0.0.1:57161_-n_0000000000) [n:127.0.0.1:57161_    ] o.a.s.c.o.ReplicaMutator Collection already exists with numShards=2
   [junit4]   2> 864308 INFO  (OverseerStateUpdate-95707645856841732-127.0.0.1:57161_-n_0000000000) [n:127.0.0.1:57161_    ] o.a.s.c.o.ReplicaMutator Assigning new node to shard shard=shard2
   [junit4]   2> 864415 INFO  (OverseerStateUpdate-95707645856841732-127.0.0.1:57161_-n_0000000000) [n:127.0.0.1:57161_    ] o.a.s.c.o.ZkStateWriter going to update_collection /collections/collection1/state.json version: 1
   [junit4]   2> 864416 INFO  (zkCallback-1652-thread-1-processing-n:127.0.0.1:57168_) [n:127.0.0.1:57168_    ] o.a.s.c.c.ZkStateReader A cluster state change: [WatchedEvent state:SyncConnected type:NodeDataChanged path:/collections/collection1/state.json] for collection [collection1] has occurred - updating... (live nodes size: [2])
   [junit4]   2> 864417 INFO  (zkCallback-1652-thread-1-processing-n:127.0.0.1:57168_) [n:127.0.0.1:57168_    ] o.a.s.c.c.ZkStateReader Updating data for [collection1] from [1] to [2]
   [junit4]   2> 865308 INFO  (coreLoadExecutor-2651-thread-1-processing-n:127.0.0.1:57168_) [n:127.0.0.1:57168_ c:collection1   x:collection1] o.a.s.c.ZkController waiting to find shard id in clusterstate for collection1
   [junit4]   2> 865308 INFO  (coreLoadExecutor-2651-thread-1-processing-n:127.0.0.1:57168_) [n:127.0.0.1:57168_ c:collection1   x:collection1] o.a.s.c.ZkController Check for collection zkNode:collection1
   [junit4]   2> 865309 INFO  (coreLoadExecutor-2651-thread-1-processing-n:127.0.0.1:57168_) [n:127.0.0.1:57168_ c:collection1   x:collection1] o.a.s.c.ZkController Collection zkNode exists
   [junit4]   2> 865309 INFO  (coreLoadExecutor-2651-thread-1-processing-n:127.0.0.1:57168_) [n:127.0.0.1:57168_ c:collection1   x:collection1] o.a.s.c.c.ZkStateReader Load collection config from: [/collections/collection1]
   [junit4]   2> 865311 INFO  (coreLoadExecutor-2651-thread-1-processing-n:127.0.0.1:57168_) [n:127.0.0.1:57168_ c:collection1   x:collection1] o.a.s.c.c.ZkStateReader path=[/collections/collection1] [configName]=[conf1] specified config exists in ZooKeeper
   [junit4]   2> 865311 INFO  (coreLoadExecutor-2651-thread-1-processing-n:127.0.0.1:57168_) [n:127.0.0.1:57168_ c:collection1   x:collection1] o.a.s.c.SolrResourceLoader new SolrResourceLoader for directory: '/Users/jenkins/workspace/Lucene-Solr-master-MacOSX/solr/build/solr-core/test/J0/temp/solr.cloud.DistribDocExpirationUpdateProcessorTest_193C056F71DCA248-001/shard-1-001/cores/collection1'
   [junit4]   2> 865311 INFO  (coreLoadExecutor-2651-thread-1-processing-n:127.0.0.1:57168_) [n:127.0.0.1:57168_ c:collection1   x:collection1] o.a.s.c.SolrResourceLoader JNDI not configured for solr (NoInitialContextEx)
   [junit4]   2> 865311 INFO  (coreLoadExecutor-2651-thread-1-processing-n:127.0.0.1:57168_) [n:127.0.0.1:57168_ c:collection1   x:collection1] o.a.s.c.SolrResourceLoader solr home defaulted to 'solr/' (could not find system property or JNDI)
   [junit4]   2> 865314 INFO  (coreLoadExecutor-2651-thread-1-processing-n:127.0.0.1:57168_) [n:127.0.0.1:57168_ c:collection1   x:collection1] o.a.s.c.Config loaded config solrconfig.xml with version 0 
   [junit4]   2> 865331 INFO  (coreLoadExecutor-2651-thread-1-processing-n:127.0.0.1:57168_) [n:127.0.0.1:57168_ c:collection1   x:collection1] o.a.s.c.SolrConfig current version of requestparams : -1
   [junit4]   2> 865335 INFO  (coreLoadExecutor-2651-thread-1-processing-n:127.0.0.1:57168_) [n:127.0.0.1:57168_ c:collection1   x:collection1] o.a.s.c.SolrConfig Using Lucene MatchVersion: 7.0.0
   [junit4]   2> 865349 INFO  (coreLoadExecutor-2651-thread-1-processing-n:127.0.0.1:57168_) [n:127.0.0.1:57168_ c:collection1   x:collection1] o.a.s.c.SolrConfig Loaded SolrConfig: solrconfig.xml
   [junit4]   2> 865354 INFO  (coreLoadExecutor-2651-thread-1-processing-n:127.0.0.1:57168_) [n:127.0.0.1:57168_ c:collection1   x:collection1] o.a.s.s.IndexSchema [collection1] Schema name=test
   [junit4]   2> 865492 INFO  (coreLoadExecutor-2651-thread-1-processing-n:127.0.0.1:57168_) [n:127.0.0.1:57168_ c:collection1   x:collection1] o.a.s.s.IndexSchema default search field in schema is text
   [junit4]   2> 865493 INFO  (coreLoadExecutor-2651-thread-1-processing-n:127.0.0.1:57168_) [n:127.0.0.1:57168_ c:collection1   x:collection1] o.a.s.s.IndexSchema unique key field: id
   [junit4]   2> 865494 INFO  (coreLoadExecutor-2651-thread-1-processing-n:127.0.0.1:57168_) [n:127.0.0.1:57168_ c:collection1   x:collection1] o.a.s.s.FileExchangeRateProvider Reloading exchange rates from file currency.xml
   [junit4]   2> 865497 INFO  (coreLoadExecutor-2651-thread-1-processing-n:127.0.0.1:57168_) [n:127.0.0.1:57168_ c:collection1   x:collection1] o.a.s.s.FileExchangeRateProvider Reloading exchange rates from file currency.xml
   [junit4]   2> 865532 INFO  (coreLoadExecutor-2651-thread-1-processing-n:127.0.0.1:57168_) [n:127.0.0.1:57168_ c:collection1   x:collection1] o.a.s.c.ConfigSetProperties Did not find ConfigSet properties, assuming default properties: Can't find resource 'configsetprops.json' in classpath or '/configs/conf1', cwd=/Users/jenkins/workspace/Lucene-Solr-master-MacOSX/solr/build/solr-core/test/J0
   [junit4]   2> 865533 INFO  (coreLoadExecutor-2651-thread-1-processing-n:127.0.0.1:57168_) [n:127.0.0.1:57168_ c:collection1 

[...truncated too long message...]

-core/test/J0/temp/solr.cloud.DistribDocExpirationUpdateProcessorTest_193C056F71DCA248-001/shard-4-001/cores/collection1/data/index
   [junit4]   2> 929353 INFO  (coreCloseExecutor-2707-thread-1) [n:127.0.0.1:57189_ c:collection1 s:shard1 r:core_node4 x:collection1] o.a.s.u.p.DocExpirationUpdateProcessorFactory Waiting for close of DocExpiration Executor
   [junit4]   2> 929457 INFO  (zkCallback-1668-thread-2-processing-n:127.0.0.1:57189_) [n:127.0.0.1:57189_    ] o.a.s.c.c.ZkStateReader A cluster state change: [WatchedEvent state:SyncConnected type:NodeDataChanged path:/clusterstate.json], has occurred - updating... (live nodes size: [1])
   [junit4]   2> 930120 INFO  (autoExpireDocs-2693-thread-1) [n:127.0.0.1:57189_ c:collection1 s:shard1 r:core_node4 x:collection1] o.a.s.u.p.LogUpdateProcessorFactory [collection1] {} 0 4006
   [junit4]   2> 930120 ERROR (autoExpireDocs-2693-thread-1) [n:127.0.0.1:57189_ c:collection1 s:shard1 r:core_node4 x:collection1] o.a.s.u.p.DocExpirationUpdateProcessorFactory Runtime error in periodic deletion of expired docs: No registered leader was found after waiting for 4000ms , collection: collection1 slice: shard2
   [junit4]   2> org.apache.solr.common.SolrException: No registered leader was found after waiting for 4000ms , collection: collection1 slice: shard2
   [junit4]   2> 	at org.apache.solr.common.cloud.ZkStateReader.getLeaderRetry(ZkStateReader.java:655)
   [junit4]   2> 	at org.apache.solr.common.cloud.ZkStateReader.getLeaderRetry(ZkStateReader.java:641)
   [junit4]   2> 	at org.apache.solr.update.processor.DistributedUpdateProcessor.doDeleteByQuery(DistributedUpdateProcessor.java:1277)
   [junit4]   2> 	at org.apache.solr.update.processor.DistributedUpdateProcessor.processDelete(DistributedUpdateProcessor.java:1140)
   [junit4]   2> 	at org.apache.solr.update.processor.LogUpdateProcessorFactory$LogUpdateProcessor.processDelete(LogUpdateProcessorFactory.java:124)
   [junit4]   2> 	at org.apache.solr.update.processor.UpdateRequestProcessor.processDelete(UpdateRequestProcessor.java:52)
   [junit4]   2> 	at org.apache.solr.update.processor.DocExpirationUpdateProcessorFactory$DeleteExpiredDocsRunnable.run(DocExpirationUpdateProcessorFactory.java:405)
   [junit4]   2> 	at java.util.concurrent.Executors$RunnableAdapter.call(Executors.java:511)
   [junit4]   2> 	at java.util.concurrent.FutureTask.runAndReset(FutureTask.java:308)
   [junit4]   2> 	at java.util.concurrent.ScheduledThreadPoolExecutor$ScheduledFutureTask.access$301(ScheduledThreadPoolExecutor.java:180)
   [junit4]   2> 	at java.util.concurrent.ScheduledThreadPoolExecutor$ScheduledFutureTask.run(ScheduledThreadPoolExecutor.java:294)
   [junit4]   2> 	at java.util.concurrent.ThreadPoolExecutor.runWorker(ThreadPoolExecutor.java:1142)
   [junit4]   2> 	at java.util.concurrent.ThreadPoolExecutor$Worker.run(ThreadPoolExecutor.java:617)
   [junit4]   2> 	at java.lang.Thread.run(Thread.java:745)
   [junit4]   2> 930123 INFO  (TEST-DistribDocExpirationUpdateProcessorTest.test-seed#[193C056F71DCA248]) [    ] o.a.s.c.Overseer Overseer (id=95707645856841746-127.0.0.1:57189_-n_0000000004) closing
   [junit4]   2> 930123 INFO  (OverseerStateUpdate-95707645856841746-127.0.0.1:57189_-n_0000000004) [n:127.0.0.1:57189_    ] o.a.s.c.Overseer Overseer Loop exiting : 127.0.0.1:57189_
   [junit4]   2> 930125 INFO  (zkCallback-1668-thread-2-processing-n:127.0.0.1:57189_) [n:127.0.0.1:57189_    ] o.a.s.c.c.ZkStateReader A live node change: [WatchedEvent state:SyncConnected type:NodeChildrenChanged path:/live_nodes], has occurred - updating... (live nodes size: [1])
   [junit4]   2> 930126 WARN  (zkCallback-1668-thread-2-processing-n:127.0.0.1:57189_) [n:127.0.0.1:57189_    ] o.a.s.c.c.ZkStateReader ZooKeeper watch triggered, but Solr cannot talk to ZK: [KeeperErrorCode = Session expired for /live_nodes]
   [junit4]   2> 930127 INFO  (TEST-DistribDocExpirationUpdateProcessorTest.test-seed#[193C056F71DCA248]) [    ] o.e.j.s.ServerConnector Stopped ServerConnector@3286d4{HTTP/1.1,[http/1.1]}{127.0.0.1:0}
   [junit4]   2> 930127 INFO  (TEST-DistribDocExpirationUpdateProcessorTest.test-seed#[193C056F71DCA248]) [    ] o.e.j.s.h.ContextHandler Stopped o.e.j.s.ServletContextHandler@41762d8{/,null,UNAVAILABLE}
   [junit4]   2> 930130 INFO  (TEST-DistribDocExpirationUpdateProcessorTest.test-seed#[193C056F71DCA248]) [    ] o.a.s.c.ZkTestServer connecting to 127.0.0.1:57157 57157
   [junit4]   2> 930138 INFO  (Thread-1847) [    ] o.a.s.c.ZkTestServer connecting to 127.0.0.1:57157 57157
   [junit4]   2> 931572 WARN  (Thread-1847) [    ] o.a.s.c.ZkTestServer Watch limit violations: 
   [junit4]   2> Maximum concurrent create/delete watches above limit:
   [junit4]   2> 
   [junit4]   2> 	6	/solr/aliases.json
   [junit4]   2> 	5	/solr/security.json
   [junit4]   2> 	5	/solr/configs/conf1
   [junit4]   2> 
   [junit4]   2> Maximum concurrent data watches above limit:
   [junit4]   2> 
   [junit4]   2> 	6	/solr/clusterstate.json
   [junit4]   2> 	4	/solr/collections/collection1/state.json
   [junit4]   2> 
   [junit4]   2> Maximum concurrent children watches above limit:
   [junit4]   2> 
   [junit4]   2> 	6	/solr/live_nodes
   [junit4]   2> 	6	/solr/collections
   [junit4]   2> 	5	/solr/overseer/queue
   [junit4]   2> 	5	/solr/overseer/collection-queue-work
   [junit4]   2> 	2	/solr/overseer/queue-work
   [junit4]   2> 
   [junit4]   2> NOTE: reproduce with: ant test  -Dtestcase=DistribDocExpirationUpdateProcessorTest -Dtests.method=test -Dtests.seed=193C056F71DCA248 -Dtests.slow=true -Dtests.locale=es-US -Dtests.timezone=Europe/Brussels -Dtests.asserts=true -Dtests.file.encoding=UTF-8
   [junit4] FAILURE 71.0s J0 | DistribDocExpirationUpdateProcessorTest.test <<<
   [junit4]    > Throwable #1: java.lang.AssertionError: There are still nodes recoverying - waited for 45 seconds
   [junit4]    > 	at __randomizedtesting.SeedInfo.seed([193C056F71DCA248:91683AB5DF20CFB0]:0)
   [junit4]    > 	at org.apache.solr.cloud.AbstractDistribZkTestBase.waitForRecoveriesToFinish(AbstractDistribZkTestBase.java:173)
   [junit4]    > 	at org.apache.solr.cloud.AbstractFullDistribZkTestBase.waitForRecoveriesToFinish(AbstractFullDistribZkTestBase.java:856)
   [junit4]    > 	at org.apache.solr.cloud.DistribDocExpirationUpdateProcessorTest.test(DistribDocExpirationUpdateProcessorTest.java:73)
   [junit4]    > 	at org.apache.solr.BaseDistributedSearchTestCase$ShardsRepeatRule$ShardsFixedStatement.callStatement(BaseDistributedSearchTestCase.java:985)
   [junit4]    > 	at org.apache.solr.BaseDistributedSearchTestCase$ShardsRepeatRule$ShardsStatement.evaluate(BaseDistributedSearchTestCase.java:960)
   [junit4]    > 	at java.lang.Thread.run(Thread.java:745)
   [junit4]   2> 931578 INFO  (SUITE-DistribDocExpirationUpdateProcessorTest-seed#[193C056F71DCA248]-worker) [    ] o.a.s.SolrTestCaseJ4 ###deleteCore
   [junit4]   2> NOTE: leaving temporary files on disk at: /Users/jenkins/workspace/Lucene-Solr-master-MacOSX/solr/build/solr-core/test/J0/temp/solr.cloud.DistribDocExpirationUpdateProcessorTest_193C056F71DCA248-001
   [junit4]   2> NOTE: test params are: codec=CheapBastard, sim=RandomSimilarity(queryNorm=false,coord=yes): {}, locale=es-US, timezone=Europe/Brussels
   [junit4]   2> NOTE: Mac OS X 10.11.4 x86_64/Oracle Corporation 1.8.0_72 (64-bit)/cpus=3,threads=1,free=95919152,total=298496000
   [junit4]   2> NOTE: All tests run in this JVM: [TestSolrDeletionPolicy1, DistanceUnitsTest, HdfsWriteToMultipleCollectionsTest, TestSchemaManager, ZkCLITest, BadCopyFieldTest, TestSearchPerf, CursorPagingTest, TestSizeLimitedDistributedMap, TestSolrConfigHandlerCloud, TestFreeTextSuggestions, TestSweetSpotSimilarityFactory, TestBulkSchemaConcurrent, SystemInfoHandlerTest, TestRandomRequestDistribution, VMParamsZkACLAndCredentialsProvidersTest, SolrIndexConfigTest, HdfsTlogReplayBufferedWhileIndexingTest, ZkControllerTest, QueryEqualityTest, TestMinMaxOnMultiValuedField, TestFaceting, SolrCloudExampleTest, DataDrivenBlockJoinTest, HighlighterTest, TestMergePolicyConfig, ShardRoutingTest, TestAuthenticationFramework, TestJmxMonitoredMap, TestFieldSortValues, DisMaxRequestHandlerTest, TestRestoreCore, VersionInfoTest, DocumentAnalysisRequestHandlerTest, TestPerFieldSimilarityWithDefaultOverride, TestUpdate, OverseerTest, CircularListTest, PrimUtilsTest, PreAnalyzedFieldTest, DirectUpdateHandlerTest, TestRandomDVFaceting, QueryElevationComponentTest, TestDistributedSearch, ConjunctionSolrSpellCheckerTest, MergeStrategyTest, PingRequestHandlerTest, PKIAuthenticationIntegrationTest, BadComponentTest, TestSort, DistribDocExpirationUpdateProcessorTest]
   [junit4] Completed [158/584 (1!)] on J0 in 71.01s, 1 test, 1 failure <<< FAILURES!

[...truncated 1359 lines...]
BUILD FAILED
/Users/jenkins/workspace/Lucene-Solr-master-MacOSX/build.xml:740: The following error occurred while executing this line:
/Users/jenkins/workspace/Lucene-Solr-master-MacOSX/build.xml:684: The following error occurred while executing this line:
/Users/jenkins/workspace/Lucene-Solr-master-MacOSX/build.xml:59: The following error occurred while executing this line:
/Users/jenkins/workspace/Lucene-Solr-master-MacOSX/solr/build.xml:233: The following error occurred while executing this line:
/Users/jenkins/workspace/Lucene-Solr-master-MacOSX/solr/common-build.xml:529: The following error occurred while executing this line:
/Users/jenkins/workspace/Lucene-Solr-master-MacOSX/lucene/common-build.xml:1457: The following error occurred while executing this line:
/Users/jenkins/workspace/Lucene-Solr-master-MacOSX/lucene/common-build.xml:1014: There were test failures: 584 suites (10 ignored), 2356 tests, 1 failure, 119 ignored (69 assumptions) [seed: 193C056F71DCA248]

Total time: 76 minutes 2 seconds
Build step 'Invoke Ant' marked build as failure
Archiving artifacts
[WARNINGS] Skipping publisher since build result is FAILURE
Recording test results
Email was triggered for: Failure - Any
Sending email for trigger: Failure - Any