You are viewing a plain text version of this content. The canonical link for it is here.
Posted to dev@airavata.apache.org by Apache Jenkins Server <je...@builds.apache.org> on 2011/10/20 06:27:02 UTC
Build failed in Jenkins: Airavata #123
See <https://builds.apache.org/job/Airavata/123/changes>
Changes:
[smarru] Removing user name and password from message body. If any security credentials are needs, they will be passed along in the context header.
------------------------------------------
[...truncated 1414 lines...]
A modules/commons/gfac-schema/schemas/ServiceMap.xsd
A modules/commons/gfac-schema/schemas/gfac-parameter.xsd
A modules/commons/gfac-schema/schemas/HostDescription.xsd
A modules/commons/gfac-schema/src
A modules/commons/gfac-schema/src/main
A modules/commons/gfac-schema/src/main/java
A modules/commons/gfac-schema/src/main/java/org
A modules/commons/gfac-schema/src/main/java/org/apache
A modules/commons/gfac-schema/src/main/java/org/apache/airavata
A modules/commons/gfac-schema/src/main/java/org/apache/airavata/commons
A modules/commons/gfac-schema/src/main/java/org/apache/airavata/commons/gfac
A modules/commons/gfac-schema/src/main/java/org/apache/airavata/commons/gfac/type
A modules/commons/gfac-schema/src/main/java/org/apache/airavata/commons/gfac/type/Parameter.java
A modules/commons/gfac-schema/src/main/java/org/apache/airavata/commons/gfac/type/app
A modules/commons/gfac-schema/src/main/java/org/apache/airavata/commons/gfac/type/app/GramApplicationDeployment.java
A modules/commons/gfac-schema/src/main/java/org/apache/airavata/commons/gfac/type/app/ShellApplicationDeployment.java
A modules/commons/gfac-schema/src/main/java/org/apache/airavata/commons/gfac/type/parameter
A modules/commons/gfac-schema/src/main/java/org/apache/airavata/commons/gfac/type/parameter/BooleanParameter.java
A modules/commons/gfac-schema/src/main/java/org/apache/airavata/commons/gfac/type/parameter/FileParameter.java
A modules/commons/gfac-schema/src/main/java/org/apache/airavata/commons/gfac/type/parameter/AbstractParameter.java
A modules/commons/gfac-schema/src/main/java/org/apache/airavata/commons/gfac/type/parameter/FloatParameter.java
A modules/commons/gfac-schema/src/main/java/org/apache/airavata/commons/gfac/type/parameter/StringParameter.java
A modules/commons/gfac-schema/src/main/java/org/apache/airavata/commons/gfac/type/parameter/ParameterFactory.java
A modules/commons/gfac-schema/src/main/java/org/apache/airavata/commons/gfac/type/parameter/DoubleParameter.java
A modules/commons/gfac-schema/src/main/java/org/apache/airavata/commons/gfac/type/parameter/IntegerParameter.java
A modules/commons/gfac-schema/src/main/java/org/apache/airavata/commons/gfac/type/HostDescription.java
A modules/commons/gfac-schema/src/main/java/org/apache/airavata/commons/gfac/type/Type.java
A modules/commons/gfac-schema/src/main/java/org/apache/airavata/commons/gfac/type/ServiceDescription.java
A modules/commons/gfac-schema/src/main/java/org/apache/airavata/commons/gfac/type/ApplicationDeploymentDescription.java
A modules/commons/gfac-schema/src/main/java/org/apache/airavata/commons/gfac/type/DataType.java
A modules/commons/gfac-schema/src/main/java/org/apache/airavata/commons/gfac/type/host
A modules/commons/gfac-schema/src/main/java/org/apache/airavata/commons/gfac/type/host/GlobusHost.java
A modules/commons/gfac-schema/src/main/java/org/apache/airavata/commons/gfac/util
A modules/commons/gfac-schema/src/main/java/org/apache/airavata/commons/gfac/util/GFacSchemaException.java
A modules/commons/gfac-schema/src/main/java/org/apache/airavata/commons/gfac/util/GFacConstants.java
A modules/commons/gfac-schema/src/main/java/org/apache/airavata/commons/gfac/util/SchemaUtil.java
A modules/commons/gfac-schema/src/main/resources
A modules/commons/gfac-schema/src/main/resources/datatype.properties
A modules/commons/gfac-schema/pom.xml
A modules/workflow-interpreter
A modules/workflow-interpreter/src
A modules/workflow-interpreter/src/main
A modules/workflow-interpreter/src/main/resources
A modules/workflow-interpreter/src/main/resources/WorkflowInterpretor.wsdl
A modules/workflow-interpreter/src/main/resources/services.xml
A modules/workflow-interpreter/pom.xml
A modules/workflow-interpreter/client
A pom.xml
At revision 1186610
Parsing POMs
Modules changed, recalculating dependency graph
[Airavata] $ /home/hudson/tools/java/latest1.6/bin/java -cp /export/home/hudson/hudson-slave/maven3-agent.jar:/home/hudson/tools/maven/latest3/boot/plexus-classworlds-2.4.jar org.jvnet.hudson.maven3.agent.Maven3Main /home/hudson/tools/maven/latest3 /zonestorage/hudson_solaris/home/hudson/hudson-slave/slave.jar /export/home/hudson/hudson-slave/maven3-interceptor.jar 40387
channel started
<===[JENKINS REMOTING CAPACITY]===> Executing Maven: -B -f <https://builds.apache.org/job/Airavata/ws/pom.xml> clean install
[INFO] Scanning for projects...
[WARNING]
[WARNING] Some problems were encountered while building the effective model for airavata:airavata-gfac-core:jar:0.0.1-SNAPSHOT
[WARNING] 'build.plugins.plugin.version' for org.apache.maven.plugins:maven-surefire-plugin is missing. @ line 140, column 21
[WARNING]
[WARNING] Some problems were encountered while building the effective model for airavata:airavata-messenger-commons:jar:0.0.1-SNAPSHOT
[WARNING] 'build.plugins.plugin.version' for org.apache.maven.plugins:maven-surefire-plugin is missing. @ airavata:airavata-ws-messenger:0.0.1-SNAPSHOT, <https://builds.apache.org/job/Airavata/ws/modules/ws-messenger/pom.xml,> line 116, column 21
[WARNING]
[WARNING] Some problems were encountered while building the effective model for airavata:airavata-messenger-client:jar:0.0.1-SNAPSHOT
[WARNING] 'build.plugins.plugin.version' for org.apache.maven.plugins:maven-surefire-plugin is missing. @ airavata:airavata-ws-messenger:0.0.1-SNAPSHOT, <https://builds.apache.org/job/Airavata/ws/modules/ws-messenger/pom.xml,> line 116, column 21
[WARNING]
[WARNING] Some problems were encountered while building the effective model for airavata:airavata-messagebox:jar:0.0.1-SNAPSHOT
[WARNING] 'build.plugins.plugin.version' for org.apache.maven.plugins:maven-surefire-plugin is missing. @ airavata:airavata-ws-messenger:0.0.1-SNAPSHOT, <https://builds.apache.org/job/Airavata/ws/modules/ws-messenger/pom.xml,> line 116, column 21
[WARNING]
[WARNING] Some problems were encountered while building the effective model for airavata:airavata-messagebroker:jar:0.0.1-SNAPSHOT
[WARNING] 'build.plugins.plugin.version' for org.apache.maven.plugins:maven-surefire-plugin is missing. @ airavata:airavata-ws-messenger:0.0.1-SNAPSHOT, <https://builds.apache.org/job/Airavata/ws/modules/ws-messenger/pom.xml,> line 116, column 21
[WARNING] 'build.plugins.plugin.version' for org.apache.maven.plugins:maven-jar-plugin is missing. @ line 17, column 21
[WARNING]
[WARNING] Some problems were encountered while building the effective model for Airavata:ws-messenger-distribution:jar:0.0.1-SNAPSHOT
[WARNING] 'build.plugins.plugin.version' for org.apache.maven.plugins:maven-surefire-plugin is missing. @ airavata:airavata-ws-messenger:0.0.1-SNAPSHOT, <https://builds.apache.org/job/Airavata/ws/modules/ws-messenger/pom.xml,> line 116, column 21
[WARNING] The expression ${version} is deprecated. Please use ${project.version} instead.
[WARNING]
[WARNING] Some problems were encountered while building the effective model for airavata:airavata-ws-messenger:pom:0.0.1-SNAPSHOT
[WARNING] 'build.plugins.plugin.version' for org.apache.maven.plugins:maven-surefire-plugin is missing. @ line 116, column 21
[WARNING]
[WARNING] Some problems were encountered while building the effective model for airavata:airavata-xbaya-gui:jar:0.0.1-SNAPSHOT
[WARNING] 'dependencies.dependency.(groupId:artifactId:type:classifier)' must be unique: airavata:airavata-common-utils:jar -> duplicate declaration of version ${airavata.version} @ line 380, column 21
[WARNING] 'dependencies.dependency.(groupId:artifactId:type:classifier)' must be unique: log4j:log4j:jar -> duplicate declaration of version (?) @ line 409, column 21
[WARNING] 'build.plugins.plugin.version' for org.codehaus.mojo.webstart:webstart-maven-plugin is missing. @ line 119, column 21
[WARNING] 'build.plugins.plugin.version' for org.apache.maven.plugins:maven-compiler-plugin is missing. @ line 80, column 21
[WARNING] 'build.plugins.plugin.version' for org.apache.maven.plugins:maven-jar-plugin is missing. @ line 88, column 21
[WARNING]
[WARNING] Some problems were encountered while building the effective model for airavata:airavata-workflowtracking:jar:0.0.1-SNAPSHOT
[WARNING] 'build.plugins.plugin.version' for org.apache.maven.plugins:maven-surefire-plugin is missing. @ line 84, column 21
[WARNING] The expression ${pom.version} is deprecated. Please use ${project.version} instead.
[WARNING]
[WARNING] Some problems were encountered while building the effective model for airavata:airavata-gfac-schema-utils:jar:0.0.1-SNAPSHOT
[WARNING] 'build.plugins.plugin.version' for org.apache.maven.plugins:maven-surefire-plugin is missing. @ airavata:airavata-commons:0.0.1-SNAPSHOT, <https://builds.apache.org/job/Airavata/ws/modules/commons/pom.xml,> line 31, column 21
[WARNING] 'build.plugins.plugin.version' for org.codehaus.mojo:build-helper-maven-plugin is missing. @ line 98, column 21
[WARNING] The expression ${artifactId} is deprecated. Please use ${project.artifactId} instead.
[WARNING] The expression ${version} is deprecated. Please use ${project.version} instead.
[WARNING]
[WARNING] Some problems were encountered while building the effective model for airavata:airavata-common-utils:jar:0.0.1-SNAPSHOT
[WARNING] 'build.plugins.plugin.version' for org.apache.maven.plugins:maven-surefire-plugin is missing. @ airavata:airavata-commons:0.0.1-SNAPSHOT, <https://builds.apache.org/job/Airavata/ws/modules/commons/pom.xml,> line 31, column 21
[WARNING]
[WARNING] Some problems were encountered while building the effective model for airavata:airavata-registry-api:jar:0.0.1-SNAPSHOT
[WARNING] 'build.plugins.plugin.version' for org.apache.maven.plugins:maven-surefire-plugin is missing. @ airavata:airavata-commons:0.0.1-SNAPSHOT, <https://builds.apache.org/job/Airavata/ws/modules/commons/pom.xml,> line 31, column 21
[WARNING]
[WARNING] Some problems were encountered while building the effective model for airavata:airavata-commons:pom:0.0.1-SNAPSHOT
[WARNING] 'build.plugins.plugin.version' for org.apache.maven.plugins:maven-surefire-plugin is missing. @ line 31, column 21
[WARNING]
[WARNING] Some problems were encountered while building the effective model for airavata:simple-math-service:jar:0.0.1-SNAPSHOT
[WARNING] 'build.plugins.plugin.version' for org.apache.maven.plugins:maven-compiler-plugin is missing. @ line 38, column 12
[WARNING]
[WARNING] Some problems were encountered while building the effective model for Airavata:distribution:jar:0.0.1-SNAPSHOT
[WARNING] 'dependencies.dependency.(groupId:artifactId:type:classifier)' must be unique: lead-security:cryptix32:jar -> duplicate declaration of version versionless @ line 207, column 21
[WARNING] 'dependencies.dependency.(groupId:artifactId:type:classifier)' must be unique: xsul:xsul:jar -> version (?) vs 2.10.5_d @ line 246, column 21
[WARNING] The expression ${version} is deprecated. Please use ${project.version} instead.
[WARNING]
[WARNING] It is highly recommended to fix these problems because they threaten the stability of your build.
[WARNING]
[WARNING] For this reason, future Maven versions might no longer support building such malformed projects.
[WARNING]
[INFO] ------------------------------------------------------------------------
[INFO] Reactor Build Order:
[INFO]
[INFO] Airavata
[INFO] Airavata Commons
[INFO] Airavata GFac Schema Utilities
[INFO] Airavata Registry API
[INFO] Airavata-WS-Messenger
[INFO] Messenger Commons
[INFO] Messenger Client
[INFO] Airavata Workflow Tracking
[INFO] GFac-Core
[INFO] GFac-Axis2-Interface
[INFO] MessageBox
[INFO] Message Broker
[INFO] distribution
[INFO] Airavata Common Utilities
[INFO] Airavata XBaya
[INFO] Simple Math Service
[INFO] distribution
[INFO]
[INFO] ------------------------------------------------------------------------
[INFO] Building Airavata 0.0.1-SNAPSHOT
[INFO] ------------------------------------------------------------------------
[INFO]
[INFO] --- maven-clean-plugin:2.4.1:clean (default-clean) @ airavata ---
[INFO]
[INFO] --- maven-install-plugin:2.3.1:install (default-install) @ airavata ---
[INFO] Installing <https://builds.apache.org/job/Airavata/ws/pom.xml> to /export/home/hudson/.m2/repository/airavata/airavata/0.0.1-SNAPSHOT/airavata-0.0.1-SNAPSHOT.pom
[JENKINS] Archiving <https://builds.apache.org/job/Airavata/ws/pom.xml> to /home/hudson/hudson/jobs/Airavata/modules/airavata$airavata/builds/2011-10-20_04-22-18/archive/airavata/airavata/0.0.1-SNAPSHOT/airavata-0.0.1-SNAPSHOT.pom
[INFO]
[INFO] ------------------------------------------------------------------------
[INFO] Building Airavata Commons 0.0.1-SNAPSHOT
[INFO] ------------------------------------------------------------------------
[INFO]
[INFO] --- maven-clean-plugin:2.4.1:clean (default-clean) @ airavata-commons ---
[INFO] [INFO] Installing <https://builds.apache.org/job/Airavata/ws/modules/commons/pom.xml> to /export/home/hudson/.m2/repository/airavata/airavata-commons/0.0.1-SNAPSHOT/airavata-commons-0.0.1-SNAPSHOT.pom
[INFO] --- maven-install-plugin:2.3.1:install (default-install) @ airavata-commons ---
[JENKINS] Archiving <https://builds.apache.org/job/Airavata/ws/modules/commons/pom.xml> to /home/hudson/hudson/jobs/Airavata/modules/airavata$airavata-commons/builds/2011-10-20_04-22-18/archive/airavata/airavata-commons/0.0.1-SNAPSHOT/airavata-commons-0.0.1-SNAPSHOT.pom
[INFO]
[INFO] ------------------------------------------------------------------------
[INFO] Building Airavata GFac Schema Utilities 0.0.1-SNAPSHOT
[INFO] ------------------------------------------------------------------------
Downloading: http://community.ucs.indiana.edu:9090/archiva/repository/ogce.m2.all/xsul/xsul/2.10.5_d/xsul-2.10.5_d.pom
Downloaded: http://community.ucs.indiana.edu:9090/archiva/repository/ogce.m2.all/xsul/xsul/2.10.5_d/xsul-2.10.5_d.pom (407 B at 0.5 KB/sec)
Downloading: http://community.ucs.indiana.edu:9090/archiva/repository/ogce.m2.all/xsul/xsul/2.10.5_d/xsul-2.10.5_d.jar
Downloaded: http://community.ucs.indiana.edu:9090/archiva/repository/ogce.m2.all/xsul/xsul/2.10.5_d/xsul-2.10.5_d.jar (1758 KB at 255.7 KB/sec)
[INFO]
[INFO] --- maven-clean-plugin:2.4.1:clean (default-clean) @ airavata-gfac-schema-utils ---
[INFO]
[INFO] --- build-helper-maven-plugin:1.7:add-source (add-source) @ airavata-gfac-schema-utils ---
[INFO] Source directory: <https://builds.apache.org/job/Airavata/ws/modules/commons/gfac-schema/target/generated-sources/xmlbeans> added.
[INFO]
[INFO] --- xmlbeans-maven-plugin:2.3.3:xmlbeans (default) @ airavata-gfac-schema-utils ---
[INFO]
[INFO] --- maven-resources-plugin:2.4.3:resources (default-resources) @ airavata-gfac-schema-utils ---
[INFO] Using 'UTF-8' encoding to copy filtered resources.
[INFO] Copying 1 resource
[INFO] Copying 179 resources
[INFO]
[INFO] --- maven-compiler-plugin:2.0.2:compile (default-compile) @ airavata-gfac-schema-utils ---
[INFO] Compiling 20 source files to <https://builds.apache.org/job/Airavata/ws/modules/commons/gfac-schema/target/classes>
[JENKINS] Archiving <https://builds.apache.org/job/Airavata/ws/modules/commons/gfac-schema/pom.xml> to /home/hudson/hudson/jobs/Airavata/modules/airavata$airavata-gfac-schema-utils/builds/2011-10-20_04-22-18/archive/airavata/airavata-gfac-schema-utils/0.0.1-SNAPSHOT/airavata-gfac-schema-utils-0.0.1-SNAPSHOT.pom
[INFO] ------------------------------------------------------------------------
[INFO] Reactor Summary:
[INFO]
[INFO] Airavata .......................................... SUCCESS [1:13.076s]
[INFO] Airavata Commons .................................. SUCCESS [3.996s]
[INFO] Airavata GFac Schema Utilities .................... FAILURE [47.101s]
[INFO] Airavata Registry API ............................. SKIPPED
[INFO] Airavata-WS-Messenger ............................. SKIPPED
[INFO] Messenger Commons ................................. SKIPPED
[INFO] Messenger Client .................................. SKIPPED
[INFO] Airavata Workflow Tracking ........................ SKIPPED
[INFO] GFac-Core ......................................... SKIPPED
[INFO] GFac-Axis2-Interface .............................. SKIPPED
[INFO] MessageBox ........................................ SKIPPED
[INFO] Message Broker .................................... SKIPPED
[INFO] distribution ...................................... SKIPPED
[INFO] Airavata Common Utilities ......................... SKIPPED
[INFO] Airavata XBaya .................................... SKIPPED
[INFO] Simple Math Service ............................... SKIPPED
[INFO] distribution ...................................... SKIPPED
[INFO] ------------------------------------------------------------------------
[INFO] BUILD FAILURE
[INFO] ------------------------------------------------------------------------
[INFO] Total time: 2:57.382s
[INFO] Finished at: Thu Oct 20 05:29:49 GMT+00:00 2011
[INFO] Final Memory: 14M/80M
[INFO] ------------------------------------------------------------------------
mavenExecutionResult exceptions not empty
message : Failed to execute goal org.apache.maven.plugins:maven-compiler-plugin:2.0.2:compile (default-compile) on project airavata-gfac-schema-utils: Compilation failure
cause : Compilation failure
Stack trace :
org.apache.maven.lifecycle.LifecycleExecutionException: Failed to execute goal org.apache.maven.plugins:maven-compiler-plugin:2.0.2:compile (default-compile) on project airavata-gfac-schema-utils: Compilation failure
at org.apache.maven.lifecycle.internal.MojoExecutor.execute(MojoExecutor.java:213)
at org.apache.maven.lifecycle.internal.MojoExecutor.execute(MojoExecutor.java:153)
at org.apache.maven.lifecycle.internal.MojoExecutor.execute(MojoExecutor.java:145)
at org.apache.maven.lifecycle.internal.LifecycleModuleBuilder.buildProject(LifecycleModuleBuilder.java:84)
at org.apache.maven.lifecycle.internal.LifecycleModuleBuilder.buildProject(LifecycleModuleBuilder.java:59)
at org.apache.maven.lifecycle.internal.LifecycleStarter.singleThreadedBuild(LifecycleStarter.java:183)
at org.apache.maven.lifecycle.internal.LifecycleStarter.execute(LifecycleStarter.java:161)
at org.apache.maven.DefaultMaven.doExecute(DefaultMaven.java:319)
at org.apache.maven.DefaultMaven.execute(DefaultMaven.java:156)
at org.jvnet.hudson.maven3.launcher.Maven3Launcher.main(Maven3Launcher.java:79)
at sun.reflect.NativeMethodAccessorImpl.invoke0(Native Method)
at sun.reflect.NativeMethodAccessorImpl.invoke(NativeMethodAccessorImpl.java:39)
at sun.reflect.DelegatingMethodAccessorImpl.invoke(DelegatingMethodAccessorImpl.java:25)
at java.lang.reflect.Method.invoke(Method.java:597)
at org.codehaus.plexus.classworlds.launcher.Launcher.launchStandard(Launcher.java:329)
at org.codehaus.plexus.classworlds.launcher.Launcher.launch(Launcher.java:239)
at org.jvnet.hudson.maven3.agent.Maven3Main.launch(Maven3Main.java:158)
at hudson.maven.Maven3Builder.call(Maven3Builder.java:122)
at hudson.maven.Maven3Builder.call(Maven3Builder.java:74)
at hudson.remoting.UserRequest.perform(UserRequest.java:118)
at hudson.remoting.UserRequest.perform(UserRequest.java:48)
at hudson.remoting.Request$2.run(Request.java:287)
at java.util.concurrent.Executors$RunnableAdapter.call(Executors.java:441)
at java.util.concurrent.FutureTask$Sync.innerRun(FutureTask.java:303)
at java.util.concurrent.FutureTask.run(FutureTask.java:138)
at java.util.concurrent.ThreadPoolExecutor$Worker.runTask(ThreadPoolExecutor.java:886)
at java.util.concurrent.ThreadPoolExecutor$Worker.run(ThreadPoolExecutor.java:908)
at java.lang.Thread.run(Thread.java:662)
Caused by: org.apache.maven.plugin.CompilationFailureException: Compilation failure
at org.apache.maven.plugin.AbstractCompilerMojo.execute(AbstractCompilerMojo.java:516)
at org.apache.maven.plugin.CompilerMojo.execute(CompilerMojo.java:114)
at org.apache.maven.plugin.DefaultBuildPluginManager.executeMojo(DefaultBuildPluginManager.java:101)
at org.apache.maven.lifecycle.internal.MojoExecutor.execute(MojoExecutor.java:209)
... 27 more
Sending e-mails to: airavata-dev@incubator.apache.org
channel stopped
Build failed in Jenkins: Airavata #128
Posted by Apache Jenkins Server <je...@builds.apache.org>.
See <https://builds.apache.org/job/Airavata/128/changes>
Changes:
[lahiru] minor changes.
------------------------------------------
[...truncated 1474 lines...]
A modules/commons/gfac-schema/src/main/resources/datatype.properties
A modules/commons/gfac-schema/pom.xml
A modules/workflow-interpreter
A modules/workflow-interpreter/src
A modules/workflow-interpreter/src/main
A modules/workflow-interpreter/src/main/resources
A modules/workflow-interpreter/src/main/resources/WorkflowInterpretor.wsdl
A modules/workflow-interpreter/src/main/resources/services.xml
A modules/workflow-interpreter/pom.xml
A modules/workflow-interpreter/client
A pom.xml
At revision 1187079
Parsing POMs
Modules changed, recalculating dependency graph
[Airavata] $ /home/hudson/tools/java/latest1.6/bin/java -cp /home/jenkins/jenkins-slave/maven3-agent.jar:/home/hudson/tools/maven/latest3/boot/plexus-classworlds-2.4.jar org.jvnet.hudson.maven3.agent.Maven3Main /home/hudson/tools/maven/latest3 /home/jenkins/jenkins-slave/slave.jar /home/jenkins/jenkins-slave/maven3-interceptor.jar 54239
channel started
<===[JENKINS REMOTING CAPACITY]===> [WARNING]
[WARNING] Some problems were encountered while building the effective model for airavata:airavata-gfac-core:jar:0.0.1-SNAPSHOT
Executing Maven: -B -f <https://builds.apache.org/job/Airavata/ws/pom.xml> clean install[WARNING] 'build.plugins.plugin.version' for org.apache.maven.plugins:maven-surefire-plugin is missing. @ line 140, column 21
[WARNING]
[WARNING] Some problems were encountered while building the effective model for airavata:airavata-messenger-commons:jar:0.0.1-SNAPSHOT
[WARNING] 'build.plugins.plugin.version' for org.apache.maven.plugins:maven-surefire-plugin is missing. @ airavata:airavata-ws-messenger:0.0.1-SNAPSHOT, <https://builds.apache.org/job/Airavata/ws/modules/ws-messenger/pom.xml,> line 116, column 21
[WARNING]
[WARNING] Some problems were encountered while building the effective model for airavata:airavata-messenger-client:jar:0.0.1-SNAPSHOT
[WARNING] 'build.plugins.plugin.version' for org.apache.maven.plugins:maven-surefire-plugin is missing. @ airavata:airavata-ws-messenger:0.0.1-SNAPSHOT, <https://builds.apache.org/job/Airavata/ws/modules/ws-messenger/pom.xml,> line 116, column 21
[WARNING]
[WARNING] Some problems were encountered while building the effective model for airavata:airavata-messagebox:jar:0.0.1-SNAPSHOT
[WARNING] 'build.plugins.plugin.version' for org.apache.maven.plugins:maven-surefire-plugin is missing. @ airavata:airavata-ws-messenger:0.0.1-SNAPSHOT, <https://builds.apache.org/job/Airavata/ws/modules/ws-messenger/pom.xml,> line 116, column 21
[WARNING]
[WARNING] Some problems were encountered while building the effective model for airavata:airavata-messagebroker:jar:0.0.1-SNAPSHOT
[WARNING] 'build.plugins.plugin.version' for org.apache.maven.plugins:maven-surefire-plugin is missing. @ airavata:airavata-ws-messenger:0.0.1-SNAPSHOT, <https://builds.apache.org/job/Airavata/ws/modules/ws-messenger/pom.xml,> line 116, column 21
[WARNING] 'build.plugins.plugin.version' for org.apache.maven.plugins:maven-jar-plugin is missing. @ line 17, column 21
[WARNING]
[WARNING] Some problems were encountered while building the effective model for Airavata:ws-messenger-distribution:jar:0.0.1-SNAPSHOT
[WARNING] 'build.plugins.plugin.version' for org.apache.maven.plugins:maven-surefire-plugin is missing. @ airavata:airavata-ws-messenger:0.0.1-SNAPSHOT, <https://builds.apache.org/job/Airavata/ws/modules/ws-messenger/pom.xml,> line 116, column 21
[WARNING] The expression ${version} is deprecated. Please use ${project.version} instead.
[WARNING]
[WARNING] Some problems were encountered while building the effective model for airavata:airavata-ws-messenger:pom:0.0.1-SNAPSHOT
[WARNING] 'build.plugins.plugin.version' for org.apache.maven.plugins:maven-surefire-plugin is missing. @ line 116, column 21
[WARNING]
[WARNING] Some problems were encountered while building the effective model for airavata:airavata-xbaya-gui:jar:0.0.1-SNAPSHOT
[WARNING] 'dependencies.dependency.(groupId:artifactId:type:classifier)' must be unique: airavata:airavata-common-utils:jar -> duplicate declaration of version ${airavata.version} @ line 380, column 21
[WARNING] 'dependencies.dependency.(groupId:artifactId:type:classifier)' must be unique: log4j:log4j:jar -> duplicate declaration of version (?) @ line 409, column 21
[WARNING] 'build.plugins.plugin.version' for org.codehaus.mojo.webstart:webstart-maven-plugin is missing. @ line 119, column 21
[WARNING] 'build.plugins.plugin.version' for org.apache.maven.plugins:maven-compiler-plugin is missing. @ line 80, column 21
[WARNING] 'build.plugins.plugin.version' for org.apache.maven.plugins:maven-jar-plugin is missing. @ line 88, column 21
[WARNING]
[WARNING] Some problems were encountered while building the effective model for airavata:airavata-workflowtracking:jar:0.0.1-SNAPSHOT
[WARNING] 'build.plugins.plugin.version' for org.apache.maven.plugins:maven-surefire-plugin is missing. @ line 84, column 21
[WARNING] The expression ${pom.version} is deprecated. Please use ${project.version} instead.
[WARNING]
[WARNING] Some problems were encountered while building the effective model for airavata:airavata-gfac-schema-utils:jar:0.0.1-SNAPSHOT
[WARNING] 'build.plugins.plugin.version' for org.apache.maven.plugins:maven-surefire-plugin is missing. @ airavata:airavata-commons:0.0.1-SNAPSHOT, <https://builds.apache.org/job/Airavata/ws/modules/commons/pom.xml,> line 31, column 21
[WARNING] 'build.plugins.plugin.version' for org.codehaus.mojo:build-helper-maven-plugin is missing. @ line 98, column 21
[WARNING] The expression ${artifactId} is deprecated. Please use ${project.artifactId} instead.
[WARNING] The expression ${version} is deprecated. Please use ${project.version} instead.
[WARNING]
[WARNING] Some problems were encountered while building the effective model for airavata:airavata-common-utils:jar:0.0.1-SNAPSHOT
[WARNING] 'build.plugins.plugin.version' for org.apache.maven.plugins:maven-surefire-plugin is missing. @ airavata:airavata-commons:0.0.1-SNAPSHOT, <https://builds.apache.org/job/Airavata/ws/modules/commons/pom.xml,> line 31, column 21
[WARNING]
[WARNING] Some problems were encountered while building the effective model for airavata:airavata-registry-api:jar:0.0.1-SNAPSHOT
[WARNING] 'build.plugins.plugin.version' for org.apache.maven.plugins:maven-surefire-plugin is missing. @ airavata:airavata-commons:0.0.1-SNAPSHOT, <https://builds.apache.org/job/Airavata/ws/modules/commons/pom.xml,> line 31, column 21
[WARNING]
[WARNING] Some problems were encountered while building the effective model for airavata:airavata-workflow-execution-context:jar:0.0.1-SNAPSHOT
[WARNING] 'build.plugins.plugin.version' for org.apache.maven.plugins:maven-surefire-plugin is missing. @ airavata:airavata-commons:0.0.1-SNAPSHOT, <https://builds.apache.org/job/Airavata/ws/modules/commons/pom.xml,> line 31, column 21
[WARNING] 'build.plugins.plugin.version' for org.codehaus.mojo:build-helper-maven-plugin is missing. @ line 83, column 12
[WARNING] The expression ${artifactId} is deprecated. Please use ${project.artifactId} instead.
[WARNING] The expression ${version} is deprecated. Please use ${project.version} instead.
[WARNING]
[WARNING] Some problems were encountered while building the effective model for airavata:airavata-commons:pom:0.0.1-SNAPSHOT
[WARNING] 'build.plugins.plugin.version' for org.apache.maven.plugins:maven-surefire-plugin is missing. @ line 31, column 21
[WARNING]
[WARNING] Some problems were encountered while building the effective model for airavata:simple-math-service:jar:0.0.1-SNAPSHOT
[WARNING] 'build.plugins.plugin.version' for org.apache.maven.plugins:maven-compiler-plugin is missing. @ line 38, column 12
[WARNING]
[WARNING] Some problems were encountered while building the effective model for Airavata:distribution:jar:0.0.1-SNAPSHOT
[WARNING] 'dependencies.dependency.(groupId:artifactId:type:classifier)' must be unique: lead-security:cryptix32:jar -> duplicate declaration of version versionless @ line 207, column 21
[WARNING] 'dependencies.dependency.(groupId:artifactId:type:classifier)' must be unique: xsul:xsul:jar -> version (?) vs 2.10.5_d @ line 246, column 21
[WARNING] The expression ${version} is deprecated. Please use ${project.version} instead.
[WARNING]
[WARNING] It is highly recommended to fix these problems because they threaten the stability of your build.
[WARNING]
[WARNING] For this reason, future Maven versions might no longer support building such malformed projects.
[WARNING]
[INFO] Scanning for projects...
[INFO] ------------------------------------------------------------------------
[INFO] Reactor Build Order:
[INFO]
[INFO] Airavata
[INFO] Airavata Commons
[INFO] Airavata GFac Schema Utilities
[INFO] Airavata Registry API
[INFO] Airavata-WS-Messenger
[INFO] Messenger Commons
[INFO] Messenger Client
[INFO] Airavata Workflow Tracking
[INFO] GFac-Core
[INFO] GFac-Axis2-Interface
[INFO] MessageBox
[INFO] Message Broker
[INFO] distribution
[INFO] Airavata Common Utilities
[INFO] Airavata Workflow Execution Context
[INFO] Airavata XBaya
[INFO] Simple Math Service
[INFO] distribution
[INFO]
[INFO] ------------------------------------------------------------------------
[INFO] Building Airavata 0.0.1-SNAPSHOT
[INFO] ------------------------------------------------------------------------
[INFO]
[INFO] --- maven-clean-plugin:2.4.1:clean (default-clean) @ airavata ---
[INFO] [INFO] Installing <https://builds.apache.org/job/Airavata/ws/pom.xml> to /home/jenkins/.m2/repository/airavata/airavata/0.0.1-SNAPSHOT/airavata-0.0.1-SNAPSHOT.pom
[INFO] --- maven-install-plugin:2.3.1:install (default-install) @ airavata ---
[JENKINS] Archiving <https://builds.apache.org/job/Airavata/ws/pom.xml> to /home/hudson/hudson/jobs/Airavata/modules/airavata$airavata/builds/2011-10-20_22-02-55/archive/airavata/airavata/0.0.1-SNAPSHOT/airavata-0.0.1-SNAPSHOT.pom
[INFO]
[INFO] ------------------------------------------------------------------------
[INFO] Building Airavata Commons 0.0.1-SNAPSHOT
[INFO] ------------------------------------------------------------------------
[INFO]
[INFO] --- maven-clean-plugin:2.4.1:clean (default-clean) @ airavata-commons ---
[INFO] Installing <https://builds.apache.org/job/Airavata/ws/modules/commons/pom.xml> to /home/jenkins/.m2/repository/airavata/airavata-commons/0.0.1-SNAPSHOT/airavata-commons-0.0.1-SNAPSHOT.pom
[INFO]
[INFO] --- maven-install-plugin:2.3.1:install (default-install) @ airavata-commons ---
[JENKINS] Archiving <https://builds.apache.org/job/Airavata/ws/modules/commons/pom.xml> to /home/hudson/hudson/jobs/Airavata/modules/airavata$airavata-commons/builds/2011-10-20_22-02-55/archive/airavata/airavata-commons/0.0.1-SNAPSHOT/airavata-commons-0.0.1-SNAPSHOT.pom
[INFO]
[INFO] ------------------------------------------------------------------------
[INFO] Building Airavata GFac Schema Utilities 0.0.1-SNAPSHOT
[INFO] ------------------------------------------------------------------------
[INFO]
[INFO] --- maven-clean-plugin:2.4.1:clean (default-clean) @ airavata-gfac-schema-utils ---
[INFO] [INFO] Source directory: <https://builds.apache.org/job/Airavata/ws/modules/commons/gfac-schema/target/generated-sources/xmlbeans> added.
[INFO] --- build-helper-maven-plugin:1.7:add-source (add-source) @ airavata-gfac-schema-utils ---
[INFO]
[INFO] --- xmlbeans-maven-plugin:2.3.3:xmlbeans (default) @ airavata-gfac-schema-utils ---
[INFO] Using 'UTF-8' encoding to copy filtered resources.
[INFO] [INFO] Copying 1 resource
[INFO] Copying 179 resources
[INFO] --- maven-resources-plugin:2.4.3:resources (default-resources) @ airavata-gfac-schema-utils ---
[INFO] [INFO] Compiling 20 source files to <https://builds.apache.org/job/Airavata/ws/modules/commons/gfac-schema/target/classes>
[INFO] --- maven-compiler-plugin:2.0.2:compile (default-compile) @ airavata-gfac-schema-utils ---
[INFO] Using 'UTF-8' encoding to copy filtered resources.
[INFO] [INFO] skip non existing resourceDirectory <https://builds.apache.org/job/Airavata/ws/modules/commons/gfac-schema/src/test/resources>
[INFO] --- maven-resources-plugin:2.4.3:testResources (default-testResources) @ airavata-gfac-schema-utils ---
[INFO] No sources to compile
[INFO]
[INFO] --- maven-compiler-plugin:2.0.2:testCompile (default-testCompile) @ airavata-gfac-schema-utils ---
[INFO]
[INFO] --- maven-surefire-plugin:2.7.2:test (default-test) @ airavata-gfac-schema-utils ---
[INFO] Tests are skipped.
[INFO]
[INFO] --- maven-jar-plugin:2.3.1:jar (default-jar) @ airavata-gfac-schema-utils ---
[INFO] Building jar: <https://builds.apache.org/job/Airavata/ws/modules/commons/gfac-schema/target/airavata-gfac-schema-utils-0.0.1-SNAPSHOT.jar>
[INFO] [INFO] Installing <https://builds.apache.org/job/Airavata/ws/modules/commons/gfac-schema/target/airavata-gfac-schema-utils-0.0.1-SNAPSHOT.jar> to /home/jenkins/.m2/repository/airavata/airavata-gfac-schema-utils/0.0.1-SNAPSHOT/airavata-gfac-schema-utils-0.0.1-SNAPSHOT.jar
[INFO] Installing <https://builds.apache.org/job/Airavata/ws/modules/commons/gfac-schema/pom.xml> to /home/jenkins/.m2/repository/airavata/airavata-gfac-schema-utils/0.0.1-SNAPSHOT/airavata-gfac-schema-utils-0.0.1-SNAPSHOT.pom
[INFO] --- maven-install-plugin:2.3.1:install (default-install) @ airavata-gfac-schema-utils ---
[JENKINS] Archiving <https://builds.apache.org/job/Airavata/ws/modules/commons/gfac-schema/pom.xml> to /home/hudson/hudson/jobs/Airavata/modules/airavata$airavata-gfac-schema-utils/builds/2011-10-20_22-02-55/archive/airavata/airavata-gfac-schema-utils/0.0.1-SNAPSHOT/airavata-gfac-schema-utils-0.0.1-SNAPSHOT.pom
[JENKINS] Archiving <https://builds.apache.org/job/Airavata/ws/modules/commons/gfac-schema/target/airavata-gfac-schema-utils-0.0.1-SNAPSHOT.jar> to /home/hudson/hudson/jobs/Airavata/modules/airavata$airavata-gfac-schema-utils/builds/2011-10-20_22-02-55/archive/airavata/airavata-gfac-schema-utils/0.0.1-SNAPSHOT/airavata-gfac-schema-utils-0.0.1-SNAPSHOT.jar
[INFO]
[INFO] ------------------------------------------------------------------------
[INFO] Building Airavata Registry API 0.0.1-SNAPSHOT
[INFO] ------------------------------------------------------------------------
[INFO]
[INFO] --- maven-clean-plugin:2.4.1:clean (default-clean) @ airavata-registry-api ---
[INFO] Using 'UTF-8' encoding to copy filtered resources.
[INFO] [INFO] skip non existing resourceDirectory <https://builds.apache.org/job/Airavata/ws/modules/commons/registry-api/src/main/resources>
[INFO] --- maven-resources-plugin:2.4.3:resources (default-resources) @ airavata-registry-api ---
[INFO] Compiling 14 source files to <https://builds.apache.org/job/Airavata/ws/modules/commons/registry-api/target/classes>
[INFO]
[INFO] --- maven-compiler-plugin:2.0.2:compile (default-compile) @ airavata-registry-api ---
[JENKINS] Archiving <https://builds.apache.org/job/Airavata/ws/modules/commons/registry-api/pom.xml> to /home/hudson/hudson/jobs/Airavata/modules/airavata$airavata-registry-api/builds/2011-10-20_22-02-55/archive/airavata/airavata-registry-api/0.0.1-SNAPSHOT/airavata-registry-api-0.0.1-SNAPSHOT.pom
[INFO] ------------------------------------------------------------------------
[INFO] Reactor Summary:
[INFO]
[INFO] Airavata .......................................... SUCCESS [4:50.665s]
[INFO] Airavata Commons .................................. SUCCESS [23.171s]
[INFO] Airavata GFac Schema Utilities .................... SUCCESS [3:22.026s]
[INFO] Airavata Registry API ............................. FAILURE [36.241s]
[INFO] Airavata-WS-Messenger ............................. SKIPPED
[INFO] Messenger Commons ................................. SKIPPED
[INFO] Messenger Client .................................. SKIPPED
[INFO] Airavata Workflow Tracking ........................ SKIPPED
[INFO] GFac-Core ......................................... SKIPPED
[INFO] GFac-Axis2-Interface .............................. SKIPPED
[INFO] MessageBox ........................................ SKIPPED
[INFO] Message Broker .................................... SKIPPED
[INFO] distribution ...................................... SKIPPED
[INFO] Airavata Common Utilities ......................... SKIPPED
[INFO] Airavata Workflow Execution Context ............... SKIPPED
[INFO] Airavata XBaya .................................... SKIPPED
[INFO] Simple Math Service ............................... SKIPPED
[INFO] distribution ...................................... SKIPPED
[INFO] ------------------------------------------------------------------------
[INFO] BUILD FAILURE
[INFO] ------------------------------------------------------------------------
[INFO] Total time: 13:50.727s
[INFO] Finished at: Thu Oct 20 22:21:20 UTC 2011
[INFO] Final Memory: 22M/76M
[INFO] ------------------------------------------------------------------------
Waiting for Jenkins to finish collecting data
mavenExecutionResult exceptions not empty
message : Failed to execute goal org.apache.maven.plugins:maven-compiler-plugin:2.0.2:compile (default-compile) on project airavata-registry-api: Compilation failure
cause : Compilation failure
Stack trace :
org.apache.maven.lifecycle.LifecycleExecutionException: Failed to execute goal org.apache.maven.plugins:maven-compiler-plugin:2.0.2:compile (default-compile) on project airavata-registry-api: Compilation failure
at org.apache.maven.lifecycle.internal.MojoExecutor.execute(MojoExecutor.java:213)
at org.apache.maven.lifecycle.internal.MojoExecutor.execute(MojoExecutor.java:153)
at org.apache.maven.lifecycle.internal.MojoExecutor.execute(MojoExecutor.java:145)
at org.apache.maven.lifecycle.internal.LifecycleModuleBuilder.buildProject(LifecycleModuleBuilder.java:84)
at org.apache.maven.lifecycle.internal.LifecycleModuleBuilder.buildProject(LifecycleModuleBuilder.java:59)
at org.apache.maven.lifecycle.internal.LifecycleStarter.singleThreadedBuild(LifecycleStarter.java:183)
at org.apache.maven.lifecycle.internal.LifecycleStarter.execute(LifecycleStarter.java:161)
at org.apache.maven.DefaultMaven.doExecute(DefaultMaven.java:319)
at org.apache.maven.DefaultMaven.execute(DefaultMaven.java:156)
at org.jvnet.hudson.maven3.launcher.Maven3Launcher.main(Maven3Launcher.java:79)
at sun.reflect.NativeMethodAccessorImpl.invoke0(Native Method)
at sun.reflect.NativeMethodAccessorImpl.invoke(NativeMethodAccessorImpl.java:39)
at sun.reflect.DelegatingMethodAccessorImpl.invoke(DelegatingMethodAccessorImpl.java:25)
at java.lang.reflect.Method.invoke(Method.java:597)
at org.codehaus.plexus.classworlds.launcher.Launcher.launchStandard(Launcher.java:329)
at org.codehaus.plexus.classworlds.launcher.Launcher.launch(Launcher.java:239)
at org.jvnet.hudson.maven3.agent.Maven3Main.launch(Maven3Main.java:158)
at hudson.maven.Maven3Builder.call(Maven3Builder.java:122)
at hudson.maven.Maven3Builder.call(Maven3Builder.java:74)
at hudson.remoting.UserRequest.perform(UserRequest.java:118)
at hudson.remoting.UserRequest.perform(UserRequest.java:48)
at hudson.remoting.Request$2.run(Request.java:287)
at java.util.concurrent.Executors$RunnableAdapter.call(Executors.java:441)
at java.util.concurrent.FutureTask$Sync.innerRun(FutureTask.java:303)
at java.util.concurrent.FutureTask.run(FutureTask.java:138)
at java.util.concurrent.ThreadPoolExecutor$Worker.runTask(ThreadPoolExecutor.java:886)
at java.util.concurrent.ThreadPoolExecutor$Worker.run(ThreadPoolExecutor.java:908)
at java.lang.Thread.run(Thread.java:662)
Caused by: org.apache.maven.plugin.CompilationFailureException: Compilation failure
at org.apache.maven.plugin.AbstractCompilerMojo.execute(AbstractCompilerMojo.java:516)
at org.apache.maven.plugin.CompilerMojo.execute(CompilerMojo.java:114)
at org.apache.maven.plugin.DefaultBuildPluginManager.executeMojo(DefaultBuildPluginManager.java:101)
at org.apache.maven.lifecycle.internal.MojoExecutor.execute(MojoExecutor.java:209)
... 27 more
Sending e-mails to: airavata-dev@incubator.apache.org
channel stopped
Build failed in Jenkins: Airavata #127
Posted by Apache Jenkins Server <je...@builds.apache.org>.
See <https://builds.apache.org/job/Airavata/127/changes>
Changes:
[lahiru] fixing build error.
[lahiru] removing.
------------------------------------------
[...truncated 1463 lines...]
A modules/commons/gfac-schema/pom.xml
A modules/workflow-interpreter
A modules/workflow-interpreter/src
A modules/workflow-interpreter/src/main
A modules/workflow-interpreter/src/main/resources
A modules/workflow-interpreter/src/main/resources/WorkflowInterpretor.wsdl
A modules/workflow-interpreter/src/main/resources/services.xml
A modules/workflow-interpreter/pom.xml
A modules/workflow-interpreter/client
A pom.xml
At revision 1187050
Parsing POMs
Modules changed, recalculating dependency graph
[Airavata] $ /home/hudson/tools/java/latest1.6/bin/java -cp /home/jenkins/jenkins-slave/maven3-agent.jar:/home/hudson/tools/maven/latest3/boot/plexus-classworlds-2.4.jar org.jvnet.hudson.maven3.agent.Maven3Main /home/hudson/tools/maven/latest3 /home/jenkins/jenkins-slave/slave.jar /home/jenkins/jenkins-slave/maven3-interceptor.jar 53181
channel started
<===[JENKINS REMOTING CAPACITY]===> [WARNING]
[WARNING] Some problems were encountered while building the effective model for airavata:airavata-gfac-core:jar:0.0.1-SNAPSHOT
[WARNING] 'build.plugins.plugin.version' for org.apache.maven.plugins:maven-surefire-plugin is missing. @ line 140, column 21
[WARNING]
[WARNING] Some problems were encountered while building the effective model for airavata:airavata-messenger-commons:jar:0.0.1-SNAPSHOT
Executing Maven: -B -f <https://builds.apache.org/job/Airavata/ws/pom.xml> clean install[WARNING] 'build.plugins.plugin.version' for org.apache.maven.plugins:maven-surefire-plugin is missing. @ airavata:airavata-ws-messenger:0.0.1-SNAPSHOT, <https://builds.apache.org/job/Airavata/ws/modules/ws-messenger/pom.xml,> line 116, column 21
[WARNING]
[WARNING] Some problems were encountered while building the effective model for airavata:airavata-messenger-client:jar:0.0.1-SNAPSHOT
[WARNING] 'build.plugins.plugin.version' for org.apache.maven.plugins:maven-surefire-plugin is missing. @ airavata:airavata-ws-messenger:0.0.1-SNAPSHOT, <https://builds.apache.org/job/Airavata/ws/modules/ws-messenger/pom.xml,> line 116, column 21
[WARNING]
[WARNING] Some problems were encountered while building the effective model for airavata:airavata-messagebox:jar:0.0.1-SNAPSHOT
[WARNING] 'build.plugins.plugin.version' for org.apache.maven.plugins:maven-surefire-plugin is missing. @ airavata:airavata-ws-messenger:0.0.1-SNAPSHOT, <https://builds.apache.org/job/Airavata/ws/modules/ws-messenger/pom.xml,> line 116, column 21
[WARNING]
[WARNING] Some problems were encountered while building the effective model for airavata:airavata-messagebroker:jar:0.0.1-SNAPSHOT
[WARNING] 'build.plugins.plugin.version' for org.apache.maven.plugins:maven-surefire-plugin is missing. @ airavata:airavata-ws-messenger:0.0.1-SNAPSHOT, <https://builds.apache.org/job/Airavata/ws/modules/ws-messenger/pom.xml,> line 116, column 21
[WARNING] 'build.plugins.plugin.version' for org.apache.maven.plugins:maven-jar-plugin is missing. @ line 17, column 21
[WARNING]
[WARNING] Some problems were encountered while building the effective model for Airavata:ws-messenger-distribution:jar:0.0.1-SNAPSHOT
[WARNING] 'build.plugins.plugin.version' for org.apache.maven.plugins:maven-surefire-plugin is missing. @ airavata:airavata-ws-messenger:0.0.1-SNAPSHOT, <https://builds.apache.org/job/Airavata/ws/modules/ws-messenger/pom.xml,> line 116, column 21
[WARNING] The expression ${version} is deprecated. Please use ${project.version} instead.
[WARNING]
[WARNING] Some problems were encountered while building the effective model for airavata:airavata-ws-messenger:pom:0.0.1-SNAPSHOT
[WARNING] 'build.plugins.plugin.version' for org.apache.maven.plugins:maven-surefire-plugin is missing. @ line 116, column 21
[WARNING]
[WARNING] Some problems were encountered while building the effective model for airavata:airavata-xbaya-gui:jar:0.0.1-SNAPSHOT
[WARNING] 'dependencies.dependency.(groupId:artifactId:type:classifier)' must be unique: airavata:airavata-common-utils:jar -> duplicate declaration of version ${airavata.version} @ line 380, column 21
[WARNING] 'dependencies.dependency.(groupId:artifactId:type:classifier)' must be unique: log4j:log4j:jar -> duplicate declaration of version (?) @ line 409, column 21
[WARNING] 'build.plugins.plugin.version' for org.codehaus.mojo.webstart:webstart-maven-plugin is missing. @ line 119, column 21
[WARNING] 'build.plugins.plugin.version' for org.apache.maven.plugins:maven-compiler-plugin is missing. @ line 80, column 21
[WARNING] 'build.plugins.plugin.version' for org.apache.maven.plugins:maven-jar-plugin is missing. @ line 88, column 21
[WARNING]
[WARNING] Some problems were encountered while building the effective model for airavata:airavata-workflowtracking:jar:0.0.1-SNAPSHOT
[WARNING] 'build.plugins.plugin.version' for org.apache.maven.plugins:maven-surefire-plugin is missing. @ line 84, column 21
[WARNING] The expression ${pom.version} is deprecated. Please use ${project.version} instead.
[WARNING]
[WARNING] Some problems were encountered while building the effective model for airavata:airavata-gfac-schema-utils:jar:0.0.1-SNAPSHOT
[WARNING] 'build.plugins.plugin.version' for org.apache.maven.plugins:maven-surefire-plugin is missing. @ airavata:airavata-commons:0.0.1-SNAPSHOT, <https://builds.apache.org/job/Airavata/ws/modules/commons/pom.xml,> line 31, column 21
[WARNING] 'build.plugins.plugin.version' for org.codehaus.mojo:build-helper-maven-plugin is missing. @ line 98, column 21
[WARNING] The expression ${artifactId} is deprecated. Please use ${project.artifactId} instead.
[WARNING] The expression ${version} is deprecated. Please use ${project.version} instead.
[WARNING]
[WARNING] Some problems were encountered while building the effective model for airavata:airavata-common-utils:jar:0.0.1-SNAPSHOT
[WARNING] 'build.plugins.plugin.version' for org.apache.maven.plugins:maven-surefire-plugin is missing. @ airavata:airavata-commons:0.0.1-SNAPSHOT, <https://builds.apache.org/job/Airavata/ws/modules/commons/pom.xml,> line 31, column 21
[WARNING]
[WARNING] Some problems were encountered while building the effective model for airavata:airavata-registry-api:jar:0.0.1-SNAPSHOT
[WARNING] 'build.plugins.plugin.version' for org.apache.maven.plugins:maven-surefire-plugin is missing. @ airavata:airavata-commons:0.0.1-SNAPSHOT, <https://builds.apache.org/job/Airavata/ws/modules/commons/pom.xml,> line 31, column 21
[WARNING]
[WARNING] Some problems were encountered while building the effective model for airavata:airavata-workflow-execution-context:jar:0.0.1-SNAPSHOT
[WARNING] 'build.plugins.plugin.version' for org.apache.maven.plugins:maven-surefire-plugin is missing. @ airavata:airavata-commons:0.0.1-SNAPSHOT, <https://builds.apache.org/job/Airavata/ws/modules/commons/pom.xml,> line 31, column 21
[WARNING] 'build.plugins.plugin.version' for org.codehaus.mojo:build-helper-maven-plugin is missing. @ line 83, column 12
[WARNING] The expression ${artifactId} is deprecated. Please use ${project.artifactId} instead.
[WARNING] The expression ${version} is deprecated. Please use ${project.version} instead.
[WARNING]
[WARNING] Some problems were encountered while building the effective model for airavata:airavata-commons:pom:0.0.1-SNAPSHOT
[WARNING] 'build.plugins.plugin.version' for org.apache.maven.plugins:maven-surefire-plugin is missing. @ line 31, column 21
[WARNING]
[WARNING] Some problems were encountered while building the effective model for airavata:simple-math-service:jar:0.0.1-SNAPSHOT
[WARNING] 'build.plugins.plugin.version' for org.apache.maven.plugins:maven-compiler-plugin is missing. @ line 38, column 12
[WARNING]
[WARNING] Some problems were encountered while building the effective model for Airavata:distribution:jar:0.0.1-SNAPSHOT
[WARNING] 'dependencies.dependency.(groupId:artifactId:type:classifier)' must be unique: lead-security:cryptix32:jar -> duplicate declaration of version versionless @ line 207, column 21
[WARNING] 'dependencies.dependency.(groupId:artifactId:type:classifier)' must be unique: xsul:xsul:jar -> version (?) vs 2.10.5_d @ line 246, column 21
[WARNING] The expression ${version} is deprecated. Please use ${project.version} instead.
[WARNING]
[WARNING] It is highly recommended to fix these problems because they threaten the stability of your build.
[WARNING]
[WARNING] For this reason, future Maven versions might no longer support building such malformed projects.
[WARNING]
[INFO] Scanning for projects...
[INFO] ------------------------------------------------------------------------
[INFO] Reactor Build Order:
[INFO]
[INFO] Airavata
[INFO] Airavata Commons
[INFO] Airavata GFac Schema Utilities
[INFO] Airavata Registry API
[INFO] Airavata-WS-Messenger
[INFO] Messenger Commons
[INFO] Messenger Client
[INFO] Airavata Workflow Tracking
[INFO] GFac-Core
[INFO] GFac-Axis2-Interface
[INFO] MessageBox
[INFO] Message Broker
[INFO] distribution
[INFO] Airavata Common Utilities
[INFO] Airavata Workflow Execution Context
[INFO] Airavata XBaya
[INFO] Simple Math Service
[INFO] distribution
[INFO]
[INFO] ------------------------------------------------------------------------
[INFO] Building Airavata 0.0.1-SNAPSHOT
[INFO] ------------------------------------------------------------------------
[INFO]
[INFO] --- maven-clean-plugin:2.4.1:clean (default-clean) @ airavata ---
[INFO]
[INFO] --- maven-install-plugin:2.3.1:install (default-install) @ airavata ---
[INFO] Installing <https://builds.apache.org/job/Airavata/ws/pom.xml> to /home/jenkins/.m2/repository/airavata/airavata/0.0.1-SNAPSHOT/airavata-0.0.1-SNAPSHOT.pom
[JENKINS] Archiving <https://builds.apache.org/job/Airavata/ws/pom.xml> to /home/hudson/hudson/jobs/Airavata/modules/airavata$airavata/builds/2011-10-20_21-12-18/archive/airavata/airavata/0.0.1-SNAPSHOT/airavata-0.0.1-SNAPSHOT.pom
[INFO]
[INFO] ------------------------------------------------------------------------
[INFO] Building Airavata Commons 0.0.1-SNAPSHOT
[INFO] ------------------------------------------------------------------------
[INFO]
[INFO] --- maven-clean-plugin:2.4.1:clean (default-clean) @ airavata-commons ---
[INFO] [INFO] Installing <https://builds.apache.org/job/Airavata/ws/modules/commons/pom.xml> to /home/jenkins/.m2/repository/airavata/airavata-commons/0.0.1-SNAPSHOT/airavata-commons-0.0.1-SNAPSHOT.pom
[INFO] --- maven-install-plugin:2.3.1:install (default-install) @ airavata-commons ---
[JENKINS] Archiving <https://builds.apache.org/job/Airavata/ws/modules/commons/pom.xml> to /home/hudson/hudson/jobs/Airavata/modules/airavata$airavata-commons/builds/2011-10-20_21-12-18/archive/airavata/airavata-commons/0.0.1-SNAPSHOT/airavata-commons-0.0.1-SNAPSHOT.pom
[INFO]
[INFO] ------------------------------------------------------------------------
[INFO] Building Airavata GFac Schema Utilities 0.0.1-SNAPSHOT
[INFO] ------------------------------------------------------------------------
[INFO]
[INFO] --- maven-clean-plugin:2.4.1:clean (default-clean) @ airavata-gfac-schema-utils ---
[INFO]
[INFO] --- build-helper-maven-plugin:1.7:add-source (add-source) @ airavata-gfac-schema-utils ---
[INFO] Source directory: <https://builds.apache.org/job/Airavata/ws/modules/commons/gfac-schema/target/generated-sources/xmlbeans> added.
[INFO]
[INFO] --- xmlbeans-maven-plugin:2.3.3:xmlbeans (default) @ airavata-gfac-schema-utils ---
[INFO] [INFO] Using 'UTF-8' encoding to copy filtered resources.
[INFO] Copying 1 resource
[INFO] Copying 179 resources
[INFO] --- maven-resources-plugin:2.4.3:resources (default-resources) @ airavata-gfac-schema-utils ---
[INFO]
[INFO] --- maven-compiler-plugin:2.0.2:compile (default-compile) @ airavata-gfac-schema-utils ---
[INFO] Compiling 20 source files to <https://builds.apache.org/job/Airavata/ws/modules/commons/gfac-schema/target/classes>
[INFO] [INFO] Using 'UTF-8' encoding to copy filtered resources.
[INFO] skip non existing resourceDirectory <https://builds.apache.org/job/Airavata/ws/modules/commons/gfac-schema/src/test/resources>
[INFO] --- maven-resources-plugin:2.4.3:testResources (default-testResources) @ airavata-gfac-schema-utils ---
[INFO] No sources to compile
[INFO]
[INFO] --- maven-compiler-plugin:2.0.2:testCompile (default-testCompile) @ airavata-gfac-schema-utils ---
[INFO]
[INFO] --- maven-surefire-plugin:2.7.2:test (default-test) @ airavata-gfac-schema-utils ---
[INFO] Tests are skipped.
[INFO]
[INFO] --- maven-jar-plugin:2.3.1:jar (default-jar) @ airavata-gfac-schema-utils ---
[INFO] Building jar: <https://builds.apache.org/job/Airavata/ws/modules/commons/gfac-schema/target/airavata-gfac-schema-utils-0.0.1-SNAPSHOT.jar>
[INFO] [INFO] Installing <https://builds.apache.org/job/Airavata/ws/modules/commons/gfac-schema/target/airavata-gfac-schema-utils-0.0.1-SNAPSHOT.jar> to /home/jenkins/.m2/repository/airavata/airavata-gfac-schema-utils/0.0.1-SNAPSHOT/airavata-gfac-schema-utils-0.0.1-SNAPSHOT.jar
[INFO] --- maven-install-plugin:2.3.1:install (default-install) @ airavata-gfac-schema-utils ---
[INFO] Installing <https://builds.apache.org/job/Airavata/ws/modules/commons/gfac-schema/pom.xml> to /home/jenkins/.m2/repository/airavata/airavata-gfac-schema-utils/0.0.1-SNAPSHOT/airavata-gfac-schema-utils-0.0.1-SNAPSHOT.pom
[JENKINS] Archiving <https://builds.apache.org/job/Airavata/ws/modules/commons/gfac-schema/pom.xml> to /home/hudson/hudson/jobs/Airavata/modules/airavata$airavata-gfac-schema-utils/builds/2011-10-20_21-12-18/archive/airavata/airavata-gfac-schema-utils/0.0.1-SNAPSHOT/airavata-gfac-schema-utils-0.0.1-SNAPSHOT.pom
[JENKINS] Archiving <https://builds.apache.org/job/Airavata/ws/modules/commons/gfac-schema/target/airavata-gfac-schema-utils-0.0.1-SNAPSHOT.jar> to /home/hudson/hudson/jobs/Airavata/modules/airavata$airavata-gfac-schema-utils/builds/2011-10-20_21-12-18/archive/airavata/airavata-gfac-schema-utils/0.0.1-SNAPSHOT/airavata-gfac-schema-utils-0.0.1-SNAPSHOT.jar
[INFO]
[INFO] ------------------------------------------------------------------------
[INFO] Building Airavata Registry API 0.0.1-SNAPSHOT
[INFO] ------------------------------------------------------------------------
[INFO]
[INFO] --- maven-clean-plugin:2.4.1:clean (default-clean) @ airavata-registry-api ---
[INFO] Using 'UTF-8' encoding to copy filtered resources.
[INFO] skip non existing resourceDirectory <https://builds.apache.org/job/Airavata/ws/modules/commons/registry-api/src/main/resources>
[INFO]
[INFO] --- maven-resources-plugin:2.4.3:resources (default-resources) @ airavata-registry-api ---
[INFO] [INFO] Compiling 14 source files to <https://builds.apache.org/job/Airavata/ws/modules/commons/registry-api/target/classes>
[INFO] --- maven-compiler-plugin:2.0.2:compile (default-compile) @ airavata-registry-api ---
[JENKINS] Archiving <https://builds.apache.org/job/Airavata/ws/modules/commons/registry-api/pom.xml> to /home/hudson/hudson/jobs/Airavata/modules/airavata$airavata-registry-api/builds/2011-10-20_21-12-18/archive/airavata/airavata-registry-api/0.0.1-SNAPSHOT/airavata-registry-api-0.0.1-SNAPSHOT.pom
[INFO] ------------------------------------------------------------------------
[INFO] Reactor Summary:
[INFO]
[INFO] Airavata .......................................... SUCCESS [3:11.582s]
[INFO] Airavata Commons .................................. SUCCESS [0.515s]
[INFO] Airavata GFac Schema Utilities .................... SUCCESS [16.288s]
[INFO] Airavata Registry API ............................. FAILURE [7.320s]
[INFO] Airavata-WS-Messenger ............................. SKIPPED
[INFO] Messenger Commons ................................. SKIPPED
[INFO] Messenger Client .................................. SKIPPED
[INFO] Airavata Workflow Tracking ........................ SKIPPED
[INFO] GFac-Core ......................................... SKIPPED
[INFO] GFac-Axis2-Interface .............................. SKIPPED
[INFO] MessageBox ........................................ SKIPPED
[INFO] Message Broker .................................... SKIPPED
[INFO] distribution ...................................... SKIPPED
[INFO] Airavata Common Utilities ......................... SKIPPED
[INFO] Airavata Workflow Execution Context ............... SKIPPED
[INFO] Airavata XBaya .................................... SKIPPED
[INFO] Simple Math Service ............................... SKIPPED
[INFO] distribution ...................................... SKIPPED
[INFO] ------------------------------------------------------------------------
[INFO] BUILD FAILURE
[INFO] ------------------------------------------------------------------------
[INFO] Total time: 3:53.938s
[INFO] Finished at: Thu Oct 20 21:21:12 UTC 2011
[INFO] Final Memory: 23M/67M
[INFO] ------------------------------------------------------------------------
Waiting for Jenkins to finish collecting data
mavenExecutionResult exceptions not empty
message : Failed to execute goal org.apache.maven.plugins:maven-compiler-plugin:2.0.2:compile (default-compile) on project airavata-registry-api: Compilation failure
cause : Compilation failure
Stack trace :
org.apache.maven.lifecycle.LifecycleExecutionException: Failed to execute goal org.apache.maven.plugins:maven-compiler-plugin:2.0.2:compile (default-compile) on project airavata-registry-api: Compilation failure
at org.apache.maven.lifecycle.internal.MojoExecutor.execute(MojoExecutor.java:213)
at org.apache.maven.lifecycle.internal.MojoExecutor.execute(MojoExecutor.java:153)
at org.apache.maven.lifecycle.internal.MojoExecutor.execute(MojoExecutor.java:145)
at org.apache.maven.lifecycle.internal.LifecycleModuleBuilder.buildProject(LifecycleModuleBuilder.java:84)
at org.apache.maven.lifecycle.internal.LifecycleModuleBuilder.buildProject(LifecycleModuleBuilder.java:59)
at org.apache.maven.lifecycle.internal.LifecycleStarter.singleThreadedBuild(LifecycleStarter.java:183)
at org.apache.maven.lifecycle.internal.LifecycleStarter.execute(LifecycleStarter.java:161)
at org.apache.maven.DefaultMaven.doExecute(DefaultMaven.java:319)
at org.apache.maven.DefaultMaven.execute(DefaultMaven.java:156)
at org.jvnet.hudson.maven3.launcher.Maven3Launcher.main(Maven3Launcher.java:79)
at sun.reflect.NativeMethodAccessorImpl.invoke0(Native Method)
at sun.reflect.NativeMethodAccessorImpl.invoke(NativeMethodAccessorImpl.java:39)
at sun.reflect.DelegatingMethodAccessorImpl.invoke(DelegatingMethodAccessorImpl.java:25)
at java.lang.reflect.Method.invoke(Method.java:597)
at org.codehaus.plexus.classworlds.launcher.Launcher.launchStandard(Launcher.java:329)
at org.codehaus.plexus.classworlds.launcher.Launcher.launch(Launcher.java:239)
at org.jvnet.hudson.maven3.agent.Maven3Main.launch(Maven3Main.java:158)
at hudson.maven.Maven3Builder.call(Maven3Builder.java:122)
at hudson.maven.Maven3Builder.call(Maven3Builder.java:74)
at hudson.remoting.UserRequest.perform(UserRequest.java:118)
at hudson.remoting.UserRequest.perform(UserRequest.java:48)
at hudson.remoting.Request$2.run(Request.java:287)
at java.util.concurrent.Executors$RunnableAdapter.call(Executors.java:441)
at java.util.concurrent.FutureTask$Sync.innerRun(FutureTask.java:303)
at java.util.concurrent.FutureTask.run(FutureTask.java:138)
at java.util.concurrent.ThreadPoolExecutor$Worker.runTask(ThreadPoolExecutor.java:886)
at java.util.concurrent.ThreadPoolExecutor$Worker.run(ThreadPoolExecutor.java:908)
at java.lang.Thread.run(Thread.java:662)
Caused by: org.apache.maven.plugin.CompilationFailureException: Compilation failure
at org.apache.maven.plugin.AbstractCompilerMojo.execute(AbstractCompilerMojo.java:516)
at org.apache.maven.plugin.CompilerMojo.execute(CompilerMojo.java:114)
at org.apache.maven.plugin.DefaultBuildPluginManager.executeMojo(DefaultBuildPluginManager.java:101)
at org.apache.maven.lifecycle.internal.MojoExecutor.execute(MojoExecutor.java:209)
... 27 more
Sending e-mails to: airavata-dev@incubator.apache.org glahiru@gmail.com
Sending e-mails to: airavata-dev@incubator.apache.org
channel stopped
Build failed in Jenkins: Airavata #126
Posted by Apache Jenkins Server <je...@builds.apache.org>.
See <https://builds.apache.org/job/Airavata/126/changes>
Changes:
[lahiru] removing schemas.
[lahiru] remvoing resources.
[lahiru] adding new code.
[lahiru] removing everyghing.
[lahiru] adding new wrapper for workflow-execution.
------------------------------------------
[...truncated 1431 lines...]
A modules/commons/gfac-schema/src/main/java
A modules/commons/gfac-schema/src/main/java/org
A modules/commons/gfac-schema/src/main/java/org/apache
A modules/commons/gfac-schema/src/main/java/org/apache/airavata
A modules/commons/gfac-schema/src/main/java/org/apache/airavata/commons
A modules/commons/gfac-schema/src/main/java/org/apache/airavata/commons/gfac
A modules/commons/gfac-schema/src/main/java/org/apache/airavata/commons/gfac/type
A modules/commons/gfac-schema/src/main/java/org/apache/airavata/commons/gfac/type/Parameter.java
A modules/commons/gfac-schema/src/main/java/org/apache/airavata/commons/gfac/type/app
A modules/commons/gfac-schema/src/main/java/org/apache/airavata/commons/gfac/type/app/GramApplicationDeployment.java
A modules/commons/gfac-schema/src/main/java/org/apache/airavata/commons/gfac/type/app/ShellApplicationDeployment.java
A modules/commons/gfac-schema/src/main/java/org/apache/airavata/commons/gfac/type/parameter
A modules/commons/gfac-schema/src/main/java/org/apache/airavata/commons/gfac/type/parameter/BooleanParameter.java
A modules/commons/gfac-schema/src/main/java/org/apache/airavata/commons/gfac/type/parameter/FileParameter.java
A modules/commons/gfac-schema/src/main/java/org/apache/airavata/commons/gfac/type/parameter/AbstractParameter.java
A modules/commons/gfac-schema/src/main/java/org/apache/airavata/commons/gfac/type/parameter/FloatParameter.java
A modules/commons/gfac-schema/src/main/java/org/apache/airavata/commons/gfac/type/parameter/StringParameter.java
A modules/commons/gfac-schema/src/main/java/org/apache/airavata/commons/gfac/type/parameter/ParameterFactory.java
A modules/commons/gfac-schema/src/main/java/org/apache/airavata/commons/gfac/type/parameter/DoubleParameter.java
A modules/commons/gfac-schema/src/main/java/org/apache/airavata/commons/gfac/type/parameter/IntegerParameter.java
A modules/commons/gfac-schema/src/main/java/org/apache/airavata/commons/gfac/type/HostDescription.java
A modules/commons/gfac-schema/src/main/java/org/apache/airavata/commons/gfac/type/Type.java
A modules/commons/gfac-schema/src/main/java/org/apache/airavata/commons/gfac/type/ServiceDescription.java
A modules/commons/gfac-schema/src/main/java/org/apache/airavata/commons/gfac/type/ApplicationDeploymentDescription.java
A modules/commons/gfac-schema/src/main/java/org/apache/airavata/commons/gfac/type/DataType.java
A modules/commons/gfac-schema/src/main/java/org/apache/airavata/commons/gfac/type/host
A modules/commons/gfac-schema/src/main/java/org/apache/airavata/commons/gfac/type/host/GlobusHost.java
A modules/commons/gfac-schema/src/main/java/org/apache/airavata/commons/gfac/util
A modules/commons/gfac-schema/src/main/java/org/apache/airavata/commons/gfac/util/GFacSchemaException.java
A modules/commons/gfac-schema/src/main/java/org/apache/airavata/commons/gfac/util/GFacConstants.java
A modules/commons/gfac-schema/src/main/java/org/apache/airavata/commons/gfac/util/SchemaUtil.java
A modules/commons/gfac-schema/src/main/resources
A modules/commons/gfac-schema/src/main/resources/datatype.properties
A modules/commons/gfac-schema/pom.xml
A modules/workflow-interpreter
A modules/workflow-interpreter/src
A modules/workflow-interpreter/src/main
A modules/workflow-interpreter/src/main/resources
A modules/workflow-interpreter/src/main/resources/WorkflowInterpretor.wsdl
A modules/workflow-interpreter/src/main/resources/services.xml
A modules/workflow-interpreter/pom.xml
A modules/workflow-interpreter/client
A pom.xml
At revision 1187029
Parsing POMs
Modules changed, recalculating dependency graph
[Airavata] $ /home/hudson/tools/java/latest1.6/bin/java -cp /home/jenkins/jenkins-slave/maven3-agent.jar:/home/hudson/tools/maven/latest3/boot/plexus-classworlds-2.4.jar org.jvnet.hudson.maven3.agent.Maven3Main /home/hudson/tools/maven/latest3 /x1/jenkins/jenkins-slave/slave.jar /home/jenkins/jenkins-slave/maven3-interceptor.jar 45048
<===[JENKINS REMOTING CAPACITY]===> channel started
Executing Maven: -B -f <https://builds.apache.org/job/Airavata/ws/pom.xml> clean install
[INFO] Scanning for projects...
[WARNING]
[WARNING] Some problems were encountered while building the effective model for airavata:airavata-gfac-core:jar:0.0.1-SNAPSHOT
[WARNING] 'build.plugins.plugin.version' for org.apache.maven.plugins:maven-surefire-plugin is missing. @ line 140, column 21
[WARNING]
[WARNING] Some problems were encountered while building the effective model for airavata:airavata-messenger-commons:jar:0.0.1-SNAPSHOT
[WARNING] 'build.plugins.plugin.version' for org.apache.maven.plugins:maven-surefire-plugin is missing. @ airavata:airavata-ws-messenger:0.0.1-SNAPSHOT, <https://builds.apache.org/job/Airavata/ws/modules/ws-messenger/pom.xml,> line 116, column 21
[WARNING]
[WARNING] Some problems were encountered while building the effective model for airavata:airavata-messenger-client:jar:0.0.1-SNAPSHOT
[WARNING] 'build.plugins.plugin.version' for org.apache.maven.plugins:maven-surefire-plugin is missing. @ airavata:airavata-ws-messenger:0.0.1-SNAPSHOT, <https://builds.apache.org/job/Airavata/ws/modules/ws-messenger/pom.xml,> line 116, column 21
[WARNING]
[WARNING] Some problems were encountered while building the effective model for airavata:airavata-messagebox:jar:0.0.1-SNAPSHOT
[WARNING] 'build.plugins.plugin.version' for org.apache.maven.plugins:maven-surefire-plugin is missing. @ airavata:airavata-ws-messenger:0.0.1-SNAPSHOT, <https://builds.apache.org/job/Airavata/ws/modules/ws-messenger/pom.xml,> line 116, column 21
[WARNING]
[WARNING] Some problems were encountered while building the effective model for airavata:airavata-messagebroker:jar:0.0.1-SNAPSHOT
[WARNING] 'build.plugins.plugin.version' for org.apache.maven.plugins:maven-surefire-plugin is missing. @ airavata:airavata-ws-messenger:0.0.1-SNAPSHOT, <https://builds.apache.org/job/Airavata/ws/modules/ws-messenger/pom.xml,> line 116, column 21
[WARNING] 'build.plugins.plugin.version' for org.apache.maven.plugins:maven-jar-plugin is missing. @ line 17, column 21
[WARNING]
[WARNING] Some problems were encountered while building the effective model for Airavata:ws-messenger-distribution:jar:0.0.1-SNAPSHOT
[WARNING] 'build.plugins.plugin.version' for org.apache.maven.plugins:maven-surefire-plugin is missing. @ airavata:airavata-ws-messenger:0.0.1-SNAPSHOT, <https://builds.apache.org/job/Airavata/ws/modules/ws-messenger/pom.xml,> line 116, column 21
[WARNING] The expression ${version} is deprecated. Please use ${project.version} instead.
[WARNING]
[WARNING] Some problems were encountered while building the effective model for airavata:airavata-ws-messenger:pom:0.0.1-SNAPSHOT
[WARNING] 'build.plugins.plugin.version' for org.apache.maven.plugins:maven-surefire-plugin is missing. @ line 116, column 21
[WARNING]
[WARNING] Some problems were encountered while building the effective model for airavata:airavata-xbaya-gui:jar:0.0.1-SNAPSHOT
[WARNING] 'dependencies.dependency.(groupId:artifactId:type:classifier)' must be unique: airavata:airavata-common-utils:jar -> duplicate declaration of version ${airavata.version} @ line 380, column 21
[WARNING] 'dependencies.dependency.(groupId:artifactId:type:classifier)' must be unique: log4j:log4j:jar -> duplicate declaration of version (?) @ line 409, column 21
[INFO] [WARNING] 'build.plugins.plugin.version' for org.codehaus.mojo.webstart:webstart-maven-plugin is missing. @ line 119, column 21
[WARNING] 'build.plugins.plugin.version' for org.apache.maven.plugins:maven-compiler-plugin is missing. @ line 80, column 21
------------------------------------------------------------------------[WARNING] 'build.plugins.plugin.version' for org.apache.maven.plugins:maven-jar-plugin is missing. @ line 88, column 21
[INFO] Reactor Build Order:[WARNING]
[INFO] [WARNING] Some problems were encountered while building the effective model for airavata:airavata-workflowtracking:jar:0.0.1-SNAPSHOT
[WARNING] 'build.plugins.plugin.version' for org.apache.maven.plugins:maven-surefire-plugin is missing. @ line 84, column 21
[INFO] [WARNING] The expression ${pom.version} is deprecated. Please use ${project.version} instead.
Airavata[WARNING]
[WARNING] Some problems were encountered while building the effective model for airavata:airavata-gfac-schema-utils:jar:0.0.1-SNAPSHOT
[INFO] Airavata Commons[WARNING] 'build.plugins.plugin.version' for org.apache.maven.plugins:maven-surefire-plugin is missing. @ airavata:airavata-commons:0.0.1-SNAPSHOT, <https://builds.apache.org/job/Airavata/ws/modules/commons/pom.xml,> line 31, column 21
[WARNING] 'build.plugins.plugin.version' for org.codehaus.mojo:build-helper-maven-plugin is missing. @ line 98, column 21
[INFO] [WARNING] The expression ${artifactId} is deprecated. Please use ${project.artifactId} instead.
Airavata GFac Schema Utilities[WARNING] The expression ${version} is deprecated. Please use ${project.version} instead.
[WARNING]
[INFO] [WARNING] Some problems were encountered while building the effective model for airavata:airavata-common-utils:jar:0.0.1-SNAPSHOT
Airavata Registry API[WARNING] 'build.plugins.plugin.version' for org.apache.maven.plugins:maven-surefire-plugin is missing. @ airavata:airavata-commons:0.0.1-SNAPSHOT, <https://builds.apache.org/job/Airavata/ws/modules/commons/pom.xml,> line 31, column 21
[WARNING]
[INFO] [WARNING] Some problems were encountered while building the effective model for airavata:airavata-registry-api:jar:0.0.1-SNAPSHOT
Airavata-WS-Messenger[WARNING] 'build.plugins.plugin.version' for org.apache.maven.plugins:maven-surefire-plugin is missing. @ airavata:airavata-commons:0.0.1-SNAPSHOT, <https://builds.apache.org/job/Airavata/ws/modules/commons/pom.xml,> line 31, column 21
[WARNING]
[WARNING] Some problems were encountered while building the effective model for airavata:airavata-workflow-execution-context:jar:0.0.1-SNAPSHOT
[WARNING] 'build.plugins.plugin.version' for org.apache.maven.plugins:maven-surefire-plugin is missing. @ airavata:airavata-commons:0.0.1-SNAPSHOT, <https://builds.apache.org/job/Airavata/ws/modules/commons/pom.xml,> line 31, column 21
[INFO] [WARNING] 'build.plugins.plugin.version' for org.codehaus.mojo:build-helper-maven-plugin is missing. @ line 83, column 12
Messenger Commons[WARNING] The expression ${artifactId} is deprecated. Please use ${project.artifactId} instead.
[WARNING] The expression ${version} is deprecated. Please use ${project.version} instead.
[INFO] [WARNING]
Messenger Client[WARNING] Some problems were encountered while building the effective model for airavata:airavata-commons:pom:0.0.1-SNAPSHOT
[WARNING] 'build.plugins.plugin.version' for org.apache.maven.plugins:maven-surefire-plugin is missing. @ line 31, column 21
[INFO] [WARNING]
Airavata Workflow Tracking[WARNING] Some problems were encountered while building the effective model for airavata:simple-math-service:jar:0.0.1-SNAPSHOT
[WARNING] 'build.plugins.plugin.version' for org.apache.maven.plugins:maven-compiler-plugin is missing. @ line 38, column 12
[WARNING]
[INFO] [WARNING] Some problems were encountered while building the effective model for Airavata:distribution:jar:0.0.1-SNAPSHOT
GFac-Core
[WARNING] 'dependencies.dependency.(groupId:artifactId:type:classifier)' must be unique: lead-security:cryptix32:jar -> duplicate declaration of version versionless @ line 207, column 21
[INFO] [WARNING] 'dependencies.dependency.(groupId:artifactId:type:classifier)' must be unique: xsul:xsul:jar -> version (?) vs 2.10.5_d @ line 246, column 21
GFac-Axis2-Interface[WARNING] The expression ${version} is deprecated. Please use ${project.version} instead.
[WARNING]
[INFO] [WARNING] It is highly recommended to fix these problems because they threaten the stability of your build.
MessageBox[WARNING]
[WARNING] For this reason, future Maven versions might no longer support building such malformed projects.
[INFO] [WARNING]
Message Broker
[INFO] distribution
[INFO] Airavata Common Utilities
[INFO] Airavata Workflow Execution Context
[INFO] Airavata XBaya
[INFO] Simple Math Service
[INFO] distribution
[INFO]
[INFO] ------------------------------------------------------------------------
[INFO] Building Airavata 0.0.1-SNAPSHOT
[INFO] ------------------------------------------------------------------------
[INFO]
[INFO] --- maven-clean-plugin:2.4.1:clean (default-clean) @ airavata ---
[INFO]
[INFO] --- maven-install-plugin:2.3.1:install (default-install) @ airavata ---
[INFO] Installing <https://builds.apache.org/job/Airavata/ws/pom.xml> to /home/jenkins/.m2/repository/airavata/airavata/0.0.1-SNAPSHOT/airavata-0.0.1-SNAPSHOT.pom
[JENKINS] Archiving <https://builds.apache.org/job/Airavata/ws/pom.xml> to /home/hudson/hudson/jobs/Airavata/modules/airavata$airavata/builds/2011-10-20_20-01-08/archive/airavata/airavata/0.0.1-SNAPSHOT/airavata-0.0.1-SNAPSHOT.pom
[INFO]
[INFO] ------------------------------------------------------------------------
[INFO] Building Airavata Commons 0.0.1-SNAPSHOT
[INFO] ------------------------------------------------------------------------
[INFO]
[INFO] --- maven-clean-plugin:2.4.1:clean (default-clean) @ airavata-commons ---
[INFO] [INFO] Installing <https://builds.apache.org/job/Airavata/ws/modules/commons/pom.xml> to /home/jenkins/.m2/repository/airavata/airavata-commons/0.0.1-SNAPSHOT/airavata-commons-0.0.1-SNAPSHOT.pom
[INFO] --- maven-install-plugin:2.3.1:install (default-install) @ airavata-commons ---
[JENKINS] Archiving <https://builds.apache.org/job/Airavata/ws/modules/commons/pom.xml> to /home/hudson/hudson/jobs/Airavata/modules/airavata$airavata-commons/builds/2011-10-20_20-01-08/archive/airavata/airavata-commons/0.0.1-SNAPSHOT/airavata-commons-0.0.1-SNAPSHOT.pom
[INFO]
[INFO] ------------------------------------------------------------------------
[INFO] Building Airavata GFac Schema Utilities 0.0.1-SNAPSHOT
[INFO] ------------------------------------------------------------------------
[INFO]
[INFO] --- maven-clean-plugin:2.4.1:clean (default-clean) @ airavata-gfac-schema-utils ---
[INFO]
[INFO] --- build-helper-maven-plugin:1.7:add-source (add-source) @ airavata-gfac-schema-utils ---
[INFO] Source directory: <https://builds.apache.org/job/Airavata/ws/modules/commons/gfac-schema/target/generated-sources/xmlbeans> added.
[INFO]
[INFO] --- xmlbeans-maven-plugin:2.3.3:xmlbeans (default) @ airavata-gfac-schema-utils ---
[INFO]
[INFO] --- maven-resources-plugin:2.4.3:resources (default-resources) @ airavata-gfac-schema-utils ---
[INFO] Using 'UTF-8' encoding to copy filtered resources.
[INFO] Copying 1 resource
[INFO] Copying 179 resources
[INFO]
[INFO] --- maven-compiler-plugin:2.0.2:compile (default-compile) @ airavata-gfac-schema-utils ---
[INFO] Compiling 20 source files to <https://builds.apache.org/job/Airavata/ws/modules/commons/gfac-schema/target/classes>
[JENKINS] Archiving <https://builds.apache.org/job/Airavata/ws/modules/commons/gfac-schema/pom.xml> to /home/hudson/hudson/jobs/Airavata/modules/airavata$airavata-gfac-schema-utils/builds/2011-10-20_20-01-08/archive/airavata/airavata-gfac-schema-utils/0.0.1-SNAPSHOT/airavata-gfac-schema-utils-0.0.1-SNAPSHOT.pom
[INFO] ------------------------------------------------------------------------
[INFO] Reactor Summary:
[INFO]
[INFO] Airavata .......................................... SUCCESS [2.211s]
[INFO] Airavata Commons .................................. SUCCESS [0.195s]
[INFO] Airavata GFac Schema Utilities .................... FAILURE [4.934s]
[INFO] Airavata Registry API ............................. SKIPPED
[INFO] Airavata-WS-Messenger ............................. SKIPPED
[INFO] Messenger Commons ................................. SKIPPED
[INFO] Messenger Client .................................. SKIPPED
[INFO] Airavata Workflow Tracking ........................ SKIPPED
[INFO] GFac-Core ......................................... SKIPPED
[INFO] GFac-Axis2-Interface .............................. SKIPPED
[INFO] MessageBox ........................................ SKIPPED
[INFO] Message Broker .................................... SKIPPED
[INFO] distribution ...................................... SKIPPED
[INFO] Airavata Common Utilities ......................... SKIPPED
[INFO] Airavata Workflow Execution Context ............... SKIPPED
[INFO] Airavata XBaya .................................... SKIPPED
[INFO] Simple Math Service ............................... SKIPPED
[INFO] distribution ...................................... SKIPPED
[INFO] ------------------------------------------------------------------------
[INFO] BUILD FAILURE
[INFO] ------------------------------------------------------------------------
[INFO] Total time: 13.884s
[INFO] Finished at: Thu Oct 20 20:01:31 UTC 2011
[INFO] Final Memory: 16M/69M
[INFO] ------------------------------------------------------------------------
Waiting for Jenkins to finish collecting data
mavenExecutionResult exceptions not empty
message : Failed to execute goal org.apache.maven.plugins:maven-compiler-plugin:2.0.2:compile (default-compile) on project airavata-gfac-schema-utils: Compilation failure
cause : Compilation failure
Stack trace :
org.apache.maven.lifecycle.LifecycleExecutionException: Failed to execute goal org.apache.maven.plugins:maven-compiler-plugin:2.0.2:compile (default-compile) on project airavata-gfac-schema-utils: Compilation failure
at org.apache.maven.lifecycle.internal.MojoExecutor.execute(MojoExecutor.java:213)
at org.apache.maven.lifecycle.internal.MojoExecutor.execute(MojoExecutor.java:153)
at org.apache.maven.lifecycle.internal.MojoExecutor.execute(MojoExecutor.java:145)
at org.apache.maven.lifecycle.internal.LifecycleModuleBuilder.buildProject(LifecycleModuleBuilder.java:84)
at org.apache.maven.lifecycle.internal.LifecycleModuleBuilder.buildProject(LifecycleModuleBuilder.java:59)
at org.apache.maven.lifecycle.internal.LifecycleStarter.singleThreadedBuild(LifecycleStarter.java:183)
at org.apache.maven.lifecycle.internal.LifecycleStarter.execute(LifecycleStarter.java:161)
at org.apache.maven.DefaultMaven.doExecute(DefaultMaven.java:319)
at org.apache.maven.DefaultMaven.execute(DefaultMaven.java:156)
at org.jvnet.hudson.maven3.launcher.Maven3Launcher.main(Maven3Launcher.java:79)
at sun.reflect.NativeMethodAccessorImpl.invoke0(Native Method)
at sun.reflect.NativeMethodAccessorImpl.invoke(NativeMethodAccessorImpl.java:39)
at sun.reflect.DelegatingMethodAccessorImpl.invoke(DelegatingMethodAccessorImpl.java:25)
at java.lang.reflect.Method.invoke(Method.java:597)
at org.codehaus.plexus.classworlds.launcher.Launcher.launchStandard(Launcher.java:329)
at org.codehaus.plexus.classworlds.launcher.Launcher.launch(Launcher.java:239)
at org.jvnet.hudson.maven3.agent.Maven3Main.launch(Maven3Main.java:158)
at hudson.maven.Maven3Builder.call(Maven3Builder.java:122)
at hudson.maven.Maven3Builder.call(Maven3Builder.java:74)
at hudson.remoting.UserRequest.perform(UserRequest.java:118)
at hudson.remoting.UserRequest.perform(UserRequest.java:48)
at hudson.remoting.Request$2.run(Request.java:287)
at java.util.concurrent.Executors$RunnableAdapter.call(Executors.java:441)
at java.util.concurrent.FutureTask$Sync.innerRun(FutureTask.java:303)
at java.util.concurrent.FutureTask.run(FutureTask.java:138)
at java.util.concurrent.ThreadPoolExecutor$Worker.runTask(ThreadPoolExecutor.java:886)
at java.util.concurrent.ThreadPoolExecutor$Worker.run(ThreadPoolExecutor.java:908)
at java.lang.Thread.run(Thread.java:662)
Caused by: org.apache.maven.plugin.CompilationFailureException: Compilation failure
at org.apache.maven.plugin.AbstractCompilerMojo.execute(AbstractCompilerMojo.java:516)
at org.apache.maven.plugin.CompilerMojo.execute(CompilerMojo.java:114)
at org.apache.maven.plugin.DefaultBuildPluginManager.executeMojo(DefaultBuildPluginManager.java:107)
at org.apache.maven.lifecycle.internal.MojoExecutor.execute(MojoExecutor.java:209)
... 27 more
Sending e-mails to: airavata-dev@incubator.apache.org
channel stopped
Build failed in Jenkins: Airavata #125
Posted by Apache Jenkins Server <je...@builds.apache.org>.
See <https://builds.apache.org/job/Airavata/125/changes>
Changes:
[smarru] Improved context header schema to have flexible workflows to address AIRAVATA-152
------------------------------------------
[...truncated 1420 lines...]
A modules/commons/gfac-schema/src/main/java
A modules/commons/gfac-schema/src/main/java/org
A modules/commons/gfac-schema/src/main/java/org/apache
A modules/commons/gfac-schema/src/main/java/org/apache/airavata
A modules/commons/gfac-schema/src/main/java/org/apache/airavata/commons
A modules/commons/gfac-schema/src/main/java/org/apache/airavata/commons/gfac
A modules/commons/gfac-schema/src/main/java/org/apache/airavata/commons/gfac/type
A modules/commons/gfac-schema/src/main/java/org/apache/airavata/commons/gfac/type/Parameter.java
A modules/commons/gfac-schema/src/main/java/org/apache/airavata/commons/gfac/type/app
A modules/commons/gfac-schema/src/main/java/org/apache/airavata/commons/gfac/type/app/GramApplicationDeployment.java
A modules/commons/gfac-schema/src/main/java/org/apache/airavata/commons/gfac/type/app/ShellApplicationDeployment.java
A modules/commons/gfac-schema/src/main/java/org/apache/airavata/commons/gfac/type/parameter
A modules/commons/gfac-schema/src/main/java/org/apache/airavata/commons/gfac/type/parameter/BooleanParameter.java
A modules/commons/gfac-schema/src/main/java/org/apache/airavata/commons/gfac/type/parameter/FileParameter.java
A modules/commons/gfac-schema/src/main/java/org/apache/airavata/commons/gfac/type/parameter/AbstractParameter.java
A modules/commons/gfac-schema/src/main/java/org/apache/airavata/commons/gfac/type/parameter/FloatParameter.java
A modules/commons/gfac-schema/src/main/java/org/apache/airavata/commons/gfac/type/parameter/StringParameter.java
A modules/commons/gfac-schema/src/main/java/org/apache/airavata/commons/gfac/type/parameter/ParameterFactory.java
A modules/commons/gfac-schema/src/main/java/org/apache/airavata/commons/gfac/type/parameter/DoubleParameter.java
A modules/commons/gfac-schema/src/main/java/org/apache/airavata/commons/gfac/type/parameter/IntegerParameter.java
A modules/commons/gfac-schema/src/main/java/org/apache/airavata/commons/gfac/type/HostDescription.java
A modules/commons/gfac-schema/src/main/java/org/apache/airavata/commons/gfac/type/Type.java
A modules/commons/gfac-schema/src/main/java/org/apache/airavata/commons/gfac/type/ServiceDescription.java
A modules/commons/gfac-schema/src/main/java/org/apache/airavata/commons/gfac/type/ApplicationDeploymentDescription.java
A modules/commons/gfac-schema/src/main/java/org/apache/airavata/commons/gfac/type/DataType.java
A modules/commons/gfac-schema/src/main/java/org/apache/airavata/commons/gfac/type/host
A modules/commons/gfac-schema/src/main/java/org/apache/airavata/commons/gfac/type/host/GlobusHost.java
A modules/commons/gfac-schema/src/main/java/org/apache/airavata/commons/gfac/util
A modules/commons/gfac-schema/src/main/java/org/apache/airavata/commons/gfac/util/GFacSchemaException.java
A modules/commons/gfac-schema/src/main/java/org/apache/airavata/commons/gfac/util/GFacConstants.java
A modules/commons/gfac-schema/src/main/java/org/apache/airavata/commons/gfac/util/SchemaUtil.java
A modules/commons/gfac-schema/src/main/resources
A modules/commons/gfac-schema/src/main/resources/datatype.properties
A modules/commons/gfac-schema/pom.xml
A modules/workflow-interpreter
A modules/workflow-interpreter/src
A modules/workflow-interpreter/src/main
A modules/workflow-interpreter/src/main/resources
A modules/workflow-interpreter/src/main/resources/WorkflowInterpretor.wsdl
A modules/workflow-interpreter/src/main/resources/services.xml
A modules/workflow-interpreter/pom.xml
A modules/workflow-interpreter/client
A pom.xml
At revision 1186778
Parsing POMs
Modules changed, recalculating dependency graph
[Airavata] $ /home/hudson/tools/java/latest1.6/bin/java -cp /home/jenkins/jenkins-slave/maven3-agent.jar:/home/hudson/tools/maven/latest3/boot/plexus-classworlds-2.4.jar org.jvnet.hudson.maven3.agent.Maven3Main /home/hudson/tools/maven/latest3 /x1/jenkins/jenkins-slave/slave.jar /home/jenkins/jenkins-slave/maven3-interceptor.jar 52126
<===[JENKINS REMOTING CAPACITY]===> channel started
Executing Maven: -B -f <https://builds.apache.org/job/Airavata/ws/pom.xml> clean install
[INFO] Scanning for projects...
[WARNING]
[WARNING] Some problems were encountered while building the effective model for airavata:airavata-gfac-core:jar:0.0.1-SNAPSHOT
[WARNING] 'build.plugins.plugin.version' for org.apache.maven.plugins:maven-surefire-plugin is missing. @ line 140, column 21
[WARNING]
[WARNING] Some problems were encountered while building the effective model for airavata:airavata-messenger-commons:jar:0.0.1-SNAPSHOT
[WARNING] 'build.plugins.plugin.version' for org.apache.maven.plugins:maven-surefire-plugin is missing. @ airavata:airavata-ws-messenger:0.0.1-SNAPSHOT, <https://builds.apache.org/job/Airavata/ws/modules/ws-messenger/pom.xml,> line 116, column 21
[WARNING]
[WARNING] Some problems were encountered while building the effective model for airavata:airavata-messenger-client:jar:0.0.1-SNAPSHOT
[WARNING] 'build.plugins.plugin.version' for org.apache.maven.plugins:maven-surefire-plugin is missing. @ airavata:airavata-ws-messenger:0.0.1-SNAPSHOT, <https://builds.apache.org/job/Airavata/ws/modules/ws-messenger/pom.xml,> line 116, column 21
[WARNING]
[WARNING] Some problems were encountered while building the effective model for airavata:airavata-messagebox:jar:0.0.1-SNAPSHOT
[WARNING] 'build.plugins.plugin.version' for org.apache.maven.plugins:maven-surefire-plugin is missing. @ airavata:airavata-ws-messenger:0.0.1-SNAPSHOT, <https://builds.apache.org/job/Airavata/ws/modules/ws-messenger/pom.xml,> line 116, column 21
[WARNING]
[WARNING] Some problems were encountered while building the effective model for airavata:airavata-messagebroker:jar:0.0.1-SNAPSHOT
[WARNING] 'build.plugins.plugin.version' for org.apache.maven.plugins:maven-surefire-plugin is missing. @ airavata:airavata-ws-messenger:0.0.1-SNAPSHOT, <https://builds.apache.org/job/Airavata/ws/modules/ws-messenger/pom.xml,> line 116, column 21
[WARNING] 'build.plugins.plugin.version' for org.apache.maven.plugins:maven-jar-plugin is missing. @ line 17, column 21
[WARNING]
[WARNING] Some problems were encountered while building the effective model for Airavata:ws-messenger-distribution:jar:0.0.1-SNAPSHOT
[WARNING] 'build.plugins.plugin.version' for org.apache.maven.plugins:maven-surefire-plugin is missing. @ airavata:airavata-ws-messenger:0.0.1-SNAPSHOT, <https://builds.apache.org/job/Airavata/ws/modules/ws-messenger/pom.xml,> line 116, column 21
[WARNING] The expression ${version} is deprecated. Please use ${project.version} instead.
[WARNING]
[WARNING] Some problems were encountered while building the effective model for airavata:airavata-ws-messenger:pom:0.0.1-SNAPSHOT
[WARNING] 'build.plugins.plugin.version' for org.apache.maven.plugins:maven-surefire-plugin is missing. @ line 116, column 21
[WARNING]
[INFO] [WARNING] Some problems were encountered while building the effective model for airavata:airavata-xbaya-gui:jar:0.0.1-SNAPSHOT
[WARNING] 'dependencies.dependency.(groupId:artifactId:type:classifier)' must be unique: airavata:airavata-common-utils:jar -> duplicate declaration of version ${airavata.version} @ line 380, column 21
[WARNING] 'dependencies.dependency.(groupId:artifactId:type:classifier)' must be unique: log4j:log4j:jar -> duplicate declaration of version (?) @ line 409, column 21
[WARNING] 'build.plugins.plugin.version' for org.codehaus.mojo.webstart:webstart-maven-plugin is missing. @ line 119, column 21
[WARNING] 'build.plugins.plugin.version' for org.apache.maven.plugins:maven-compiler-plugin is missing. @ line 80, column 21
[WARNING] 'build.plugins.plugin.version' for org.apache.maven.plugins:maven-jar-plugin is missing. @ line 88, column 21
[WARNING]
[WARNING] Some problems were encountered while building the effective model for airavata:airavata-workflowtracking:jar:0.0.1-SNAPSHOT
[WARNING] 'build.plugins.plugin.version' for org.apache.maven.plugins:maven-surefire-plugin is missing. @ line 84, column 21
------------------------------------------------------------------------[WARNING] The expression ${pom.version} is deprecated. Please use ${project.version} instead.
[INFO] Reactor Build Order:[WARNING]
[INFO] [WARNING] Some problems were encountered while building the effective model for airavata:airavata-gfac-schema-utils:jar:0.0.1-SNAPSHOT
[INFO] [WARNING] 'build.plugins.plugin.version' for org.apache.maven.plugins:maven-surefire-plugin is missing. @ airavata:airavata-commons:0.0.1-SNAPSHOT, <https://builds.apache.org/job/Airavata/ws/modules/commons/pom.xml,> line 31, column 21
Airavata[WARNING] 'build.plugins.plugin.version' for org.codehaus.mojo:build-helper-maven-plugin is missing. @ line 98, column 21
[WARNING] The expression ${artifactId} is deprecated. Please use ${project.artifactId} instead.
[WARNING] The expression ${version} is deprecated. Please use ${project.version} instead.
[INFO] [WARNING]
Airavata Commons[WARNING] Some problems were encountered while building the effective model for airavata:airavata-common-utils:jar:0.0.1-SNAPSHOT
[WARNING] 'build.plugins.plugin.version' for org.apache.maven.plugins:maven-surefire-plugin is missing. @ airavata:airavata-commons:0.0.1-SNAPSHOT, <https://builds.apache.org/job/Airavata/ws/modules/commons/pom.xml,> line 31, column 21
[WARNING]
[INFO] [WARNING] Some problems were encountered while building the effective model for airavata:airavata-registry-api:jar:0.0.1-SNAPSHOT
Airavata GFac Schema Utilities[WARNING] 'build.plugins.plugin.version' for org.apache.maven.plugins:maven-surefire-plugin is missing. @ airavata:airavata-commons:0.0.1-SNAPSHOT, <https://builds.apache.org/job/Airavata/ws/modules/commons/pom.xml,> line 31, column 21
[WARNING]
[INFO] [WARNING] Some problems were encountered while building the effective model for airavata:airavata-workflow-execution-context:jar:0.0.1-SNAPSHOT
Airavata Registry API[WARNING] 'build.plugins.plugin.version' for org.apache.maven.plugins:maven-surefire-plugin is missing. @ airavata:airavata-commons:0.0.1-SNAPSHOT, <https://builds.apache.org/job/Airavata/ws/modules/commons/pom.xml,> line 31, column 21
[WARNING] 'build.plugins.plugin.version' for org.codehaus.mojo:build-helper-maven-plugin is missing. @ line 52, column 12
[INFO] Airavata-WS-Messenger[WARNING] The expression ${artifactId} is deprecated. Please use ${project.artifactId} instead.
[WARNING] The expression ${version} is deprecated. Please use ${project.version} instead.
[WARNING]
[INFO] [WARNING] Some problems were encountered while building the effective model for airavata:airavata-commons:pom:0.0.1-SNAPSHOT
Messenger Commons[WARNING] 'build.plugins.plugin.version' for org.apache.maven.plugins:maven-surefire-plugin is missing. @ line 31, column 21
[WARNING]
[INFO] [WARNING] Some problems were encountered while building the effective model for airavata:simple-math-service:jar:0.0.1-SNAPSHOT
[WARNING] 'build.plugins.plugin.version' for org.apache.maven.plugins:maven-compiler-plugin is missing. @ line 38, column 12
[WARNING]
Messenger Client[WARNING] Some problems were encountered while building the effective model for Airavata:distribution:jar:0.0.1-SNAPSHOT
[WARNING] 'dependencies.dependency.(groupId:artifactId:type:classifier)' must be unique: lead-security:cryptix32:jar -> duplicate declaration of version versionless @ line 207, column 21
[INFO] [WARNING] 'dependencies.dependency.(groupId:artifactId:type:classifier)' must be unique: xsul:xsul:jar -> version (?) vs 2.10.5_d @ line 246, column 21
Airavata Workflow Tracking[WARNING] The expression ${version} is deprecated. Please use ${project.version} instead.
[WARNING]
[WARNING] It is highly recommended to fix these problems because they threaten the stability of your build.
[WARNING]
[INFO] [WARNING] For this reason, future Maven versions might no longer support building such malformed projects.
[WARNING]
GFac-Core
[INFO] GFac-Axis2-Interface
[INFO] MessageBox
[INFO] Message Broker
[INFO] distribution
[INFO] Airavata Common Utilities
[INFO] Airavata Workflow Execution Context
[INFO] Airavata XBaya
[INFO] Simple Math Service
[INFO] distribution
[INFO]
[INFO] ------------------------------------------------------------------------
[INFO] Building Airavata 0.0.1-SNAPSHOT
[INFO] ------------------------------------------------------------------------
[INFO]
[INFO] --- maven-clean-plugin:2.4.1:clean (default-clean) @ airavata ---
[INFO]
[INFO] --- maven-install-plugin:2.3.1:install (default-install) @ airavata ---
[INFO] Installing <https://builds.apache.org/job/Airavata/ws/pom.xml> to /home/jenkins/.m2/repository/airavata/airavata/0.0.1-SNAPSHOT/airavata-0.0.1-SNAPSHOT.pom
[JENKINS] Archiving <https://builds.apache.org/job/Airavata/ws/pom.xml> to /home/hudson/hudson/jobs/Airavata/modules/airavata$airavata/builds/2011-10-20_13-01-12/archive/airavata/airavata/0.0.1-SNAPSHOT/airavata-0.0.1-SNAPSHOT.pom
[INFO]
[INFO] ------------------------------------------------------------------------
[INFO] Building Airavata Commons 0.0.1-SNAPSHOT
[INFO] ------------------------------------------------------------------------
[INFO]
[INFO] --- maven-clean-plugin:2.4.1:clean (default-clean) @ airavata-commons ---
[INFO] [INFO] Installing <https://builds.apache.org/job/Airavata/ws/modules/commons/pom.xml> to /home/jenkins/.m2/repository/airavata/airavata-commons/0.0.1-SNAPSHOT/airavata-commons-0.0.1-SNAPSHOT.pom
[INFO] --- maven-install-plugin:2.3.1:install (default-install) @ airavata-commons ---
[JENKINS] Archiving <https://builds.apache.org/job/Airavata/ws/modules/commons/pom.xml> to /home/hudson/hudson/jobs/Airavata/modules/airavata$airavata-commons/builds/2011-10-20_13-01-12/archive/airavata/airavata-commons/0.0.1-SNAPSHOT/airavata-commons-0.0.1-SNAPSHOT.pom
[INFO]
[INFO] ------------------------------------------------------------------------
[INFO] Building Airavata GFac Schema Utilities 0.0.1-SNAPSHOT
[INFO] ------------------------------------------------------------------------
[INFO]
[INFO] --- maven-clean-plugin:2.4.1:clean (default-clean) @ airavata-gfac-schema-utils ---
[INFO]
[INFO] --- build-helper-maven-plugin:1.7:add-source (add-source) @ airavata-gfac-schema-utils ---
[INFO] Source directory: <https://builds.apache.org/job/Airavata/ws/modules/commons/gfac-schema/target/generated-sources/xmlbeans> added.
[INFO]
[INFO] --- xmlbeans-maven-plugin:2.3.3:xmlbeans (default) @ airavata-gfac-schema-utils ---
[INFO]
[INFO] --- maven-resources-plugin:2.4.3:resources (default-resources) @ airavata-gfac-schema-utils ---
[INFO] Using 'UTF-8' encoding to copy filtered resources.
[INFO] Copying 1 resource
[INFO] Copying 179 resources
[INFO]
[INFO] --- maven-compiler-plugin:2.0.2:compile (default-compile) @ airavata-gfac-schema-utils ---
[INFO] Compiling 20 source files to <https://builds.apache.org/job/Airavata/ws/modules/commons/gfac-schema/target/classes>
[JENKINS] Archiving <https://builds.apache.org/job/Airavata/ws/modules/commons/gfac-schema/pom.xml> to /home/hudson/hudson/jobs/Airavata/modules/airavata$airavata-gfac-schema-utils/builds/2011-10-20_13-01-12/archive/airavata/airavata-gfac-schema-utils/0.0.1-SNAPSHOT/airavata-gfac-schema-utils-0.0.1-SNAPSHOT.pom
[INFO] ------------------------------------------------------------------------
[INFO] Reactor Summary:
[INFO]
[INFO] Airavata .......................................... SUCCESS [1.804s]
[INFO] Airavata Commons .................................. SUCCESS [0.221s]
[INFO] Airavata GFac Schema Utilities .................... FAILURE [9.757s]
[INFO] Airavata Registry API ............................. SKIPPED
[INFO] Airavata-WS-Messenger ............................. SKIPPED
[INFO] Messenger Commons ................................. SKIPPED
[INFO] Messenger Client .................................. SKIPPED
[INFO] Airavata Workflow Tracking ........................ SKIPPED
[INFO] GFac-Core ......................................... SKIPPED
[INFO] GFac-Axis2-Interface .............................. SKIPPED
[INFO] MessageBox ........................................ SKIPPED
[INFO] Message Broker .................................... SKIPPED
[INFO] distribution ...................................... SKIPPED
[INFO] Airavata Common Utilities ......................... SKIPPED
[INFO] Airavata Workflow Execution Context ............... SKIPPED
[INFO] Airavata XBaya .................................... SKIPPED
[INFO] Simple Math Service ............................... SKIPPED
[INFO] distribution ...................................... SKIPPED
[INFO] ------------------------------------------------------------------------
[INFO] BUILD FAILURE
[INFO] ------------------------------------------------------------------------
[INFO] Total time: 12.932s
[INFO] Finished at: Thu Oct 20 13:01:29 UTC 2011
[INFO] Final Memory: 17M/175M
[INFO] ------------------------------------------------------------------------
Waiting for Jenkins to finish collecting data
mavenExecutionResult exceptions not empty
message : Failed to execute goal org.apache.maven.plugins:maven-compiler-plugin:2.0.2:compile (default-compile) on project airavata-gfac-schema-utils: Compilation failure
cause : Compilation failure
Stack trace :
org.apache.maven.lifecycle.LifecycleExecutionException: Failed to execute goal org.apache.maven.plugins:maven-compiler-plugin:2.0.2:compile (default-compile) on project airavata-gfac-schema-utils: Compilation failure
at org.apache.maven.lifecycle.internal.MojoExecutor.execute(MojoExecutor.java:213)
at org.apache.maven.lifecycle.internal.MojoExecutor.execute(MojoExecutor.java:153)
at org.apache.maven.lifecycle.internal.MojoExecutor.execute(MojoExecutor.java:145)
at org.apache.maven.lifecycle.internal.LifecycleModuleBuilder.buildProject(LifecycleModuleBuilder.java:84)
at org.apache.maven.lifecycle.internal.LifecycleModuleBuilder.buildProject(LifecycleModuleBuilder.java:59)
at org.apache.maven.lifecycle.internal.LifecycleStarter.singleThreadedBuild(LifecycleStarter.java:183)
at org.apache.maven.lifecycle.internal.LifecycleStarter.execute(LifecycleStarter.java:161)
at org.apache.maven.DefaultMaven.doExecute(DefaultMaven.java:319)
at org.apache.maven.DefaultMaven.execute(DefaultMaven.java:156)
at org.jvnet.hudson.maven3.launcher.Maven3Launcher.main(Maven3Launcher.java:79)
at sun.reflect.NativeMethodAccessorImpl.invoke0(Native Method)
at sun.reflect.NativeMethodAccessorImpl.invoke(NativeMethodAccessorImpl.java:39)
at sun.reflect.DelegatingMethodAccessorImpl.invoke(DelegatingMethodAccessorImpl.java:25)
at java.lang.reflect.Method.invoke(Method.java:597)
at org.codehaus.plexus.classworlds.launcher.Launcher.launchStandard(Launcher.java:329)
at org.codehaus.plexus.classworlds.launcher.Launcher.launch(Launcher.java:239)
at org.jvnet.hudson.maven3.agent.Maven3Main.launch(Maven3Main.java:158)
at hudson.maven.Maven3Builder.call(Maven3Builder.java:122)
at hudson.maven.Maven3Builder.call(Maven3Builder.java:74)
at hudson.remoting.UserRequest.perform(UserRequest.java:118)
at hudson.remoting.UserRequest.perform(UserRequest.java:48)
at hudson.remoting.Request$2.run(Request.java:287)
at java.util.concurrent.Executors$RunnableAdapter.call(Executors.java:441)
at java.util.concurrent.FutureTask$Sync.innerRun(FutureTask.java:303)
at java.util.concurrent.FutureTask.run(FutureTask.java:138)
at java.util.concurrent.ThreadPoolExecutor$Worker.runTask(ThreadPoolExecutor.java:886)
at java.util.concurrent.ThreadPoolExecutor$Worker.run(ThreadPoolExecutor.java:908)
at java.lang.Thread.run(Thread.java:662)
Caused by: org.apache.maven.plugin.CompilationFailureException: Compilation failure
at org.apache.maven.plugin.AbstractCompilerMojo.execute(AbstractCompilerMojo.java:516)
at org.apache.maven.plugin.CompilerMojo.execute(CompilerMojo.java:114)
at org.apache.maven.plugin.DefaultBuildPluginManager.executeMojo(DefaultBuildPluginManager.java:107)
at org.apache.maven.lifecycle.internal.MojoExecutor.execute(MojoExecutor.java:209)
... 27 more
Sending e-mails to: airavata-dev@incubator.apache.org
channel stopped
Build failed in Jenkins: Airavata #124
Posted by Apache Jenkins Server <je...@builds.apache.org>.
See <https://builds.apache.org/job/Airavata/124/changes>
Changes:
[lahiru] adding workflow-execution-context to build system.
[lahiru] changing the schema.
[lahiru] adding new class for new ContextHeader.
------------------------------------------
[...truncated 1421 lines...]
A modules/commons/gfac-schema/src/main/java/org
A modules/commons/gfac-schema/src/main/java/org/apache
A modules/commons/gfac-schema/src/main/java/org/apache/airavata
A modules/commons/gfac-schema/src/main/java/org/apache/airavata/commons
A modules/commons/gfac-schema/src/main/java/org/apache/airavata/commons/gfac
A modules/commons/gfac-schema/src/main/java/org/apache/airavata/commons/gfac/type
A modules/commons/gfac-schema/src/main/java/org/apache/airavata/commons/gfac/type/Parameter.java
A modules/commons/gfac-schema/src/main/java/org/apache/airavata/commons/gfac/type/app
A modules/commons/gfac-schema/src/main/java/org/apache/airavata/commons/gfac/type/app/GramApplicationDeployment.java
A modules/commons/gfac-schema/src/main/java/org/apache/airavata/commons/gfac/type/app/ShellApplicationDeployment.java
A modules/commons/gfac-schema/src/main/java/org/apache/airavata/commons/gfac/type/parameter
A modules/commons/gfac-schema/src/main/java/org/apache/airavata/commons/gfac/type/parameter/BooleanParameter.java
A modules/commons/gfac-schema/src/main/java/org/apache/airavata/commons/gfac/type/parameter/FileParameter.java
A modules/commons/gfac-schema/src/main/java/org/apache/airavata/commons/gfac/type/parameter/AbstractParameter.java
A modules/commons/gfac-schema/src/main/java/org/apache/airavata/commons/gfac/type/parameter/FloatParameter.java
A modules/commons/gfac-schema/src/main/java/org/apache/airavata/commons/gfac/type/parameter/StringParameter.java
A modules/commons/gfac-schema/src/main/java/org/apache/airavata/commons/gfac/type/parameter/ParameterFactory.java
A modules/commons/gfac-schema/src/main/java/org/apache/airavata/commons/gfac/type/parameter/DoubleParameter.java
A modules/commons/gfac-schema/src/main/java/org/apache/airavata/commons/gfac/type/parameter/IntegerParameter.java
A modules/commons/gfac-schema/src/main/java/org/apache/airavata/commons/gfac/type/HostDescription.java
A modules/commons/gfac-schema/src/main/java/org/apache/airavata/commons/gfac/type/Type.java
A modules/commons/gfac-schema/src/main/java/org/apache/airavata/commons/gfac/type/ServiceDescription.java
A modules/commons/gfac-schema/src/main/java/org/apache/airavata/commons/gfac/type/ApplicationDeploymentDescription.java
A modules/commons/gfac-schema/src/main/java/org/apache/airavata/commons/gfac/type/DataType.java
A modules/commons/gfac-schema/src/main/java/org/apache/airavata/commons/gfac/type/host
A modules/commons/gfac-schema/src/main/java/org/apache/airavata/commons/gfac/type/host/GlobusHost.java
A modules/commons/gfac-schema/src/main/java/org/apache/airavata/commons/gfac/util
A modules/commons/gfac-schema/src/main/java/org/apache/airavata/commons/gfac/util/GFacSchemaException.java
A modules/commons/gfac-schema/src/main/java/org/apache/airavata/commons/gfac/util/GFacConstants.java
A modules/commons/gfac-schema/src/main/java/org/apache/airavata/commons/gfac/util/SchemaUtil.java
A modules/commons/gfac-schema/src/main/resources
A modules/commons/gfac-schema/src/main/resources/datatype.properties
A modules/commons/gfac-schema/pom.xml
A modules/workflow-interpreter
A modules/workflow-interpreter/src
A modules/workflow-interpreter/src/main
A modules/workflow-interpreter/src/main/resources
A modules/workflow-interpreter/src/main/resources/WorkflowInterpretor.wsdl
A modules/workflow-interpreter/src/main/resources/services.xml
A modules/workflow-interpreter/pom.xml
A modules/workflow-interpreter/client
A pom.xml
At revision 1186735
Parsing POMs
Discovered a new module airavata:airavata-workflow-execution-context Airavata Workflow Execution Context
Modules changed, recalculating dependency graph
[Airavata] $ /home/hudson/tools/java/latest1.6/bin/java -cp /home/hudson/hudson-slave/maven3-agent.jar:/home/hudson/tools/maven/latest3/boot/plexus-classworlds-2.4.jar org.jvnet.hudson.maven3.agent.Maven3Main /home/hudson/tools/maven/latest3 /home/hudson/hudson-slave/slave.jar /home/hudson/hudson-slave/maven3-interceptor.jar 43868
channel started
<===[JENKINS REMOTING CAPACITY]===> Executing Maven: -B -f <https://builds.apache.org/job/Airavata/ws/pom.xml> clean install
[INFO] Scanning for projects...
[WARNING]
[WARNING] Some problems were encountered while building the effective model for airavata:airavata-gfac-core:jar:0.0.1-SNAPSHOT
[WARNING] 'build.plugins.plugin.version' for org.apache.maven.plugins:maven-surefire-plugin is missing. @ line 140, column 21
[WARNING]
[WARNING] Some problems were encountered while building the effective model for airavata:airavata-messenger-commons:jar:0.0.1-SNAPSHOT
[WARNING] 'build.plugins.plugin.version' for org.apache.maven.plugins:maven-surefire-plugin is missing. @ airavata:airavata-ws-messenger:0.0.1-SNAPSHOT, <https://builds.apache.org/job/Airavata/ws/modules/ws-messenger/pom.xml,> line 116, column 21
[WARNING]
[WARNING] Some problems were encountered while building the effective model for airavata:airavata-messenger-client:jar:0.0.1-SNAPSHOT
[WARNING] 'build.plugins.plugin.version' for org.apache.maven.plugins:maven-surefire-plugin is missing. @ airavata:airavata-ws-messenger:0.0.1-SNAPSHOT, <https://builds.apache.org/job/Airavata/ws/modules/ws-messenger/pom.xml,> line 116, column 21
[WARNING]
[WARNING] Some problems were encountered while building the effective model for airavata:airavata-messagebox:jar:0.0.1-SNAPSHOT
[WARNING] 'build.plugins.plugin.version' for org.apache.maven.plugins:maven-surefire-plugin is missing. @ airavata:airavata-ws-messenger:0.0.1-SNAPSHOT, <https://builds.apache.org/job/Airavata/ws/modules/ws-messenger/pom.xml,> line 116, column 21
[WARNING]
[WARNING] Some problems were encountered while building the effective model for airavata:airavata-messagebroker:jar:0.0.1-SNAPSHOT
[WARNING] 'build.plugins.plugin.version' for org.apache.maven.plugins:maven-surefire-plugin is missing. @ airavata:airavata-ws-messenger:0.0.1-SNAPSHOT, <https://builds.apache.org/job/Airavata/ws/modules/ws-messenger/pom.xml,> line 116, column 21
[WARNING] 'build.plugins.plugin.version' for org.apache.maven.plugins:maven-jar-plugin is missing. @ line 17, column 21
[WARNING]
[WARNING] Some problems were encountered while building the effective model for Airavata:ws-messenger-distribution:jar:0.0.1-SNAPSHOT
[WARNING] 'build.plugins.plugin.version' for org.apache.maven.plugins:maven-surefire-plugin is missing. @ airavata:airavata-ws-messenger:0.0.1-SNAPSHOT, <https://builds.apache.org/job/Airavata/ws/modules/ws-messenger/pom.xml,> line 116, column 21
[WARNING] The expression ${version} is deprecated. Please use ${project.version} instead.
[WARNING]
[WARNING] Some problems were encountered while building the effective model for airavata:airavata-ws-messenger:pom:0.0.1-SNAPSHOT
[WARNING] 'build.plugins.plugin.version' for org.apache.maven.plugins:maven-surefire-plugin is missing. @ line 116, column 21
[WARNING]
[WARNING] Some problems were encountered while building the effective model for airavata:airavata-xbaya-gui:jar:0.0.1-SNAPSHOT
[WARNING] 'dependencies.dependency.(groupId:artifactId:type:classifier)' must be unique: airavata:airavata-common-utils:jar -> duplicate declaration of version ${airavata.version} @ line 380, column 21
[WARNING] 'dependencies.dependency.(groupId:artifactId:type:classifier)' must be unique: log4j:log4j:jar -> duplicate declaration of version (?) @ line 409, column 21
[WARNING] 'build.plugins.plugin.version' for org.codehaus.mojo.webstart:webstart-maven-plugin is missing. @ line 119, column 21
[WARNING] 'build.plugins.plugin.version' for org.apache.maven.plugins:maven-compiler-plugin is missing. @ line 80, column 21
[WARNING] 'build.plugins.plugin.version' for org.apache.maven.plugins:maven-jar-plugin is missing. @ line 88, column 21
[WARNING]
[WARNING] Some problems were encountered while building the effective model for airavata:airavata-workflowtracking:jar:0.0.1-SNAPSHOT
[WARNING] 'build.plugins.plugin.version' for org.apache.maven.plugins:maven-surefire-plugin is missing. @ line 84, column 21
[WARNING] The expression ${pom.version} is deprecated. Please use ${project.version} instead.
[WARNING]
[WARNING] Some problems were encountered while building the effective model for airavata:airavata-gfac-schema-utils:jar:0.0.1-SNAPSHOT
[WARNING] 'build.plugins.plugin.version' for org.apache.maven.plugins:maven-surefire-plugin is missing. @ airavata:airavata-commons:0.0.1-SNAPSHOT, <https://builds.apache.org/job/Airavata/ws/modules/commons/pom.xml,> line 31, column 21
[WARNING] 'build.plugins.plugin.version' for org.codehaus.mojo:build-helper-maven-plugin is missing. @ line 98, column 21
[WARNING] The expression ${artifactId} is deprecated. Please use ${project.artifactId} instead.
[WARNING] The expression ${version} is deprecated. Please use ${project.version} instead.
[WARNING]
[WARNING] Some problems were encountered while building the effective model for airavata:airavata-common-utils:jar:0.0.1-SNAPSHOT
[WARNING] 'build.plugins.plugin.version' for org.apache.maven.plugins:maven-surefire-plugin is missing. @ airavata:airavata-commons:0.0.1-SNAPSHOT, <https://builds.apache.org/job/Airavata/ws/modules/commons/pom.xml,> line 31, column 21
[WARNING]
[WARNING] Some problems were encountered while building the effective model for airavata:airavata-registry-api:jar:0.0.1-SNAPSHOT
[WARNING] 'build.plugins.plugin.version' for org.apache.maven.plugins:maven-surefire-plugin is missing. @ airavata:airavata-commons:0.0.1-SNAPSHOT, <https://builds.apache.org/job/Airavata/ws/modules/commons/pom.xml,> line 31, column 21
[WARNING]
[WARNING] Some problems were encountered while building the effective model for airavata:airavata-workflow-execution-context:jar:0.0.1-SNAPSHOT
[WARNING] 'build.plugins.plugin.version' for org.apache.maven.plugins:maven-surefire-plugin is missing. @ airavata:airavata-commons:0.0.1-SNAPSHOT, <https://builds.apache.org/job/Airavata/ws/modules/commons/pom.xml,> line 31, column 21
[WARNING] 'build.plugins.plugin.version' for org.codehaus.mojo:build-helper-maven-plugin is missing. @ line 52, column 12
[WARNING] The expression ${artifactId} is deprecated. Please use ${project.artifactId} instead.
[WARNING] The expression ${version} is deprecated. Please use ${project.version} instead.
[WARNING]
[WARNING] Some problems were encountered while building the effective model for airavata:airavata-commons:pom:0.0.1-SNAPSHOT
[WARNING] 'build.plugins.plugin.version' for org.apache.maven.plugins:maven-surefire-plugin is missing. @ line 31, column 21
[WARNING]
[WARNING] Some problems were encountered while building the effective model for airavata:simple-math-service:jar:0.0.1-SNAPSHOT
[WARNING] 'build.plugins.plugin.version' for org.apache.maven.plugins:maven-compiler-plugin is missing. @ line 38, column 12
[WARNING]
[WARNING] Some problems were encountered while building the effective model for Airavata:distribution:jar:0.0.1-SNAPSHOT
[WARNING] 'dependencies.dependency.(groupId:artifactId:type:classifier)' must be unique: lead-security:cryptix32:jar -> duplicate declaration of version versionless @ line 207, column 21
[WARNING] 'dependencies.dependency.(groupId:artifactId:type:classifier)' must be unique: xsul:xsul:jar -> version (?) vs 2.10.5_d @ line 246, column 21
[WARNING] The expression ${version} is deprecated. Please use ${project.version} instead.
[WARNING]
[WARNING] It is highly recommended to fix these problems because they threaten the stability of your build.
[WARNING]
[WARNING] For this reason, future Maven versions might no longer support building such malformed projects.
[WARNING]
[INFO] ------------------------------------------------------------------------
[INFO] Reactor Build Order:
[INFO]
[INFO] Airavata
[INFO] Airavata Commons
[INFO] Airavata GFac Schema Utilities
[INFO] Airavata Registry API
[INFO] Airavata-WS-Messenger
[INFO] Messenger Commons
[INFO] Messenger Client
[INFO] Airavata Workflow Tracking
[INFO] GFac-Core
[INFO] GFac-Axis2-Interface
[INFO] MessageBox
[INFO] Message Broker
[INFO] distribution
[INFO] Airavata Common Utilities
[INFO] Airavata Workflow Execution Context
[INFO] Airavata XBaya
[INFO] Simple Math Service
[INFO] distribution
[INFO]
[INFO] ------------------------------------------------------------------------
[INFO] Building Airavata 0.0.1-SNAPSHOT
[INFO] ------------------------------------------------------------------------
[INFO]
[INFO] --- maven-clean-plugin:2.4.1:clean (default-clean) @ airavata ---
[INFO]
[INFO] --- maven-install-plugin:2.3.1:install (default-install) @ airavata ---
[INFO] Installing <https://builds.apache.org/job/Airavata/ws/pom.xml> to /home/hudson/.m2/repository/airavata/airavata/0.0.1-SNAPSHOT/airavata-0.0.1-SNAPSHOT.pom
[JENKINS] Archiving <https://builds.apache.org/job/Airavata/ws/pom.xml> to /home/hudson/hudson/jobs/Airavata/modules/airavata$airavata/builds/2011-10-20_11-07-27/archive/airavata/airavata/0.0.1-SNAPSHOT/airavata-0.0.1-SNAPSHOT.pom
[INFO]
[INFO] ------------------------------------------------------------------------
[INFO] Building Airavata Commons 0.0.1-SNAPSHOT
[INFO] ------------------------------------------------------------------------
[INFO]
[INFO] --- maven-clean-plugin:2.4.1:clean (default-clean) @ airavata-commons ---
[INFO] [INFO] Installing <https://builds.apache.org/job/Airavata/ws/modules/commons/pom.xml> to /home/hudson/.m2/repository/airavata/airavata-commons/0.0.1-SNAPSHOT/airavata-commons-0.0.1-SNAPSHOT.pom
[INFO] --- maven-install-plugin:2.3.1:install (default-install) @ airavata-commons ---
[JENKINS] Archiving <https://builds.apache.org/job/Airavata/ws/modules/commons/pom.xml> to /home/hudson/hudson/jobs/Airavata/modules/airavata$airavata-commons/builds/2011-10-20_11-07-27/archive/airavata/airavata-commons/0.0.1-SNAPSHOT/airavata-commons-0.0.1-SNAPSHOT.pom
[INFO]
[INFO] ------------------------------------------------------------------------
[INFO] Building Airavata GFac Schema Utilities 0.0.1-SNAPSHOT
[INFO] ------------------------------------------------------------------------
[INFO]
[INFO] --- maven-clean-plugin:2.4.1:clean (default-clean) @ airavata-gfac-schema-utils ---
[INFO]
[INFO] --- build-helper-maven-plugin:1.7:add-source (add-source) @ airavata-gfac-schema-utils ---
[INFO] Source directory: <https://builds.apache.org/job/Airavata/ws/modules/commons/gfac-schema/target/generated-sources/xmlbeans> added.
[INFO]
[INFO] --- xmlbeans-maven-plugin:2.3.3:xmlbeans (default) @ airavata-gfac-schema-utils ---
[INFO]
[INFO] --- maven-resources-plugin:2.4.3:resources (default-resources) @ airavata-gfac-schema-utils ---
[INFO] Using 'UTF-8' encoding to copy filtered resources.
[INFO] Copying 1 resource
[INFO] Copying 179 resources
[INFO]
[INFO] --- maven-compiler-plugin:2.0.2:compile (default-compile) @ airavata-gfac-schema-utils ---
[INFO] Compiling 20 source files to <https://builds.apache.org/job/Airavata/ws/modules/commons/gfac-schema/target/classes>
[JENKINS] Archiving <https://builds.apache.org/job/Airavata/ws/modules/commons/gfac-schema/pom.xml> to /home/hudson/hudson/jobs/Airavata/modules/airavata$airavata-gfac-schema-utils/builds/2011-10-20_11-07-27/archive/airavata/airavata-gfac-schema-utils/0.0.1-SNAPSHOT/airavata-gfac-schema-utils-0.0.1-SNAPSHOT.pom
[INFO] ------------------------------------------------------------------------
[INFO] Reactor Summary:
[INFO]
[INFO] Airavata .......................................... SUCCESS [19.704s]
[INFO] Airavata Commons .................................. SUCCESS [0.386s]
[INFO] Airavata GFac Schema Utilities .................... FAILURE [10.822s]
[INFO] Airavata Registry API ............................. SKIPPED
[INFO] Airavata-WS-Messenger ............................. SKIPPED
[INFO] Messenger Commons ................................. SKIPPED
[INFO] Messenger Client .................................. SKIPPED
[INFO] Airavata Workflow Tracking ........................ SKIPPED
[INFO] GFac-Core ......................................... SKIPPED
[INFO] GFac-Axis2-Interface .............................. SKIPPED
[INFO] MessageBox ........................................ SKIPPED
[INFO] Message Broker .................................... SKIPPED
[INFO] distribution ...................................... SKIPPED
[INFO] Airavata Common Utilities ......................... SKIPPED
[INFO] Airavata Workflow Execution Context ............... SKIPPED
[INFO] Airavata XBaya .................................... SKIPPED
[INFO] Simple Math Service ............................... SKIPPED
[INFO] distribution ...................................... SKIPPED
[INFO] ------------------------------------------------------------------------
[INFO] BUILD FAILURE
[INFO] ------------------------------------------------------------------------
[INFO] Total time: 34.138s
[INFO] Finished at: Thu Oct 20 11:08:19 UTC 2011
[INFO] Final Memory: 15M/69M
[INFO] ------------------------------------------------------------------------
Waiting for Jenkins to finish collecting data
mavenExecutionResult exceptions not empty
message : Failed to execute goal org.apache.maven.plugins:maven-compiler-plugin:2.0.2:compile (default-compile) on project airavata-gfac-schema-utils: Compilation failure
cause : Compilation failure
Stack trace :
org.apache.maven.lifecycle.LifecycleExecutionException: Failed to execute goal org.apache.maven.plugins:maven-compiler-plugin:2.0.2:compile (default-compile) on project airavata-gfac-schema-utils: Compilation failure
at org.apache.maven.lifecycle.internal.MojoExecutor.execute(MojoExecutor.java:213)
at org.apache.maven.lifecycle.internal.MojoExecutor.execute(MojoExecutor.java:153)
at org.apache.maven.lifecycle.internal.MojoExecutor.execute(MojoExecutor.java:145)
at org.apache.maven.lifecycle.internal.LifecycleModuleBuilder.buildProject(LifecycleModuleBuilder.java:84)
at org.apache.maven.lifecycle.internal.LifecycleModuleBuilder.buildProject(LifecycleModuleBuilder.java:59)
at org.apache.maven.lifecycle.internal.LifecycleStarter.singleThreadedBuild(LifecycleStarter.java:183)
at org.apache.maven.lifecycle.internal.LifecycleStarter.execute(LifecycleStarter.java:161)
at org.apache.maven.DefaultMaven.doExecute(DefaultMaven.java:319)
at org.apache.maven.DefaultMaven.execute(DefaultMaven.java:156)
at org.jvnet.hudson.maven3.launcher.Maven3Launcher.main(Maven3Launcher.java:79)
at sun.reflect.NativeMethodAccessorImpl.invoke0(Native Method)
at sun.reflect.NativeMethodAccessorImpl.invoke(NativeMethodAccessorImpl.java:39)
at sun.reflect.DelegatingMethodAccessorImpl.invoke(DelegatingMethodAccessorImpl.java:25)
at java.lang.reflect.Method.invoke(Method.java:597)
at org.codehaus.plexus.classworlds.launcher.Launcher.launchStandard(Launcher.java:329)
at org.codehaus.plexus.classworlds.launcher.Launcher.launch(Launcher.java:239)
at org.jvnet.hudson.maven3.agent.Maven3Main.launch(Maven3Main.java:158)
at hudson.maven.Maven3Builder.call(Maven3Builder.java:122)
at hudson.maven.Maven3Builder.call(Maven3Builder.java:74)
at hudson.remoting.UserRequest.perform(UserRequest.java:118)
at hudson.remoting.UserRequest.perform(UserRequest.java:48)
at hudson.remoting.Request$2.run(Request.java:287)
at java.util.concurrent.Executors$RunnableAdapter.call(Executors.java:441)
at java.util.concurrent.FutureTask$Sync.innerRun(FutureTask.java:303)
at java.util.concurrent.FutureTask.run(FutureTask.java:138)
at java.util.concurrent.ThreadPoolExecutor$Worker.runTask(ThreadPoolExecutor.java:886)
at java.util.concurrent.ThreadPoolExecutor$Worker.run(ThreadPoolExecutor.java:908)
at java.lang.Thread.run(Thread.java:662)
Caused by: org.apache.maven.plugin.CompilationFailureException: Compilation failure
at org.apache.maven.plugin.AbstractCompilerMojo.execute(AbstractCompilerMojo.java:516)
at org.apache.maven.plugin.CompilerMojo.execute(CompilerMojo.java:114)
at org.apache.maven.plugin.DefaultBuildPluginManager.executeMojo(DefaultBuildPluginManager.java:101)
at org.apache.maven.lifecycle.internal.MojoExecutor.execute(MojoExecutor.java:209)
... 27 more
Sending e-mails to: airavata-dev@incubator.apache.org
channel stopped