You are viewing a plain text version of this content. The canonical link for it is here.
Posted to builds@beam.apache.org by Apache Jenkins Server <je...@builds.apache.org> on 2022/11/05 11:34:03 UTC

Build failed in Jenkins: beam_PostCommit_XVR_PythonUsingJava_Dataflow #1122

See <https://ci-beam.apache.org/job/beam_PostCommit_XVR_PythonUsingJava_Dataflow/1122/display/redirect>

Changes:


------------------------------------------
[...truncated 1.00 MB...]
packaging==21.3
pandas==1.4.4
parameterized==0.8.1
pbr==5.11.0
pip==22.3
pluggy==1.0.0
proto-plus==1.22.1
protobuf==3.19.6
psycopg2-binary==2.9.4
py==1.11.0
pyarrow==9.0.0
pyasn1==0.4.8
pyasn1-modules==0.2.8
pycparser==2.21
pydot==1.4.2
PyHamcrest==1.10.1
pymongo==3.12.3
PyMySQL==1.0.2
pyparsing==3.0.9
pytest==7.1.3
pytest-forked==1.4.0
pytest-timeout==2.1.0
pytest-xdist==2.5.0
python-dateutil==2.8.2
python-snappy==0.6.1
pytz==2022.5
PyYAML==6.0
regex==2022.9.13
requests==2.28.1
requests-mock==1.10.0
requests-oauthlib==1.3.1
rsa==4.9
scikit-learn==1.1.2
scipy==1.9.3
setuptools==65.5.1
six==1.16.0
sortedcontainers==2.4.0
soupsieve==2.3.2.post1
SQLAlchemy==1.4.42
sqlparse==0.4.3
tenacity==5.1.5
tensorboard==2.10.1
tensorboard-data-server==0.6.1
tensorboard-plugin-wit==1.8.1
tensorflow==2.10.0
tensorflow-estimator==2.10.0
tensorflow-io-gcs-filesystem==0.27.0
termcolor==2.0.1
testcontainers==3.7.0
threadpoolctl==3.1.0
tomli==2.0.1
tqdm==4.64.1
typing_extensions==4.4.0
uritemplate==4.1.1
urllib3==1.26.12
websocket-client==1.4.1
Werkzeug==2.2.2
wheel==0.37.1
wrapt==1.14.1
zstandard==0.18.0
Removing intermediate container a50ac5cb7f17
 ---> 1f69204cbe59
Step 17/32 : COPY target/LICENSE /opt/apache/beam/
 ---> e5a3585bb6fe
Step 18/32 : COPY target/LICENSE.python /opt/apache/beam/
 ---> 3fcbafaf45c2
Step 19/32 : COPY target/NOTICE /opt/apache/beam/
 ---> 8429f076dfc0
Step 20/32 : COPY target/launcher/linux_amd64/boot /opt/apache/beam/
 ---> 34b826449f72
Step 21/32 : ENTRYPOINT ["/opt/apache/beam/boot"]
 ---> Running in ae8a578e1dc1
Removing intermediate container ae8a578e1dc1
 ---> f3a4d0a05e9c
Step 22/32 : FROM beam as third_party_licenses
 ---> f3a4d0a05e9c
Step 23/32 : ARG pull_licenses
 ---> Running in 37a1e64fe524
Removing intermediate container 37a1e64fe524
 ---> 1354adb3fbdf
Step 24/32 : COPY target/license_scripts /tmp/license_scripts/
 ---> 3009655b27ec
Step 25/32 : COPY target/LICENSE target/go-licenses/* /opt/apache/beam/third_party_licenses/golang/
 ---> f43d6b27e02c
Step 26/32 : RUN rm /opt/apache/beam/third_party_licenses/golang/LICENSE
 ---> Running in d85ee2e67d58
Removing intermediate container d85ee2e67d58
 ---> 57abaf56fc38
Step 27/32 : COPY target/license_scripts /tmp/license_scripts/
 ---> 9d91ef5989d3
Step 28/32 : RUN if [ "$pull_licenses" = "true" ] ; then       pip install 'pip-licenses<4.0.0' pyyaml tenacity &&       python /tmp/license_scripts/pull_licenses_py.py ;     fi
 ---> Running in 579296ebd8f3
Collecting pip-licenses<4.0.0
  Downloading pip_licenses-3.5.5-py3-none-any.whl (17 kB)
Requirement already satisfied: pyyaml in /usr/local/lib/python3.10/site-packages (6.0)
Requirement already satisfied: tenacity in /usr/local/lib/python3.10/site-packages (5.1.5)
Collecting PTable
  Downloading PTable-0.9.2.tar.gz (31 kB)
  Preparing metadata (setup.py): started
  Preparing metadata (setup.py): finished with status 'done'
Requirement already satisfied: six>=1.9.0 in /usr/local/lib/python3.10/site-packages (from tenacity) (1.16.0)
Building wheels for collected packages: PTable
  Building wheel for PTable (setup.py): started
  Building wheel for PTable (setup.py): finished with status 'done'
  Created wheel for PTable: filename=PTable-0.9.2-py3-none-any.whl size=22908 sha256=0fc067ac4b276e72fe90169b9a9c25be4e00c1dee9c5a70b4cf977768bc47368
  Stored in directory: /root/.cache/pip/wheels/62/2a/42/c655cf57d84ab59535337af009892aaf16256a813826b465f7
Successfully built PTable
Installing collected packages: PTable, pip-licenses
Successfully installed PTable-0.9.2 pip-licenses-3.5.5
WARNING: Running pip as the 'root' user can result in broken permissions and conflicting behaviour with the system package manager. It is recommended to use a virtual environment instead: https://pip.pypa.io/warnings/venv
Skip pulling license for  bs4
INFO:root:Successfully pulled licenses for 135 dependencies
Removing intermediate container 579296ebd8f3
 ---> 42148d1baf25
Step 29/32 : FROM beam
 ---> f3a4d0a05e9c
Step 30/32 : ARG pull_licenses
 ---> Running in 44e14ddfcca0
Removing intermediate container 44e14ddfcca0
 ---> c8881559f558
Step 31/32 : COPY --from=third_party_licenses /opt/apache/beam/third_party_licenses /opt/apache/beam/third_party_licenses
 ---> bc7dbb2c2c97
Step 32/32 : RUN if [ "$pull_licenses" != "true" ] ; then       rm -rf /opt/apache/beam/third_party_licenses ;     fi
 ---> Running in 4d53b04bfec3
Removing intermediate container 4d53b04bfec3
 ---> 13762c5d72c5
Successfully built 13762c5d72c5
Successfully tagged apache/beam_python3.10_sdk:2.44.0.dev

> Task :runners:google-cloud-dataflow-java:buildAndPushDockerPythonContainer
WARNING: `gcloud docker` will not be supported for Docker client versions above 18.03.

As an alternative, use `gcloud auth configure-docker` to configure `docker` to
use `gcloud` as a credential helper, then use `docker` as you would for non-GCR
registries, e.g. `docker pull gcr.io/project-id/my-image`. Add
`--verbosity=error` to silence this warning: `gcloud docker
--verbosity=error -- pull gcr.io/project-id/my-image`.

See: https://cloud.google.com/container-registry/docs/support/deprecation-notices#gcloud-docker

The push refers to repository [us.gcr.io/apache-beam-testing/java-postcommit-it/python]
4900d9adde29: Preparing
0676df34fd2a: Preparing
0bf1d7876a59: Preparing
fde703b1759c: Preparing
c499408fb54c: Preparing
7c93d9627e22: Preparing
f4107ad07dab: Preparing
3c7fcb7bd438: Preparing
2cef5e123080: Preparing
cd2016da4657: Preparing
27dce0ac9f5a: Preparing
7e0fa93bbb0e: Preparing
90b6d3b502f1: Preparing
c8eae672bd63: Preparing
f5d161bba139: Preparing
1569e0d95ce6: Preparing
d9e08da15d0c: Preparing
6b183c62e3d7: Preparing
882fd36bfd35: Preparing
d1dec9917839: Preparing
7c93d9627e22: Waiting
d38adf39e1dd: Preparing
4ed121b04368: Preparing
3c7fcb7bd438: Waiting
d9d07d703dd5: Preparing
f4107ad07dab: Waiting
2cef5e123080: Waiting
cd2016da4657: Waiting
d9e08da15d0c: Waiting
27dce0ac9f5a: Waiting
d38adf39e1dd: Waiting
6b183c62e3d7: Waiting
d9d07d703dd5: Waiting
d1dec9917839: Waiting
4ed121b04368: Waiting
7e0fa93bbb0e: Waiting
f5d161bba139: Waiting
882fd36bfd35: Waiting
c8eae672bd63: Waiting
90b6d3b502f1: Waiting
1569e0d95ce6: Waiting
0bf1d7876a59: Pushed
c499408fb54c: Pushed
fde703b1759c: Pushed
4900d9adde29: Pushed
0676df34fd2a: Pushed
3c7fcb7bd438: Pushed
2cef5e123080: Pushed
f4107ad07dab: Pushed
90b6d3b502f1: Pushed
c8eae672bd63: Pushed
f5d161bba139: Layer already exists
1569e0d95ce6: Layer already exists
d9e08da15d0c: Layer already exists
6b183c62e3d7: Layer already exists
882fd36bfd35: Layer already exists
d1dec9917839: Layer already exists
d38adf39e1dd: Layer already exists
4ed121b04368: Layer already exists
d9d07d703dd5: Layer already exists
27dce0ac9f5a: Pushed
7c93d9627e22: Pushed
cd2016da4657: Pushed
7e0fa93bbb0e: Pushed
name unknown: Failed to get blob sizes.

> Task :runners:google-cloud-dataflow-java:buildAndPushDockerPythonContainer FAILED

> Task :runners:google-cloud-dataflow-java:validatesCrossLanguageRunnerSetup
Launching Java expansion service @ 34573
Launching Python expansion service @ 46243

> Task :runners:google-cloud-dataflow-java:validatesCrossLanguageRunnerCleanup
Stopping expansion service pid: 439699.
Stopping expansion service pid: 439700.

FAILURE: Build failed with an exception.

* Where:
Build file '<https://ci-beam.apache.org/job/beam_PostCommit_XVR_PythonUsingJava_Dataflow/ws/src/runners/google-cloud-dataflow-java/build.gradle'> line: 330

* What went wrong:
Execution failed for task ':runners:google-cloud-dataflow-java:buildAndPushDockerPythonContainer'.
> Process 'command 'gcloud'' finished with non-zero exit value 1

* Try:
> Run with --stacktrace option to get the stack trace.
> Run with --info or --debug option to get more log output.

* Get more help at https://help.gradle.org

Deprecated Gradle features were used in this build, making it incompatible with Gradle 8.0.

You can use '--warning-mode all' to show the individual deprecation warnings and determine if they come from your own scripts or plugins.

See https://docs.gradle.org/7.5.1/userguide/command_line_interface.html#sec:command_line_warnings

Execution optimizations have been disabled for 1 invalid unit(s) of work during this build to ensure correctness.
Please consult deprecation warnings for more details.

BUILD FAILED in 12m 5s
126 actionable tasks: 22 executed, 104 up-to-date

Publishing build scan...
https://gradle.com/s/fafb5sfetqdkg

Build step 'Invoke Gradle script' changed build result to FAILURE
Build step 'Invoke Gradle script' marked build as failure

---------------------------------------------------------------------
To unsubscribe, e-mail: builds-unsubscribe@beam.apache.org
For additional commands, e-mail: builds-help@beam.apache.org


Jenkins build is back to normal : beam_PostCommit_XVR_PythonUsingJava_Dataflow #1125

Posted by Apache Jenkins Server <je...@builds.apache.org>.
See <https://ci-beam.apache.org/job/beam_PostCommit_XVR_PythonUsingJava_Dataflow/1125/display/redirect>


---------------------------------------------------------------------
To unsubscribe, e-mail: builds-unsubscribe@beam.apache.org
For additional commands, e-mail: builds-help@beam.apache.org


Build failed in Jenkins: beam_PostCommit_XVR_PythonUsingJava_Dataflow #1124

Posted by Apache Jenkins Server <je...@builds.apache.org>.
See <https://ci-beam.apache.org/job/beam_PostCommit_XVR_PythonUsingJava_Dataflow/1124/display/redirect>

Changes:


------------------------------------------
[...truncated 1010.24 KB...]
packaging==21.3
pandas==1.4.4
parameterized==0.8.1
pbr==5.11.0
pip==22.3.1
pluggy==1.0.0
proto-plus==1.22.1
protobuf==3.19.6
psycopg2-binary==2.9.4
py==1.11.0
pyarrow==9.0.0
pyasn1==0.4.8
pyasn1-modules==0.2.8
pycparser==2.21
pydot==1.4.2
PyHamcrest==1.10.1
pymongo==3.12.3
PyMySQL==1.0.2
pyparsing==3.0.9
pytest==7.1.3
pytest-forked==1.4.0
pytest-timeout==2.1.0
pytest-xdist==2.5.0
python-dateutil==2.8.2
python-snappy==0.6.1
pytz==2022.5
PyYAML==6.0
regex==2022.9.13
requests==2.28.1
requests-mock==1.10.0
requests-oauthlib==1.3.1
rsa==4.9
scikit-learn==1.1.2
scipy==1.9.3
setuptools==65.5.1
six==1.16.0
sortedcontainers==2.4.0
soupsieve==2.3.2.post1
SQLAlchemy==1.4.42
sqlparse==0.4.3
tenacity==5.1.5
tensorboard==2.10.1
tensorboard-data-server==0.6.1
tensorboard-plugin-wit==1.8.1
tensorflow==2.10.0
tensorflow-estimator==2.10.0
tensorflow-io-gcs-filesystem==0.27.0
termcolor==2.0.1
testcontainers==3.7.0
threadpoolctl==3.1.0
tomli==2.0.1
tqdm==4.64.1
typing_extensions==4.4.0
uritemplate==4.1.1
urllib3==1.26.12
websocket-client==1.4.1
Werkzeug==2.2.2
wheel==0.37.1
wrapt==1.14.1
zstandard==0.18.0
Removing intermediate container 21bf5fe6f7a5
 ---> e7f969d3e2d4
Step 17/32 : COPY target/LICENSE /opt/apache/beam/
 ---> 57070e13ad89
Step 18/32 : COPY target/LICENSE.python /opt/apache/beam/
 ---> 08cf078e6c56
Step 19/32 : COPY target/NOTICE /opt/apache/beam/
 ---> dd11050a6e5c
Step 20/32 : COPY target/launcher/linux_amd64/boot /opt/apache/beam/
 ---> c301fd7f8401
Step 21/32 : ENTRYPOINT ["/opt/apache/beam/boot"]
 ---> Running in 30fd2e780435
Removing intermediate container 30fd2e780435
 ---> a4e6db047689
Step 22/32 : FROM beam as third_party_licenses
 ---> a4e6db047689
Step 23/32 : ARG pull_licenses
 ---> Running in 17c8e3ce0857
Removing intermediate container 17c8e3ce0857
 ---> ee663baf7de4
Step 24/32 : COPY target/license_scripts /tmp/license_scripts/
 ---> 279288f6b843
Step 25/32 : COPY target/LICENSE target/go-licenses/* /opt/apache/beam/third_party_licenses/golang/
 ---> 0f984cc9dd57
Step 26/32 : RUN rm /opt/apache/beam/third_party_licenses/golang/LICENSE
 ---> Running in d6fc3447e55a
Removing intermediate container d6fc3447e55a
 ---> 14afb3795e36
Step 27/32 : COPY target/license_scripts /tmp/license_scripts/
 ---> f4c2f79b7b46
Step 28/32 : RUN if [ "$pull_licenses" = "true" ] ; then       pip install 'pip-licenses<4.0.0' pyyaml tenacity &&       python /tmp/license_scripts/pull_licenses_py.py ;     fi
 ---> Running in de3de978c36f
Collecting pip-licenses<4.0.0
  Downloading pip_licenses-3.5.5-py3-none-any.whl (17 kB)
Requirement already satisfied: pyyaml in /usr/local/lib/python3.10/site-packages (6.0)
Requirement already satisfied: tenacity in /usr/local/lib/python3.10/site-packages (5.1.5)
Collecting PTable
  Downloading PTable-0.9.2.tar.gz (31 kB)
  Preparing metadata (setup.py): started
  Preparing metadata (setup.py): finished with status 'done'
Requirement already satisfied: six>=1.9.0 in /usr/local/lib/python3.10/site-packages (from tenacity) (1.16.0)
Building wheels for collected packages: PTable
  Building wheel for PTable (setup.py): started
  Building wheel for PTable (setup.py): finished with status 'done'
  Created wheel for PTable: filename=PTable-0.9.2-py3-none-any.whl size=22908 sha256=ad0d6f90818a5e05a51576008f580ee5324b674925b0fdbd7a5b7271c30cf90d
  Stored in directory: /root/.cache/pip/wheels/62/2a/42/c655cf57d84ab59535337af009892aaf16256a813826b465f7
Successfully built PTable
Installing collected packages: PTable, pip-licenses
Successfully installed PTable-0.9.2 pip-licenses-3.5.5
WARNING: Running pip as the 'root' user can result in broken permissions and conflicting behaviour with the system package manager. It is recommended to use a virtual environment instead: https://pip.pypa.io/warnings/venv
INFO:root:Successfully pulled licenses for 135 dependencies
Skip pulling license for  bs4
Removing intermediate container de3de978c36f
 ---> 61aef63f75d2
Step 29/32 : FROM beam
 ---> a4e6db047689
Step 30/32 : ARG pull_licenses
 ---> Running in d7feb89c3d9e
Removing intermediate container d7feb89c3d9e
 ---> 9b1ab7e87644
Step 31/32 : COPY --from=third_party_licenses /opt/apache/beam/third_party_licenses /opt/apache/beam/third_party_licenses
 ---> 459159d66828
Step 32/32 : RUN if [ "$pull_licenses" != "true" ] ; then       rm -rf /opt/apache/beam/third_party_licenses ;     fi
 ---> Running in d21b23d2f454
Removing intermediate container d21b23d2f454
 ---> f228d946a97f
Successfully built f228d946a97f
Successfully tagged apache/beam_python3.10_sdk:2.44.0.dev

> Task :runners:google-cloud-dataflow-java:buildAndPushDockerPythonContainer
WARNING: `gcloud docker` will not be supported for Docker client versions above 18.03.

As an alternative, use `gcloud auth configure-docker` to configure `docker` to
use `gcloud` as a credential helper, then use `docker` as you would for non-GCR
registries, e.g. `docker pull gcr.io/project-id/my-image`. Add
`--verbosity=error` to silence this warning: `gcloud docker
--verbosity=error -- pull gcr.io/project-id/my-image`.

See: https://cloud.google.com/container-registry/docs/support/deprecation-notices#gcloud-docker

The push refers to repository [us.gcr.io/apache-beam-testing/java-postcommit-it/python]
67ab0a02bfe1: Preparing
78eba612e757: Preparing
859c06da12ff: Preparing
53f0d1e5888a: Preparing
9e68a2071ebb: Preparing
00491a7d9be4: Preparing
90d007dc978c: Preparing
5fa98a60ec26: Preparing
6cbcad176a79: Preparing
5c8d6a61a2f2: Preparing
c38156916cef: Preparing
614eb14d2479: Preparing
428dfed8d932: Preparing
f2896422d2b9: Preparing
f5d161bba139: Preparing
1569e0d95ce6: Preparing
d9e08da15d0c: Preparing
6b183c62e3d7: Preparing
882fd36bfd35: Preparing
d1dec9917839: Preparing
d38adf39e1dd: Preparing
4ed121b04368: Preparing
d9d07d703dd5: Preparing
90d007dc978c: Waiting
428dfed8d932: Waiting
c38156916cef: Waiting
f2896422d2b9: Waiting
614eb14d2479: Waiting
f5d161bba139: Waiting
5fa98a60ec26: Waiting
5c8d6a61a2f2: Waiting
6cbcad176a79: Waiting
d38adf39e1dd: Waiting
d9d07d703dd5: Waiting
d1dec9917839: Waiting
4ed121b04368: Waiting
1569e0d95ce6: Waiting
d9e08da15d0c: Waiting
6b183c62e3d7: Waiting
00491a7d9be4: Waiting
882fd36bfd35: Waiting
53f0d1e5888a: Pushed
859c06da12ff: Pushed
9e68a2071ebb: Pushed
67ab0a02bfe1: Pushed
78eba612e757: Pushed
5fa98a60ec26: Pushed
90d007dc978c: Pushed
6cbcad176a79: Pushed
428dfed8d932: Pushed
f2896422d2b9: Pushed
f5d161bba139: Layer already exists
1569e0d95ce6: Layer already exists
d9e08da15d0c: Layer already exists
6b183c62e3d7: Layer already exists
882fd36bfd35: Layer already exists
d1dec9917839: Layer already exists
d38adf39e1dd: Layer already exists
4ed121b04368: Layer already exists
c38156916cef: Pushed
d9d07d703dd5: Layer already exists
00491a7d9be4: Pushed
5c8d6a61a2f2: Pushed
614eb14d2479: Pushed
name unknown: Failed to get blob sizes.

> Task :runners:google-cloud-dataflow-java:buildAndPushDockerPythonContainer FAILED

> Task :runners:google-cloud-dataflow-java:validatesCrossLanguageRunnerSetup
Launching Java expansion service @ 34811
Launching Python expansion service @ 41501

> Task :runners:google-cloud-dataflow-java:validatesCrossLanguageRunnerCleanup
Stopping expansion service pid: 849485.
Stopping expansion service pid: 849486.

FAILURE: Build failed with an exception.

* Where:
Build file '<https://ci-beam.apache.org/job/beam_PostCommit_XVR_PythonUsingJava_Dataflow/ws/src/runners/google-cloud-dataflow-java/build.gradle'> line: 330

* What went wrong:
Execution failed for task ':runners:google-cloud-dataflow-java:buildAndPushDockerPythonContainer'.
> Process 'command 'gcloud'' finished with non-zero exit value 1

* Try:
> Run with --stacktrace option to get the stack trace.
> Run with --info or --debug option to get more log output.

* Get more help at https://help.gradle.org

Deprecated Gradle features were used in this build, making it incompatible with Gradle 8.0.

You can use '--warning-mode all' to show the individual deprecation warnings and determine if they come from your own scripts or plugins.

See https://docs.gradle.org/7.5.1/userguide/command_line_interface.html#sec:command_line_warnings

Execution optimizations have been disabled for 1 invalid unit(s) of work during this build to ensure correctness.
Please consult deprecation warnings for more details.

BUILD FAILED in 12m 18s
126 actionable tasks: 22 executed, 104 up-to-date

Publishing build scan...
https://gradle.com/s/wzb7zl3wbgbyk

Build step 'Invoke Gradle script' changed build result to FAILURE
Build step 'Invoke Gradle script' marked build as failure

---------------------------------------------------------------------
To unsubscribe, e-mail: builds-unsubscribe@beam.apache.org
For additional commands, e-mail: builds-help@beam.apache.org


Build failed in Jenkins: beam_PostCommit_XVR_PythonUsingJava_Dataflow #1123

Posted by Apache Jenkins Server <je...@builds.apache.org>.
See <https://ci-beam.apache.org/job/beam_PostCommit_XVR_PythonUsingJava_Dataflow/1123/display/redirect>

Changes:


------------------------------------------
[...truncated 1.01 MB...]
overrides==6.5.0
packaging==21.3
pandas==1.4.4
parameterized==0.8.1
pbr==5.11.0
pip==22.3.1
pluggy==1.0.0
proto-plus==1.22.1
protobuf==3.19.6
psycopg2-binary==2.9.4
py==1.11.0
pyarrow==9.0.0
pyasn1==0.4.8
pyasn1-modules==0.2.8
pycparser==2.21
pydot==1.4.2
PyHamcrest==1.10.1
pymongo==3.12.3
PyMySQL==1.0.2
pyparsing==3.0.9
pytest==7.1.3
pytest-forked==1.4.0
pytest-timeout==2.1.0
pytest-xdist==2.5.0
python-dateutil==2.8.2
python-snappy==0.6.1
pytz==2022.5
PyYAML==6.0
regex==2022.9.13
requests==2.28.1
requests-mock==1.10.0
requests-oauthlib==1.3.1
rsa==4.9
scikit-learn==1.1.2
scipy==1.9.3
setuptools==65.5.1
six==1.16.0
sortedcontainers==2.4.0
soupsieve==2.3.2.post1
SQLAlchemy==1.4.42
sqlparse==0.4.3
tenacity==5.1.5
tensorboard==2.10.1
tensorboard-data-server==0.6.1
tensorboard-plugin-wit==1.8.1
tensorflow==2.10.0
tensorflow-estimator==2.10.0
tensorflow-io-gcs-filesystem==0.27.0
termcolor==2.0.1
testcontainers==3.7.0
threadpoolctl==3.1.0
tomli==2.0.1
tqdm==4.64.1
typing_extensions==4.4.0
uritemplate==4.1.1
urllib3==1.26.12
websocket-client==1.4.1
Werkzeug==2.2.2
wheel==0.37.1
wrapt==1.14.1
zstandard==0.18.0
Removing intermediate container a0728fc274f4
 ---> dfaef56e6478
Step 17/32 : COPY target/LICENSE /opt/apache/beam/
 ---> a4dcbefe0518
Step 18/32 : COPY target/LICENSE.python /opt/apache/beam/
 ---> d724929641b8
Step 19/32 : COPY target/NOTICE /opt/apache/beam/
 ---> 5c32c4081121
Step 20/32 : COPY target/launcher/linux_amd64/boot /opt/apache/beam/
 ---> e961088f6c12
Step 21/32 : ENTRYPOINT ["/opt/apache/beam/boot"]
 ---> Running in 1040c2e1e844
Removing intermediate container 1040c2e1e844
 ---> 04e053f692da
Step 22/32 : FROM beam as third_party_licenses
 ---> 04e053f692da
Step 23/32 : ARG pull_licenses
 ---> Running in 83f3bc6dfa5f
Removing intermediate container 83f3bc6dfa5f
 ---> b23f9e99533c
Step 24/32 : COPY target/license_scripts /tmp/license_scripts/
 ---> 37f7ca393b99
Step 25/32 : COPY target/LICENSE target/go-licenses/* /opt/apache/beam/third_party_licenses/golang/
 ---> 5dea63b514d3
Step 26/32 : RUN rm /opt/apache/beam/third_party_licenses/golang/LICENSE
 ---> Running in 6e9aede180d0
Removing intermediate container 6e9aede180d0
 ---> 6897f1b2a57d
Step 27/32 : COPY target/license_scripts /tmp/license_scripts/
 ---> acb9c5e06aab
Step 28/32 : RUN if [ "$pull_licenses" = "true" ] ; then       pip install 'pip-licenses<4.0.0' pyyaml tenacity &&       python /tmp/license_scripts/pull_licenses_py.py ;     fi
 ---> Running in 3394cdf6e41d
Collecting pip-licenses<4.0.0
  Downloading pip_licenses-3.5.5-py3-none-any.whl (17 kB)
Requirement already satisfied: pyyaml in /usr/local/lib/python3.10/site-packages (6.0)
Requirement already satisfied: tenacity in /usr/local/lib/python3.10/site-packages (5.1.5)
Collecting PTable
  Downloading PTable-0.9.2.tar.gz (31 kB)
  Preparing metadata (setup.py): started
  Preparing metadata (setup.py): finished with status 'done'
Requirement already satisfied: six>=1.9.0 in /usr/local/lib/python3.10/site-packages (from tenacity) (1.16.0)
Building wheels for collected packages: PTable
  Building wheel for PTable (setup.py): started
  Building wheel for PTable (setup.py): finished with status 'done'
  Created wheel for PTable: filename=PTable-0.9.2-py3-none-any.whl size=22908 sha256=71a8c864b4ac6063c7c77881267686046b487a260fa4c89de24b0a608afe043a
  Stored in directory: /root/.cache/pip/wheels/62/2a/42/c655cf57d84ab59535337af009892aaf16256a813826b465f7
Successfully built PTable
Installing collected packages: PTable, pip-licenses
Successfully installed PTable-0.9.2 pip-licenses-3.5.5
WARNING: Running pip as the 'root' user can result in broken permissions and conflicting behaviour with the system package manager. It is recommended to use a virtual environment instead: https://pip.pypa.io/warnings/venv
INFO:root:Successfully pulled licenses for 135 dependencies
Skip pulling license for  bs4
Removing intermediate container 3394cdf6e41d
 ---> 6a6a7b5fdfaa
Step 29/32 : FROM beam
 ---> 04e053f692da
Step 30/32 : ARG pull_licenses
 ---> Running in f476fd9ce5c3
Removing intermediate container f476fd9ce5c3
 ---> 58d4abaf1397
Step 31/32 : COPY --from=third_party_licenses /opt/apache/beam/third_party_licenses /opt/apache/beam/third_party_licenses
 ---> f07c75f7f81c
Step 32/32 : RUN if [ "$pull_licenses" != "true" ] ; then       rm -rf /opt/apache/beam/third_party_licenses ;     fi
 ---> Running in f5f403221a80
Removing intermediate container f5f403221a80
 ---> 78993a810951
Successfully built 78993a810951
Successfully tagged apache/beam_python3.10_sdk:2.44.0.dev

> Task :runners:google-cloud-dataflow-java:buildAndPushDockerPythonContainer
WARNING: `gcloud docker` will not be supported for Docker client versions above 18.03.

As an alternative, use `gcloud auth configure-docker` to configure `docker` to
use `gcloud` as a credential helper, then use `docker` as you would for non-GCR
registries, e.g. `docker pull gcr.io/project-id/my-image`. Add
`--verbosity=error` to silence this warning: `gcloud docker
--verbosity=error -- pull gcr.io/project-id/my-image`.

See: https://cloud.google.com/container-registry/docs/support/deprecation-notices#gcloud-docker

The push refers to repository [us.gcr.io/apache-beam-testing/java-postcommit-it/python]
13193e2f8801: Preparing
3572fcf1d7d1: Preparing
6fd6e8581489: Preparing
503e37e805bc: Preparing
b1fa37fdd76a: Preparing
4d15b1ebbbfa: Preparing
ab1915f34a83: Preparing
889b0c47c7c3: Preparing
224bf8fff177: Preparing
4724b9fd8a99: Preparing
6080b63391e8: Preparing
3686558255ba: Preparing
821ecd236a08: Preparing
c00c6f0febea: Preparing
f5d161bba139: Preparing
1569e0d95ce6: Preparing
d9e08da15d0c: Preparing
6b183c62e3d7: Preparing
882fd36bfd35: Preparing
d1dec9917839: Preparing
d38adf39e1dd: Preparing
4ed121b04368: Preparing
d9d07d703dd5: Preparing
889b0c47c7c3: Waiting
c00c6f0febea: Waiting
3686558255ba: Waiting
821ecd236a08: Waiting
224bf8fff177: Waiting
4724b9fd8a99: Waiting
6080b63391e8: Waiting
f5d161bba139: Waiting
4ed121b04368: Waiting
ab1915f34a83: Waiting
4d15b1ebbbfa: Waiting
d1dec9917839: Waiting
d9d07d703dd5: Waiting
1569e0d95ce6: Waiting
d9e08da15d0c: Waiting
882fd36bfd35: Waiting
6b183c62e3d7: Waiting
13193e2f8801: Pushed
503e37e805bc: Pushed
b1fa37fdd76a: Pushed
6fd6e8581489: Pushed
3572fcf1d7d1: Pushed
889b0c47c7c3: Pushed
224bf8fff177: Pushed
ab1915f34a83: Pushed
821ecd236a08: Pushed
c00c6f0febea: Pushed
f5d161bba139: Layer already exists
1569e0d95ce6: Layer already exists
d9e08da15d0c: Layer already exists
6b183c62e3d7: Layer already exists
882fd36bfd35: Layer already exists
d1dec9917839: Layer already exists
d38adf39e1dd: Layer already exists
4ed121b04368: Layer already exists
d9d07d703dd5: Layer already exists
6080b63391e8: Pushed
4d15b1ebbbfa: Pushed
4724b9fd8a99: Pushed
3686558255ba: Pushed
name unknown: Failed to get blob sizes.

> Task :runners:google-cloud-dataflow-java:buildAndPushDockerPythonContainer FAILED

> Task :runners:google-cloud-dataflow-java:validatesCrossLanguageRunnerSetup
Launching Java expansion service @ 35597
Launching Python expansion service @ 33475

> Task :runners:google-cloud-dataflow-java:validatesCrossLanguageRunnerCleanup
Stopping expansion service pid: 634488.
Stopping expansion service pid: 634489.

FAILURE: Build failed with an exception.

* Where:
Build file '<https://ci-beam.apache.org/job/beam_PostCommit_XVR_PythonUsingJava_Dataflow/ws/src/runners/google-cloud-dataflow-java/build.gradle'> line: 330

* What went wrong:
Execution failed for task ':runners:google-cloud-dataflow-java:buildAndPushDockerPythonContainer'.
> Process 'command 'gcloud'' finished with non-zero exit value 1

* Try:
> Run with --stacktrace option to get the stack trace.
> Run with --info or --debug option to get more log output.

* Get more help at https://help.gradle.org

Deprecated Gradle features were used in this build, making it incompatible with Gradle 8.0.

You can use '--warning-mode all' to show the individual deprecation warnings and determine if they come from your own scripts or plugins.

See https://docs.gradle.org/7.5.1/userguide/command_line_interface.html#sec:command_line_warnings

Execution optimizations have been disabled for 1 invalid unit(s) of work during this build to ensure correctness.
Please consult deprecation warnings for more details.

BUILD FAILED in 12m 16s
126 actionable tasks: 22 executed, 104 up-to-date

Publishing build scan...
https://gradle.com/s/gypapj55rwcgg

Build step 'Invoke Gradle script' changed build result to FAILURE
Build step 'Invoke Gradle script' marked build as failure

---------------------------------------------------------------------
To unsubscribe, e-mail: builds-unsubscribe@beam.apache.org
For additional commands, e-mail: builds-help@beam.apache.org