You are viewing a plain text version of this content. The canonical link for it is here.
Posted to dev@knox.apache.org by "Tamás Hanicz (Jira)" <ji...@apache.org> on 2026/03/27 11:24:00 UTC
[jira] [Resolved] (KNOX-3289) GatewayWebsocketHandlerTest test failures
[ https://issues.apache.org/jira/browse/KNOX-3289?page=com.atlassian.jira.plugin.system.issuetabpanels:all-tabpanel ]
Tamás Hanicz resolved KNOX-3289.
--------------------------------
Fix Version/s: 3.0.0
Resolution: Fixed
> GatewayWebsocketHandlerTest test failures
> -----------------------------------------
>
> Key: KNOX-3289
> URL: https://issues.apache.org/jira/browse/KNOX-3289
> Project: Apache Knox
> Issue Type: Bug
> Components: Tests
> Affects Versions: 2.1.0
> Reporter: Tamás Hanicz
> Assignee: Tamás Hanicz
> Priority: Major
> Fix For: 3.0.0
>
> Time Spent: 0.5h
> Remaining Estimate: 0h
>
> {code:java}
> Error: Errors:
> Error: GatewayWebsocketHandlerTest.testDisabledWebShell:165 » Runtime java.lang.IllegalAccessException: no such field: org.eclipse.jetty.websocket.servlet.ServletUpgradeRequest$$$EasyMock$3.$callback/org.easymock.internal.ClassMockingData/putField
> Error: GatewayWebsocketHandlerTest.testValidWebShellRequest:79 » Runtime java.lang.IllegalAccessException: no such field: org.eclipse.jetty.websocket.servlet.ServletUpgradeRequest$$$EasyMock$3.$callback/org.easymock.internal.ClassMockingData/putField
> Error: GatewayWebsocketHandlerTest.testValidWebShellRequestThroughLB:106 » Runtime java.lang.IllegalAccessException: no such field: org.eclipse.jetty.websocket.servlet.ServletUpgradeRequest$$$EasyMock$3.$callback/org.easymock.internal.ClassMockingData/putField
> Error: GatewayWebsocketHandlerTest.testWebShellRequestWithInvalidJWT:138 » Runtime java.lang.IllegalAccessException: no such field: org.eclipse.jetty.websocket.servlet.ServletUpgradeRequest$$$EasyMock$3.$callback/org.easymock.internal.ClassMockingData/putField {code}
--
This message was sent by Atlassian Jira
(v8.20.10#820010)