You are viewing a plain text version of this content. The canonical link for it is here.
Posted to dev@beam.apache.org by Apache Jenkins Server <je...@builds.apache.org> on 2018/09/07 08:05:11 UTC

Build failed in Jenkins: beam_Release_Gradle_NightlySnapshot #164

See <https://builds.apache.org/job/beam_Release_Gradle_NightlySnapshot/164/display/redirect?page=changes>

Changes:

[herohde] [BEAM-5327] Add support for custom dataflow worker jar in Go

[dattran] [BEAM-5107] Add support for ES-6.x to ElasticsearchIO

[mxm] Fixing bug in flink job server creation

[aaltay] Finish Python 3 porting for coders subpackage (#6310)

------------------------------------------
[...truncated 18.72 MB...]
Skipping task ':beam-vendor-sdks-java-extensions-protobuf:test' as it has no source files and no previous output files.
:beam-vendor-sdks-java-extensions-protobuf:test (Thread[Task worker for ':' Thread 6,5,main]) completed. Took 0.0 secs.
:beam-vendor-sdks-java-extensions-protobuf:validateShadedJarDoesntLeakNonOrgApacheBeamClasses (Thread[Task worker for ':' Thread 6,5,main]) started.

> Task :beam-vendor-sdks-java-extensions-protobuf:validateShadedJarDoesntLeakNonOrgApacheBeamClasses
Caching disabled for task ':beam-vendor-sdks-java-extensions-protobuf:validateShadedJarDoesntLeakNonOrgApacheBeamClasses': Caching has not been enabled for the task
Task ':beam-vendor-sdks-java-extensions-protobuf:validateShadedJarDoesntLeakNonOrgApacheBeamClasses' is not up-to-date because:
  Task has not declared any outputs despite executing actions.
:beam-vendor-sdks-java-extensions-protobuf:validateShadedJarDoesntLeakNonOrgApacheBeamClasses (Thread[Task worker for ':' Thread 6,5,main]) completed. Took 0.033 secs.
:beam-vendor-sdks-java-extensions-protobuf:check (Thread[Task worker for ':' Thread 6,5,main]) started.

> Task :beam-vendor-sdks-java-extensions-protobuf:check
Skipping task ':beam-vendor-sdks-java-extensions-protobuf:check' as it has no actions.
:beam-vendor-sdks-java-extensions-protobuf:check (Thread[Task worker for ':' Thread 6,5,main]) completed. Took 0.0 secs.
:beam-vendor-sdks-java-extensions-protobuf:build (Thread[Task worker for ':' Thread 6,5,main]) started.

> Task :beam-vendor-sdks-java-extensions-protobuf:build
Skipping task ':beam-vendor-sdks-java-extensions-protobuf:build' as it has no actions.
:beam-vendor-sdks-java-extensions-protobuf:build (Thread[Task worker for ':' Thread 6,5,main]) completed. Took 0.0 secs.
:beam-website:assemble (Thread[Task worker for ':' Thread 6,5,main]) started.

> Task :beam-website:assemble UP-TO-DATE
Skipping task ':beam-website:assemble' as it has no actions.
:beam-website:assemble (Thread[Task worker for ':' Thread 6,5,main]) completed. Took 0.0 secs.
:beam-website:setupBuildDir (Thread[Task worker for ':' Thread 6,5,main]) started.

> Task :beam-website:setupBuildDir
Build cache key for task ':beam-website:setupBuildDir' is 7afd3bd0c1a9269d50131165bb8a63a1
Caching disabled for task ':beam-website:setupBuildDir': Caching has not been enabled for the task
Task ':beam-website:setupBuildDir' is not up-to-date because:
  No history is available.
:beam-website:setupBuildDir (Thread[Task worker for ':' Thread 6,5,main]) completed. Took 0.004 secs.
:beam-website:buildDockerImage (Thread[Task worker for ':' Thread 6,5,main]) started.

> Task :beam-website:buildDockerImage
Caching disabled for task ':beam-website:buildDockerImage': Caching has not been enabled for the task
Task ':beam-website:buildDockerImage' is not up-to-date because:
  Task has not declared any outputs despite executing actions.
Starting process 'command 'docker''. Working directory: <https://builds.apache.org/job/beam_Release_Gradle_NightlySnapshot/ws/src/website> Command: docker build -t beam-website .
Successfully started process 'command 'docker''
Sending build context to Docker daemon  24.51MB
Step 1/7 : FROM ruby:2.5
 ---> 88666731c3e1
Step 2/7 : WORKDIR /ruby
 ---> Using cache
 ---> 9b7353f27cb5
Step 3/7 : RUN gem install bundler
 ---> Using cache
 ---> cd46d9b7ccbe
Step 4/7 : ADD Gemfile Gemfile.lock /ruby/
 ---> Using cache
 ---> d50c22e097f2
Step 5/7 : RUN bundle install --deployment --path $GEM_HOME
 ---> Using cache
 ---> e8881d09b465
Step 6/7 : ENV LC_ALL C.UTF-8
 ---> Using cache
 ---> 3787b82c937d
Step 7/7 : CMD sleep 3600
 ---> Using cache
 ---> 1608418b66da
Successfully built 1608418b66da
Successfully tagged beam-website:latest
:beam-website:buildDockerImage (Thread[Task worker for ':' Thread 6,5,main]) completed. Took 0.261 secs.
:beam-website:createDockerContainer (Thread[Task worker for ':' Thread 6,5,main]) started.

> Task :beam-website:createDockerContainer
Caching disabled for task ':beam-website:createDockerContainer': Caching has not been enabled for the task
Task ':beam-website:createDockerContainer' is not up-to-date because:
  Task has not declared any outputs despite executing actions.
Starting process 'command '/bin/bash''. Working directory: <https://builds.apache.org/job/beam_Release_Gradle_NightlySnapshot/ws/src/website> Command: /bin/bash -c docker create -v <https://builds.apache.org/job/beam_Release_Gradle_NightlySnapshot/ws/src>:/repo -u $(id -u):$(id -g) beam-website
Successfully started process 'command '/bin/bash''
:beam-website:createDockerContainer (Thread[Task worker for ':' Thread 6,5,main]) completed. Took 2.407 secs.
:beam-website:startDockerContainer (Thread[Task worker for ':' Thread 6,5,main]) started.

> Task :beam-website:startDockerContainer
Caching disabled for task ':beam-website:startDockerContainer': Caching has not been enabled for the task
Task ':beam-website:startDockerContainer' is not up-to-date because:
  Task has not declared any outputs despite executing actions.
Starting process 'command 'docker''. Working directory: <https://builds.apache.org/job/beam_Release_Gradle_NightlySnapshot/ws/src/website> Command: docker start de4bb3a76f33471451d840f747f41d25795909378710f74b734466fb70a36e4a
Successfully started process 'command 'docker''
de4bb3a76f33471451d840f747f41d25795909378710f74b734466fb70a36e4a
:beam-website:startDockerContainer (Thread[Task worker for ':' Thread 6,5,main]) completed. Took 0.304 secs.
:beam-website:buildWebsite (Thread[Task worker for ':' Thread 6,5,main]) started.

> Task :beam-website:buildWebsite
Build cache key for task ':beam-website:buildWebsite' is 7b7cbe41131e1c071e53d059fb04ef52
Caching disabled for task ':beam-website:buildWebsite': Caching has not been enabled for the task
Task ':beam-website:buildWebsite' is not up-to-date because:
  No history is available.
Starting process 'command 'docker''. Working directory: <https://builds.apache.org/job/beam_Release_Gradle_NightlySnapshot/ws/src/website> Command: docker exec de4bb3a76f33471451d840f747f41d25795909378710f74b734466fb70a36e4a /bin/bash -c cd /repo/build/website &&       bundle exec jekyll build       --config /repo/website/_config.yml       --incremental       --source /repo/website/src
      
Successfully started process 'command 'docker''
`/` is not writable.
Bundler will use `/tmp/bundler/home/unknown' as your home directory temporarily.
Configuration file: /repo/website/_config.yml
            Source: /repo/website/src
       Destination: content
 Incremental build: enabled
      Generating... 
                    done in 11.396 seconds.
 Auto-regeneration: disabled. Use --watch to enable.
:beam-website:buildWebsite (Thread[Task worker for ':' Thread 6,5,main]) completed. Took 12.888 secs.
:beam-website:testWebsite (Thread[Task worker for ':' Thread 6,5,main]) started.

> Task :beam-website:testWebsite
Caching disabled for task ':beam-website:testWebsite': Caching has not been enabled for the task
Task ':beam-website:testWebsite' is not up-to-date because:
  Task has not declared any outputs despite executing actions.
Starting process 'command 'docker''. Working directory: <https://builds.apache.org/job/beam_Release_Gradle_NightlySnapshot/ws/src/website> Command: docker exec de4bb3a76f33471451d840f747f41d25795909378710f74b734466fb70a36e4a /bin/bash -c cd /repo/build/website &&       bundle exec rake test
Successfully started process 'command 'docker''
`/` is not writable.
Bundler will use `/tmp/bundler/home/unknown' as your home directory temporarily.
Running ["ScriptCheck", "ImageCheck", "HtmlCheck", "LinkCheck"] on ["./content"] on *.html... 


Checking 566 external links...
Ran on 135 files!


- ./content/contribute/release-guide/index.html
  *  External link https://github.com/apache/beam/blob/master/runners/google-cloud-dataflow-java/pom.xml failed: 404 No error
- ./content/get-started/downloads/index.html
  *  External link https://dist.apache.org/repos/dist/release/beam/2.5.0/apache-beam-2.5.0-source-release.zip failed: 404 No error
  *  External link https://dist.apache.org/repos/dist/release/beam/2.5.0/apache-beam-2.5.0-source-release.zip.asc failed: 404 No error
  *  External link https://dist.apache.org/repos/dist/release/beam/2.5.0/apache-beam-2.5.0-source-release.zip.sha512 failed: 404 No error
rake aborted!
HTML-Proofer found 4 failures!
/usr/local/bundle/ruby/2.5.0/gems/html-proofer-3.8.0/lib/html-proofer/runner.rb:167:in `print_failed_tests'
/usr/local/bundle/ruby/2.5.0/gems/html-proofer-3.8.0/lib/html-proofer/runner.rb:48:in `run'
/repo/build/website/Rakefile:23:in `block in <top (required)>'
/usr/local/bundle/ruby/2.5.0/gems/rake-12.3.0/exe/rake:27:in `<top (required)>'
/usr/local/bundle/bin/bundle:23:in `load'
/usr/local/bundle/bin/bundle:23:in `<main>'
Tasks: TOP => test
(See full trace by running task with --trace)

> Task :beam-website:testWebsite FAILED
:beam-website:testWebsite (Thread[Task worker for ':' Thread 6,5,main]) completed. Took 23.125 secs.
:beam-website:stopAndRemoveDockerContainer (Thread[Task worker for ':' Thread 6,5,main]) started.

> Task :beam-website:stopAndRemoveDockerContainer
Caching disabled for task ':beam-website:stopAndRemoveDockerContainer': Caching has not been enabled for the task
Task ':beam-website:stopAndRemoveDockerContainer' is not up-to-date because:
  Task has not declared any outputs despite executing actions.
Starting process 'command 'docker''. Working directory: <https://builds.apache.org/job/beam_Release_Gradle_NightlySnapshot/ws/src/website> Command: docker rm -f de4bb3a76f33471451d840f747f41d25795909378710f74b734466fb70a36e4a
Successfully started process 'command 'docker''
de4bb3a76f33471451d840f747f41d25795909378710f74b734466fb70a36e4a
:beam-website:stopAndRemoveDockerContainer (Thread[Task worker for ':' Thread 6,5,main]) completed. Took 0.486 secs.
:release:compileJava (Thread[Task worker for ':' Thread 10,5,main]) started.

> Task :release:compileJava NO-SOURCE
file or directory '<https://builds.apache.org/job/beam_Release_Gradle_NightlySnapshot/ws/src/release/src/main/java',> not found
Skipping task ':release:compileJava' as it has no source files and no previous output files.
:release:compileJava (Thread[Task worker for ':' Thread 10,5,main]) completed. Took 0.003 secs.
:release:compileGroovy (Thread[Task worker for ':' Thread 10,5,main]) started.

> Task :release:compileGroovy FROM-CACHE
Build cache key for task ':release:compileGroovy' is 8963864c41ecab4c189a270fa94436aa
Task ':release:compileGroovy' is not up-to-date because:
  No history is available.
Origin for task ':release:compileGroovy': {executionTime=2052, hostName=apache-beam-jenkins-slave-group-51fn, operatingSystem=Linux, buildInvocationId=egdu4ymrovdqpefkmescupbfhu, creationTime=1533629360360, type=org.gradle.api.tasks.compile.GroovyCompile_Decorated, userName=jenkins, gradleVersion=4.8, rootPath=<https://builds.apache.org/job/beam_Release_Gradle_NightlySnapshot/ws/src,> path=:release:compileGroovy}
Unpacked output for task ':release:compileGroovy' from cache.
:release:compileGroovy (Thread[Task worker for ':' Thread 10,5,main]) completed. Took 0.295 secs.
:release:processResources (Thread[Task worker for ':' Thread 10,5,main]) started.

> Task :release:processResources NO-SOURCE
file or directory '<https://builds.apache.org/job/beam_Release_Gradle_NightlySnapshot/ws/src/release/src/main/resources',> not found
Skipping task ':release:processResources' as it has no source files and no previous output files.
:release:processResources (Thread[Task worker for ':' Thread 10,5,main]) completed. Took 0.0 secs.
:release:classes (Thread[Task worker for ':' Thread 10,5,main]) started.

> Task :release:classes UP-TO-DATE
Skipping task ':release:classes' as it has no actions.
:release:classes (Thread[Task worker for ':' Thread 10,5,main]) completed. Took 0.0 secs.
:release:jar (Thread[Task worker for ':' Thread 10,5,main]) started.

> Task :release:jar
Build cache key for task ':release:jar' is f2db96afb021a5cc9e6914be6de059db
Caching disabled for task ':release:jar': Caching has not been enabled for the task
Task ':release:jar' is not up-to-date because:
  No history is available.
:release:jar (Thread[Task worker for ':' Thread 10,5,main]) completed. Took 0.01 secs.
:release:assemble (Thread[Task worker for ':' Thread 10,5,main]) started.

> Task :release:assemble
Skipping task ':release:assemble' as it has no actions.
:release:assemble (Thread[Task worker for ':' Thread 10,5,main]) completed. Took 0.0 secs.
:release:compileTestJava (Thread[Task worker for ':' Thread 10,5,main]) started.

> Task :release:compileTestJava NO-SOURCE
file or directory '<https://builds.apache.org/job/beam_Release_Gradle_NightlySnapshot/ws/src/release/src/test/java',> not found
Skipping task ':release:compileTestJava' as it has no source files and no previous output files.
:release:compileTestJava (Thread[Task worker for ':' Thread 10,5,main]) completed. Took 0.0 secs.
:release:compileTestGroovy (Thread[Task worker for ':' Thread 10,5,main]) started.

> Task :release:compileTestGroovy NO-SOURCE
file or directory '<https://builds.apache.org/job/beam_Release_Gradle_NightlySnapshot/ws/src/release/src/test/groovy',> not found
Skipping task ':release:compileTestGroovy' as it has no source files and no previous output files.
:release:compileTestGroovy (Thread[Task worker for ':' Thread 10,5,main]) completed. Took 0.0 secs.
:release:processTestResources (Thread[Task worker for ':' Thread 10,5,main]) started.

> Task :release:processTestResources NO-SOURCE
file or directory '<https://builds.apache.org/job/beam_Release_Gradle_NightlySnapshot/ws/src/release/src/test/resources',> not found
Skipping task ':release:processTestResources' as it has no source files and no previous output files.
:release:processTestResources (Thread[Task worker for ':' Thread 10,5,main]) completed. Took 0.0 secs.
:release:testClasses (Thread[Task worker for ':' Thread 10,5,main]) started.

> Task :release:testClasses UP-TO-DATE
Skipping task ':release:testClasses' as it has no actions.
:release:testClasses (Thread[Task worker for ':' Thread 10,5,main]) completed. Took 0.0 secs.
:release:test (Thread[Task worker for ':' Thread 10,5,main]) started.

> Task :release:test NO-SOURCE
Skipping task ':release:test' as it has no source files and no previous output files.
:release:test (Thread[Task worker for ':' Thread 10,5,main]) completed. Took 0.001 secs.
:release:check (Thread[Task worker for ':' Thread 10,5,main]) started.

> Task :release:check UP-TO-DATE
Skipping task ':release:check' as it has no actions.
:release:check (Thread[Task worker for ':' Thread 10,5,main]) completed. Took 0.0 secs.
:release:build (Thread[Task worker for ':' Thread 10,5,main]) started.

> Task :release:build
Skipping task ':release:build' as it has no actions.
:release:build (Thread[Task worker for ':' Thread 10,5,main]) completed. Took 0.0 secs.

FAILURE: Build failed with an exception.

* What went wrong:
Execution failed for task ':beam-website:testWebsite'.
> Process 'command 'docker'' finished with non-zero exit value 1

* Try:
Run with --stacktrace option to get the stack trace. Run with --debug option to get more log output. Run with --scan to get full insights.

* Get more help at https://help.gradle.org

Deprecated Gradle features were used in this build, making it incompatible with Gradle 5.0.
See https://docs.gradle.org/4.8/userguide/command_line_interface.html#sec:command_line_warnings

BUILD FAILED in 1h 4m 34s
821 actionable tasks: 813 executed, 8 from cache

Publishing build scan...
https://gradle.com/s/xavvfxqwa4ass

Build step 'Invoke Gradle script' changed build result to FAILURE
Build step 'Invoke Gradle script' marked build as failure

Jenkins build is back to normal : beam_Release_Gradle_NightlySnapshot #169

Posted by Apache Jenkins Server <je...@builds.apache.org>.
See <https://builds.apache.org/job/beam_Release_Gradle_NightlySnapshot/169/display/redirect>


Build failed in Jenkins: beam_Release_Gradle_NightlySnapshot #168

Posted by Apache Jenkins Server <je...@builds.apache.org>.
See <https://builds.apache.org/job/beam_Release_Gradle_NightlySnapshot/168/display/redirect?page=changes>

Changes:

[robertwb] Update container versions of NumPy and TensorFlow.

[lcwik] [BEAM-5149] Add support for the Java SDK harness to merge windows.

[lcwik] Address PR comments.

[lcwik] [BEAM-5351] Fix missing pom.xml file in artifact jar.

[robbe.sneyders] remove sys.exc_clear()

------------------------------------------
[...truncated 17.84 MB...]
Skipping task ':beam-vendor-sdks-java-extensions-protobuf:test' as it has no source files and no previous output files.
:beam-vendor-sdks-java-extensions-protobuf:test (Thread[Task worker for ':' Thread 3,5,main]) completed. Took 0.0 secs.
:beam-vendor-sdks-java-extensions-protobuf:validateShadedJarDoesntLeakNonOrgApacheBeamClasses (Thread[Task worker for ':' Thread 3,5,main]) started.

> Task :beam-vendor-sdks-java-extensions-protobuf:validateShadedJarDoesntLeakNonOrgApacheBeamClasses
Caching disabled for task ':beam-vendor-sdks-java-extensions-protobuf:validateShadedJarDoesntLeakNonOrgApacheBeamClasses': Caching has not been enabled for the task
Task ':beam-vendor-sdks-java-extensions-protobuf:validateShadedJarDoesntLeakNonOrgApacheBeamClasses' is not up-to-date because:
  Task has not declared any outputs despite executing actions.
:beam-vendor-sdks-java-extensions-protobuf:validateShadedJarDoesntLeakNonOrgApacheBeamClasses (Thread[Task worker for ':' Thread 3,5,main]) completed. Took 0.033 secs.
:beam-vendor-sdks-java-extensions-protobuf:check (Thread[Task worker for ':' Thread 3,5,main]) started.

> Task :beam-vendor-sdks-java-extensions-protobuf:check
Skipping task ':beam-vendor-sdks-java-extensions-protobuf:check' as it has no actions.
:beam-vendor-sdks-java-extensions-protobuf:check (Thread[Task worker for ':' Thread 3,5,main]) completed. Took 0.0 secs.
:beam-vendor-sdks-java-extensions-protobuf:build (Thread[Task worker for ':' Thread 3,5,main]) started.

> Task :beam-vendor-sdks-java-extensions-protobuf:build
Skipping task ':beam-vendor-sdks-java-extensions-protobuf:build' as it has no actions.
:beam-vendor-sdks-java-extensions-protobuf:build (Thread[Task worker for ':' Thread 3,5,main]) completed. Took 0.0 secs.
:beam-website:assemble (Thread[Task worker for ':' Thread 3,5,main]) started.

> Task :beam-website:assemble UP-TO-DATE
Skipping task ':beam-website:assemble' as it has no actions.
:beam-website:assemble (Thread[Task worker for ':' Thread 3,5,main]) completed. Took 0.0 secs.
:beam-website:setupBuildDir (Thread[Task worker for ':' Thread 3,5,main]) started.

> Task :beam-website:setupBuildDir
Build cache key for task ':beam-website:setupBuildDir' is 7afd3bd0c1a9269d50131165bb8a63a1
Caching disabled for task ':beam-website:setupBuildDir': Caching has not been enabled for the task
Task ':beam-website:setupBuildDir' is not up-to-date because:
  No history is available.
:beam-website:setupBuildDir (Thread[Task worker for ':' Thread 3,5,main]) completed. Took 0.004 secs.
:beam-website:buildDockerImage (Thread[Task worker for ':' Thread 3,5,main]) started.

> Task :beam-website:buildDockerImage
Caching disabled for task ':beam-website:buildDockerImage': Caching has not been enabled for the task
Task ':beam-website:buildDockerImage' is not up-to-date because:
  Task has not declared any outputs despite executing actions.
Starting process 'command 'docker''. Working directory: <https://builds.apache.org/job/beam_Release_Gradle_NightlySnapshot/ws/src/website> Command: docker build -t beam-website .
Successfully started process 'command 'docker''
Sending build context to Docker daemon  24.51MB
Step 1/7 : FROM ruby:2.5
 ---> 88666731c3e1
Step 2/7 : WORKDIR /ruby
 ---> Using cache
 ---> 9b7353f27cb5
Step 3/7 : RUN gem install bundler
 ---> Using cache
 ---> cd46d9b7ccbe
Step 4/7 : ADD Gemfile Gemfile.lock /ruby/
 ---> Using cache
 ---> d50c22e097f2
Step 5/7 : RUN bundle install --deployment --path $GEM_HOME
 ---> Using cache
 ---> e8881d09b465
Step 6/7 : ENV LC_ALL C.UTF-8
 ---> Using cache
 ---> 3787b82c937d
Step 7/7 : CMD sleep 3600
 ---> Using cache
 ---> 1608418b66da
Successfully built 1608418b66da
Successfully tagged beam-website:latest
:beam-website:buildDockerImage (Thread[Task worker for ':' Thread 3,5,main]) completed. Took 0.273 secs.
:beam-website:createDockerContainer (Thread[Task worker for ':' Thread 3,5,main]) started.

> Task :beam-website:createDockerContainer
Caching disabled for task ':beam-website:createDockerContainer': Caching has not been enabled for the task
Task ':beam-website:createDockerContainer' is not up-to-date because:
  Task has not declared any outputs despite executing actions.
Starting process 'command '/bin/bash''. Working directory: <https://builds.apache.org/job/beam_Release_Gradle_NightlySnapshot/ws/src/website> Command: /bin/bash -c docker create -v <https://builds.apache.org/job/beam_Release_Gradle_NightlySnapshot/ws/src>:/repo -u $(id -u):$(id -g) beam-website
Successfully started process 'command '/bin/bash''
:beam-website:createDockerContainer (Thread[Task worker for ':' Thread 3,5,main]) completed. Took 2.207 secs.
:beam-website:startDockerContainer (Thread[Task worker for ':' Thread 3,5,main]) started.

> Task :beam-website:startDockerContainer
Caching disabled for task ':beam-website:startDockerContainer': Caching has not been enabled for the task
Task ':beam-website:startDockerContainer' is not up-to-date because:
  Task has not declared any outputs despite executing actions.
Starting process 'command 'docker''. Working directory: <https://builds.apache.org/job/beam_Release_Gradle_NightlySnapshot/ws/src/website> Command: docker start a66d2eaf073c40051d61c1c668d5d32e37d379465e2dd52d3631da41e828ac52
Successfully started process 'command 'docker''
a66d2eaf073c40051d61c1c668d5d32e37d379465e2dd52d3631da41e828ac52
:beam-website:startDockerContainer (Thread[Task worker for ':' Thread 3,5,main]) completed. Took 0.315 secs.
:beam-website:buildWebsite (Thread[Task worker for ':' Thread 3,5,main]) started.

> Task :beam-website:buildWebsite
Build cache key for task ':beam-website:buildWebsite' is bfe023ae576da8c5afadccc06dea5f95
Caching disabled for task ':beam-website:buildWebsite': Caching has not been enabled for the task
Task ':beam-website:buildWebsite' is not up-to-date because:
  No history is available.
Starting process 'command 'docker''. Working directory: <https://builds.apache.org/job/beam_Release_Gradle_NightlySnapshot/ws/src/website> Command: docker exec a66d2eaf073c40051d61c1c668d5d32e37d379465e2dd52d3631da41e828ac52 /bin/bash -c cd /repo/build/website &&       bundle exec jekyll build       --config /repo/website/_config.yml       --incremental       --source /repo/website/src
      
Successfully started process 'command 'docker''
`/` is not writable.
Bundler will use `/tmp/bundler/home/unknown' as your home directory temporarily.
Configuration file: /repo/website/_config.yml
            Source: /repo/website/src
       Destination: content
 Incremental build: enabled
      Generating... 
                    done in 11.454 seconds.
 Auto-regeneration: disabled. Use --watch to enable.
:beam-website:buildWebsite (Thread[Task worker for ':' Thread 3,5,main]) completed. Took 12.776 secs.
:beam-website:testWebsite (Thread[Task worker for ':' Thread 3,5,main]) started.

> Task :beam-website:testWebsite
Caching disabled for task ':beam-website:testWebsite': Caching has not been enabled for the task
Task ':beam-website:testWebsite' is not up-to-date because:
  Task has not declared any outputs despite executing actions.
Starting process 'command 'docker''. Working directory: <https://builds.apache.org/job/beam_Release_Gradle_NightlySnapshot/ws/src/website> Command: docker exec a66d2eaf073c40051d61c1c668d5d32e37d379465e2dd52d3631da41e828ac52 /bin/bash -c cd /repo/build/website &&       bundle exec rake test
Successfully started process 'command 'docker''
`/` is not writable.
Bundler will use `/tmp/bundler/home/unknown' as your home directory temporarily.
Running ["LinkCheck", "HtmlCheck", "ImageCheck", "ScriptCheck"] on ["./content"] on *.html... 


Checking 566 external links...
Ran on 135 files!


- ./content/contribute/release-guide/index.html
  *  External link https://github.com/apache/beam/blob/master/runners/google-cloud-dataflow-java/pom.xml failed: 404 No error
- ./content/get-started/downloads/index.html
  *  External link https://dist.apache.org/repos/dist/release/beam/2.5.0/apache-beam-2.5.0-source-release.zip failed: 404 No error
  *  External link https://dist.apache.org/repos/dist/release/beam/2.5.0/apache-beam-2.5.0-source-release.zip.asc failed: 404 No error
  *  External link https://dist.apache.org/repos/dist/release/beam/2.5.0/apache-beam-2.5.0-source-release.zip.sha512 failed: 404 No error
rake aborted!
HTML-Proofer found 4 failures!
/usr/local/bundle/ruby/2.5.0/gems/html-proofer-3.8.0/lib/html-proofer/runner.rb:167:in `print_failed_tests'
/usr/local/bundle/ruby/2.5.0/gems/html-proofer-3.8.0/lib/html-proofer/runner.rb:48:in `run'
/repo/build/website/Rakefile:23:in `block in <top (required)>'
/usr/local/bundle/ruby/2.5.0/gems/rake-12.3.0/exe/rake:27:in `<top (required)>'
/usr/local/bundle/bin/bundle:23:in `load'
/usr/local/bundle/bin/bundle:23:in `<main>'
Tasks: TOP => test
(See full trace by running task with --trace)

> Task :beam-website:testWebsite FAILED
:beam-website:testWebsite (Thread[Task worker for ':' Thread 3,5,main]) completed. Took 35.103 secs.
:beam-website:stopAndRemoveDockerContainer (Thread[Task worker for ':' Thread 3,5,main]) started.

> Task :beam-website:stopAndRemoveDockerContainer
Caching disabled for task ':beam-website:stopAndRemoveDockerContainer': Caching has not been enabled for the task
Task ':beam-website:stopAndRemoveDockerContainer' is not up-to-date because:
  Task has not declared any outputs despite executing actions.
Starting process 'command 'docker''. Working directory: <https://builds.apache.org/job/beam_Release_Gradle_NightlySnapshot/ws/src/website> Command: docker rm -f a66d2eaf073c40051d61c1c668d5d32e37d379465e2dd52d3631da41e828ac52
Successfully started process 'command 'docker''
a66d2eaf073c40051d61c1c668d5d32e37d379465e2dd52d3631da41e828ac52
:beam-website:stopAndRemoveDockerContainer (Thread[Task worker for ':' Thread 3,5,main]) completed. Took 0.382 secs.
:release:compileJava (Thread[Daemon worker,5,main]) started.

> Task :release:compileJava NO-SOURCE
file or directory '<https://builds.apache.org/job/beam_Release_Gradle_NightlySnapshot/ws/src/release/src/main/java',> not found
Skipping task ':release:compileJava' as it has no source files and no previous output files.
:release:compileJava (Thread[Daemon worker,5,main]) completed. Took 0.001 secs.
:release:compileGroovy (Thread[Daemon worker,5,main]) started.

> Task :release:compileGroovy FROM-CACHE
Build cache key for task ':release:compileGroovy' is 8963864c41ecab4c189a270fa94436aa
Task ':release:compileGroovy' is not up-to-date because:
  No history is available.
Origin for task ':release:compileGroovy': {executionTime=2052, hostName=apache-beam-jenkins-slave-group-51fn, operatingSystem=Linux, buildInvocationId=egdu4ymrovdqpefkmescupbfhu, creationTime=1533629360360, type=org.gradle.api.tasks.compile.GroovyCompile_Decorated, userName=jenkins, gradleVersion=4.8, rootPath=<https://builds.apache.org/job/beam_Release_Gradle_NightlySnapshot/ws/src,> path=:release:compileGroovy}
Unpacked output for task ':release:compileGroovy' from cache.
:release:compileGroovy (Thread[Daemon worker,5,main]) completed. Took 0.266 secs.
:release:processResources (Thread[Daemon worker,5,main]) started.

> Task :release:processResources NO-SOURCE
file or directory '<https://builds.apache.org/job/beam_Release_Gradle_NightlySnapshot/ws/src/release/src/main/resources',> not found
Skipping task ':release:processResources' as it has no source files and no previous output files.
:release:processResources (Thread[Daemon worker,5,main]) completed. Took 0.0 secs.
:release:classes (Thread[Daemon worker,5,main]) started.

> Task :release:classes UP-TO-DATE
Skipping task ':release:classes' as it has no actions.
:release:classes (Thread[Daemon worker,5,main]) completed. Took 0.0 secs.
:release:jar (Thread[Daemon worker,5,main]) started.

> Task :release:jar
Build cache key for task ':release:jar' is f2db96afb021a5cc9e6914be6de059db
Caching disabled for task ':release:jar': Caching has not been enabled for the task
Task ':release:jar' is not up-to-date because:
  No history is available.
:release:jar (Thread[Daemon worker,5,main]) completed. Took 0.008 secs.
:release:assemble (Thread[Daemon worker,5,main]) started.

> Task :release:assemble
Skipping task ':release:assemble' as it has no actions.
:release:assemble (Thread[Daemon worker,5,main]) completed. Took 0.001 secs.
:release:compileTestJava (Thread[Daemon worker,5,main]) started.

> Task :release:compileTestJava NO-SOURCE
file or directory '<https://builds.apache.org/job/beam_Release_Gradle_NightlySnapshot/ws/src/release/src/test/java',> not found
Skipping task ':release:compileTestJava' as it has no source files and no previous output files.
:release:compileTestJava (Thread[Daemon worker,5,main]) completed. Took 0.0 secs.
:release:compileTestGroovy (Thread[Daemon worker,5,main]) started.

> Task :release:compileTestGroovy NO-SOURCE
file or directory '<https://builds.apache.org/job/beam_Release_Gradle_NightlySnapshot/ws/src/release/src/test/groovy',> not found
Skipping task ':release:compileTestGroovy' as it has no source files and no previous output files.
:release:compileTestGroovy (Thread[Daemon worker,5,main]) completed. Took 0.0 secs.
:release:processTestResources (Thread[Daemon worker,5,main]) started.

> Task :release:processTestResources NO-SOURCE
file or directory '<https://builds.apache.org/job/beam_Release_Gradle_NightlySnapshot/ws/src/release/src/test/resources',> not found
Skipping task ':release:processTestResources' as it has no source files and no previous output files.
:release:processTestResources (Thread[Daemon worker,5,main]) completed. Took 0.0 secs.
:release:testClasses (Thread[Daemon worker,5,main]) started.

> Task :release:testClasses UP-TO-DATE
Skipping task ':release:testClasses' as it has no actions.
:release:testClasses (Thread[Daemon worker,5,main]) completed. Took 0.0 secs.
:release:test (Thread[Task worker for ':' Thread 6,5,main]) started.

> Task :release:test NO-SOURCE
Skipping task ':release:test' as it has no source files and no previous output files.
:release:test (Thread[Task worker for ':' Thread 6,5,main]) completed. Took 0.001 secs.
:release:check (Thread[Task worker for ':' Thread 6,5,main]) started.

> Task :release:check UP-TO-DATE
Skipping task ':release:check' as it has no actions.
:release:check (Thread[Task worker for ':' Thread 6,5,main]) completed. Took 0.0 secs.
:release:build (Thread[Task worker for ':' Thread 4,5,main]) started.

> Task :release:build
Skipping task ':release:build' as it has no actions.
:release:build (Thread[Task worker for ':' Thread 4,5,main]) completed. Took 0.0 secs.

FAILURE: Build failed with an exception.

* What went wrong:
Execution failed for task ':beam-website:testWebsite'.
> Process 'command 'docker'' finished with non-zero exit value 1

* Try:
Run with --stacktrace option to get the stack trace. Run with --debug option to get more log output. Run with --scan to get full insights.

* Get more help at https://help.gradle.org

Deprecated Gradle features were used in this build, making it incompatible with Gradle 5.0.
See https://docs.gradle.org/4.8/userguide/command_line_interface.html#sec:command_line_warnings

BUILD FAILED in 1h 0m 9s
821 actionable tasks: 814 executed, 7 from cache

Publishing build scan...
https://gradle.com/s/egjfbx7g262uu

Build step 'Invoke Gradle script' changed build result to FAILURE
Build step 'Invoke Gradle script' marked build as failure

Build failed in Jenkins: beam_Release_Gradle_NightlySnapshot #167

Posted by Apache Jenkins Server <je...@builds.apache.org>.
See <https://builds.apache.org/job/beam_Release_Gradle_NightlySnapshot/167/display/redirect>

------------------------------------------
[...truncated 18.59 MB...]
Skipping task ':beam-vendor-sdks-java-extensions-protobuf:test' as it has no source files and no previous output files.
:beam-vendor-sdks-java-extensions-protobuf:test (Thread[Task worker for ':',5,main]) completed. Took 0.0 secs.
:beam-vendor-sdks-java-extensions-protobuf:validateShadedJarDoesntLeakNonOrgApacheBeamClasses (Thread[Task worker for ':',5,main]) started.

> Task :beam-vendor-sdks-java-extensions-protobuf:validateShadedJarDoesntLeakNonOrgApacheBeamClasses
Caching disabled for task ':beam-vendor-sdks-java-extensions-protobuf:validateShadedJarDoesntLeakNonOrgApacheBeamClasses': Caching has not been enabled for the task
Task ':beam-vendor-sdks-java-extensions-protobuf:validateShadedJarDoesntLeakNonOrgApacheBeamClasses' is not up-to-date because:
  Task has not declared any outputs despite executing actions.
:beam-vendor-sdks-java-extensions-protobuf:validateShadedJarDoesntLeakNonOrgApacheBeamClasses (Thread[Task worker for ':',5,main]) completed. Took 0.032 secs.
:beam-vendor-sdks-java-extensions-protobuf:check (Thread[Task worker for ':',5,main]) started.

> Task :beam-vendor-sdks-java-extensions-protobuf:check
Skipping task ':beam-vendor-sdks-java-extensions-protobuf:check' as it has no actions.
:beam-vendor-sdks-java-extensions-protobuf:check (Thread[Task worker for ':',5,main]) completed. Took 0.0 secs.
:beam-vendor-sdks-java-extensions-protobuf:build (Thread[Task worker for ':',5,main]) started.

> Task :beam-vendor-sdks-java-extensions-protobuf:build
Skipping task ':beam-vendor-sdks-java-extensions-protobuf:build' as it has no actions.
:beam-vendor-sdks-java-extensions-protobuf:build (Thread[Task worker for ':',5,main]) completed. Took 0.0 secs.
:beam-website:assemble (Thread[Task worker for ':',5,main]) started.

> Task :beam-website:assemble UP-TO-DATE
Skipping task ':beam-website:assemble' as it has no actions.
:beam-website:assemble (Thread[Task worker for ':',5,main]) completed. Took 0.0 secs.
:beam-website:setupBuildDir (Thread[Task worker for ':',5,main]) started.

> Task :beam-website:setupBuildDir
Build cache key for task ':beam-website:setupBuildDir' is 7afd3bd0c1a9269d50131165bb8a63a1
Caching disabled for task ':beam-website:setupBuildDir': Caching has not been enabled for the task
Task ':beam-website:setupBuildDir' is not up-to-date because:
  No history is available.
:beam-website:setupBuildDir (Thread[Task worker for ':',5,main]) completed. Took 0.003 secs.
:beam-website:buildDockerImage (Thread[Task worker for ':',5,main]) started.

> Task :beam-website:buildDockerImage
Caching disabled for task ':beam-website:buildDockerImage': Caching has not been enabled for the task
Task ':beam-website:buildDockerImage' is not up-to-date because:
  Task has not declared any outputs despite executing actions.
Starting process 'command 'docker''. Working directory: <https://builds.apache.org/job/beam_Release_Gradle_NightlySnapshot/ws/src/website> Command: docker build -t beam-website .
Successfully started process 'command 'docker''
Sending build context to Docker daemon  24.51MB
Step 1/7 : FROM ruby:2.5
 ---> 88666731c3e1
Step 2/7 : WORKDIR /ruby
 ---> Using cache
 ---> 9b7353f27cb5
Step 3/7 : RUN gem install bundler
 ---> Using cache
 ---> cd46d9b7ccbe
Step 4/7 : ADD Gemfile Gemfile.lock /ruby/
 ---> Using cache
 ---> d50c22e097f2
Step 5/7 : RUN bundle install --deployment --path $GEM_HOME
 ---> Using cache
 ---> e8881d09b465
Step 6/7 : ENV LC_ALL C.UTF-8
 ---> Using cache
 ---> 3787b82c937d
Step 7/7 : CMD sleep 3600
 ---> Using cache
 ---> 1608418b66da
Successfully built 1608418b66da
Successfully tagged beam-website:latest
:beam-website:buildDockerImage (Thread[Task worker for ':',5,main]) completed. Took 0.22 secs.
:beam-website:createDockerContainer (Thread[Task worker for ':',5,main]) started.

> Task :beam-website:createDockerContainer
Caching disabled for task ':beam-website:createDockerContainer': Caching has not been enabled for the task
Task ':beam-website:createDockerContainer' is not up-to-date because:
  Task has not declared any outputs despite executing actions.
Starting process 'command '/bin/bash''. Working directory: <https://builds.apache.org/job/beam_Release_Gradle_NightlySnapshot/ws/src/website> Command: /bin/bash -c docker create -v <https://builds.apache.org/job/beam_Release_Gradle_NightlySnapshot/ws/src>:/repo -u $(id -u):$(id -g) beam-website
Successfully started process 'command '/bin/bash''
:beam-website:createDockerContainer (Thread[Task worker for ':',5,main]) completed. Took 2.381 secs.
:beam-website:startDockerContainer (Thread[Task worker for ':',5,main]) started.

> Task :beam-website:startDockerContainer
Caching disabled for task ':beam-website:startDockerContainer': Caching has not been enabled for the task
Task ':beam-website:startDockerContainer' is not up-to-date because:
  Task has not declared any outputs despite executing actions.
Starting process 'command 'docker''. Working directory: <https://builds.apache.org/job/beam_Release_Gradle_NightlySnapshot/ws/src/website> Command: docker start 63120cdad0099f2ac6e076b7a13a672b154a720c70c06750f7f5e015d8a48447
Successfully started process 'command 'docker''
63120cdad0099f2ac6e076b7a13a672b154a720c70c06750f7f5e015d8a48447
:beam-website:startDockerContainer (Thread[Task worker for ':',5,main]) completed. Took 0.271 secs.
:beam-website:buildWebsite (Thread[Task worker for ':',5,main]) started.

> Task :beam-website:buildWebsite
Build cache key for task ':beam-website:buildWebsite' is fea9453a9b5bcdd06cbc5a2e31125e7f
Caching disabled for task ':beam-website:buildWebsite': Caching has not been enabled for the task
Task ':beam-website:buildWebsite' is not up-to-date because:
  No history is available.
Starting process 'command 'docker''. Working directory: <https://builds.apache.org/job/beam_Release_Gradle_NightlySnapshot/ws/src/website> Command: docker exec 63120cdad0099f2ac6e076b7a13a672b154a720c70c06750f7f5e015d8a48447 /bin/bash -c cd /repo/build/website &&       bundle exec jekyll build       --config /repo/website/_config.yml       --incremental       --source /repo/website/src
      
Successfully started process 'command 'docker''
`/` is not writable.
Bundler will use `/tmp/bundler/home/unknown' as your home directory temporarily.
Configuration file: /repo/website/_config.yml
            Source: /repo/website/src
       Destination: content
 Incremental build: enabled
      Generating... 
                    done in 10.911 seconds.
 Auto-regeneration: disabled. Use --watch to enable.
:beam-website:buildWebsite (Thread[Task worker for ':',5,main]) completed. Took 12.206 secs.
:beam-website:testWebsite (Thread[Task worker for ':',5,main]) started.

> Task :beam-website:testWebsite
Caching disabled for task ':beam-website:testWebsite': Caching has not been enabled for the task
Task ':beam-website:testWebsite' is not up-to-date because:
  Task has not declared any outputs despite executing actions.
Starting process 'command 'docker''. Working directory: <https://builds.apache.org/job/beam_Release_Gradle_NightlySnapshot/ws/src/website> Command: docker exec 63120cdad0099f2ac6e076b7a13a672b154a720c70c06750f7f5e015d8a48447 /bin/bash -c cd /repo/build/website &&       bundle exec rake test
Successfully started process 'command 'docker''
`/` is not writable.
Bundler will use `/tmp/bundler/home/unknown' as your home directory temporarily.
Running ["LinkCheck", "HtmlCheck", "ImageCheck", "ScriptCheck"] on ["./content"] on *.html... 


Checking 566 external links...
Ran on 135 files!


- ./content/contribute/release-guide/index.html
  *  External link https://github.com/apache/beam/blob/master/runners/google-cloud-dataflow-java/pom.xml failed: 404 No error
- ./content/get-started/downloads/index.html
  *  External link https://dist.apache.org/repos/dist/release/beam/2.5.0/apache-beam-2.5.0-source-release.zip failed: 404 No error
  *  External link https://dist.apache.org/repos/dist/release/beam/2.5.0/apache-beam-2.5.0-source-release.zip.asc failed: 404 No error
  *  External link https://dist.apache.org/repos/dist/release/beam/2.5.0/apache-beam-2.5.0-source-release.zip.sha512 failed: 404 No error
rake aborted!
HTML-Proofer found 4 failures!
/usr/local/bundle/ruby/2.5.0/gems/html-proofer-3.8.0/lib/html-proofer/runner.rb:167:in `print_failed_tests'
/usr/local/bundle/ruby/2.5.0/gems/html-proofer-3.8.0/lib/html-proofer/runner.rb:48:in `run'
/repo/build/website/Rakefile:23:in `block in <top (required)>'
/usr/local/bundle/ruby/2.5.0/gems/rake-12.3.0/exe/rake:27:in `<top (required)>'
/usr/local/bundle/bin/bundle:23:in `load'
/usr/local/bundle/bin/bundle:23:in `<main>'
Tasks: TOP => test
(See full trace by running task with --trace)

> Task :beam-website:testWebsite FAILED
:beam-website:testWebsite (Thread[Task worker for ':',5,main]) completed. Took 45.604 secs.
:beam-website:stopAndRemoveDockerContainer (Thread[Task worker for ':',5,main]) started.

> Task :beam-website:stopAndRemoveDockerContainer
Caching disabled for task ':beam-website:stopAndRemoveDockerContainer': Caching has not been enabled for the task
Task ':beam-website:stopAndRemoveDockerContainer' is not up-to-date because:
  Task has not declared any outputs despite executing actions.
Starting process 'command 'docker''. Working directory: <https://builds.apache.org/job/beam_Release_Gradle_NightlySnapshot/ws/src/website> Command: docker rm -f 63120cdad0099f2ac6e076b7a13a672b154a720c70c06750f7f5e015d8a48447
Successfully started process 'command 'docker''
63120cdad0099f2ac6e076b7a13a672b154a720c70c06750f7f5e015d8a48447
:beam-website:stopAndRemoveDockerContainer (Thread[Task worker for ':',5,main]) completed. Took 0.393 secs.
:release:compileJava (Thread[Task worker for ':',5,main]) started.

> Task :release:compileJava NO-SOURCE
file or directory '<https://builds.apache.org/job/beam_Release_Gradle_NightlySnapshot/ws/src/release/src/main/java',> not found
Skipping task ':release:compileJava' as it has no source files and no previous output files.
:release:compileJava (Thread[Task worker for ':',5,main]) completed. Took 0.001 secs.
:release:compileGroovy (Thread[Task worker for ':',5,main]) started.

> Task :release:compileGroovy FROM-CACHE
Build cache key for task ':release:compileGroovy' is 8963864c41ecab4c189a270fa94436aa
Task ':release:compileGroovy' is not up-to-date because:
  No history is available.
Origin for task ':release:compileGroovy': {executionTime=2052, hostName=apache-beam-jenkins-slave-group-51fn, operatingSystem=Linux, buildInvocationId=egdu4ymrovdqpefkmescupbfhu, creationTime=1533629360360, type=org.gradle.api.tasks.compile.GroovyCompile_Decorated, userName=jenkins, gradleVersion=4.8, rootPath=<https://builds.apache.org/job/beam_Release_Gradle_NightlySnapshot/ws/src,> path=:release:compileGroovy}
Unpacked output for task ':release:compileGroovy' from cache.
:release:compileGroovy (Thread[Task worker for ':',5,main]) completed. Took 0.269 secs.
:release:processResources (Thread[Task worker for ':',5,main]) started.

> Task :release:processResources NO-SOURCE
file or directory '<https://builds.apache.org/job/beam_Release_Gradle_NightlySnapshot/ws/src/release/src/main/resources',> not found
Skipping task ':release:processResources' as it has no source files and no previous output files.
:release:processResources (Thread[Task worker for ':',5,main]) completed. Took 0.0 secs.
:release:classes (Thread[Task worker for ':',5,main]) started.

> Task :release:classes UP-TO-DATE
Skipping task ':release:classes' as it has no actions.
:release:classes (Thread[Task worker for ':',5,main]) completed. Took 0.0 secs.
:release:jar (Thread[Task worker for ':',5,main]) started.

> Task :release:jar
Build cache key for task ':release:jar' is f2db96afb021a5cc9e6914be6de059db
Caching disabled for task ':release:jar': Caching has not been enabled for the task
Task ':release:jar' is not up-to-date because:
  No history is available.
:release:jar (Thread[Task worker for ':',5,main]) completed. Took 0.008 secs.
:release:assemble (Thread[Task worker for ':',5,main]) started.

> Task :release:assemble
Skipping task ':release:assemble' as it has no actions.
:release:assemble (Thread[Task worker for ':',5,main]) completed. Took 0.0 secs.
:release:compileTestJava (Thread[Task worker for ':',5,main]) started.

> Task :release:compileTestJava NO-SOURCE
file or directory '<https://builds.apache.org/job/beam_Release_Gradle_NightlySnapshot/ws/src/release/src/test/java',> not found
Skipping task ':release:compileTestJava' as it has no source files and no previous output files.
:release:compileTestJava (Thread[Task worker for ':',5,main]) completed. Took 0.0 secs.
:release:compileTestGroovy (Thread[Task worker for ':',5,main]) started.

> Task :release:compileTestGroovy NO-SOURCE
file or directory '<https://builds.apache.org/job/beam_Release_Gradle_NightlySnapshot/ws/src/release/src/test/groovy',> not found
Skipping task ':release:compileTestGroovy' as it has no source files and no previous output files.
:release:compileTestGroovy (Thread[Task worker for ':',5,main]) completed. Took 0.0 secs.
:release:processTestResources (Thread[Task worker for ':',5,main]) started.

> Task :release:processTestResources NO-SOURCE
file or directory '<https://builds.apache.org/job/beam_Release_Gradle_NightlySnapshot/ws/src/release/src/test/resources',> not found
Skipping task ':release:processTestResources' as it has no source files and no previous output files.
:release:processTestResources (Thread[Task worker for ':',5,main]) completed. Took 0.0 secs.
:release:testClasses (Thread[Task worker for ':',5,main]) started.

> Task :release:testClasses UP-TO-DATE
Skipping task ':release:testClasses' as it has no actions.
:release:testClasses (Thread[Task worker for ':',5,main]) completed. Took 0.0 secs.
:release:test (Thread[Task worker for ':',5,main]) started.

> Task :release:test NO-SOURCE
Skipping task ':release:test' as it has no source files and no previous output files.
:release:test (Thread[Task worker for ':',5,main]) completed. Took 0.005 secs.
:release:check (Thread[Task worker for ':',5,main]) started.

> Task :release:check UP-TO-DATE
Skipping task ':release:check' as it has no actions.
:release:check (Thread[Task worker for ':',5,main]) completed. Took 0.0 secs.
:release:build (Thread[Task worker for ':' Thread 3,5,main]) started.

> Task :release:build
Skipping task ':release:build' as it has no actions.
:release:build (Thread[Task worker for ':' Thread 3,5,main]) completed. Took 0.0 secs.

FAILURE: Build failed with an exception.

* What went wrong:
Execution failed for task ':beam-website:testWebsite'.
> Process 'command 'docker'' finished with non-zero exit value 1

* Try:
Run with --stacktrace option to get the stack trace. Run with --debug option to get more log output. Run with --scan to get full insights.

* Get more help at https://help.gradle.org

Deprecated Gradle features were used in this build, making it incompatible with Gradle 5.0.
See https://docs.gradle.org/4.8/userguide/command_line_interface.html#sec:command_line_warnings

BUILD FAILED in 59m 39s
821 actionable tasks: 813 executed, 8 from cache

Publishing build scan...
https://gradle.com/s/tj3ahwvwrphd4

Build step 'Invoke Gradle script' changed build result to FAILURE
Build step 'Invoke Gradle script' marked build as failure

Build failed in Jenkins: beam_Release_Gradle_NightlySnapshot #166

Posted by Apache Jenkins Server <je...@builds.apache.org>.
See <https://builds.apache.org/job/beam_Release_Gradle_NightlySnapshot/166/display/redirect>

------------------------------------------
[...truncated 19.03 MB...]
Skipping task ':beam-vendor-sdks-java-extensions-protobuf:test' as it has no source files and no previous output files.
:beam-vendor-sdks-java-extensions-protobuf:test (Thread[Task worker for ':' Thread 5,5,main]) completed. Took 0.0 secs.
:beam-vendor-sdks-java-extensions-protobuf:validateShadedJarDoesntLeakNonOrgApacheBeamClasses (Thread[Task worker for ':' Thread 5,5,main]) started.

> Task :beam-vendor-sdks-java-extensions-protobuf:validateShadedJarDoesntLeakNonOrgApacheBeamClasses
Caching disabled for task ':beam-vendor-sdks-java-extensions-protobuf:validateShadedJarDoesntLeakNonOrgApacheBeamClasses': Caching has not been enabled for the task
Task ':beam-vendor-sdks-java-extensions-protobuf:validateShadedJarDoesntLeakNonOrgApacheBeamClasses' is not up-to-date because:
  Task has not declared any outputs despite executing actions.
:beam-vendor-sdks-java-extensions-protobuf:validateShadedJarDoesntLeakNonOrgApacheBeamClasses (Thread[Task worker for ':' Thread 5,5,main]) completed. Took 0.031 secs.
:beam-vendor-sdks-java-extensions-protobuf:check (Thread[Task worker for ':' Thread 5,5,main]) started.

> Task :beam-vendor-sdks-java-extensions-protobuf:check
Skipping task ':beam-vendor-sdks-java-extensions-protobuf:check' as it has no actions.
:beam-vendor-sdks-java-extensions-protobuf:check (Thread[Task worker for ':' Thread 5,5,main]) completed. Took 0.0 secs.
:beam-vendor-sdks-java-extensions-protobuf:build (Thread[Task worker for ':' Thread 2,5,main]) started.

> Task :beam-vendor-sdks-java-extensions-protobuf:build
Skipping task ':beam-vendor-sdks-java-extensions-protobuf:build' as it has no actions.
:beam-vendor-sdks-java-extensions-protobuf:build (Thread[Task worker for ':' Thread 2,5,main]) completed. Took 0.0 secs.
:beam-website:assemble (Thread[Task worker for ':' Thread 2,5,main]) started.

> Task :beam-website:assemble UP-TO-DATE
Skipping task ':beam-website:assemble' as it has no actions.
:beam-website:assemble (Thread[Task worker for ':' Thread 2,5,main]) completed. Took 0.0 secs.
:beam-website:setupBuildDir (Thread[Task worker for ':' Thread 2,5,main]) started.

> Task :beam-website:setupBuildDir
Build cache key for task ':beam-website:setupBuildDir' is 7afd3bd0c1a9269d50131165bb8a63a1
Caching disabled for task ':beam-website:setupBuildDir': Caching has not been enabled for the task
Task ':beam-website:setupBuildDir' is not up-to-date because:
  No history is available.
:beam-website:setupBuildDir (Thread[Task worker for ':' Thread 2,5,main]) completed. Took 0.004 secs.
:beam-website:buildDockerImage (Thread[Task worker for ':' Thread 2,5,main]) started.

> Task :beam-website:buildDockerImage
Caching disabled for task ':beam-website:buildDockerImage': Caching has not been enabled for the task
Task ':beam-website:buildDockerImage' is not up-to-date because:
  Task has not declared any outputs despite executing actions.
Starting process 'command 'docker''. Working directory: <https://builds.apache.org/job/beam_Release_Gradle_NightlySnapshot/ws/src/website> Command: docker build -t beam-website .
Successfully started process 'command 'docker''
Sending build context to Docker daemon  24.51MB
Step 1/7 : FROM ruby:2.5
 ---> 88666731c3e1
Step 2/7 : WORKDIR /ruby
 ---> Using cache
 ---> 9b7353f27cb5
Step 3/7 : RUN gem install bundler
 ---> Using cache
 ---> cd46d9b7ccbe
Step 4/7 : ADD Gemfile Gemfile.lock /ruby/
 ---> Using cache
 ---> d50c22e097f2
Step 5/7 : RUN bundle install --deployment --path $GEM_HOME
 ---> Using cache
 ---> e8881d09b465
Step 6/7 : ENV LC_ALL C.UTF-8
 ---> Using cache
 ---> 3787b82c937d
Step 7/7 : CMD sleep 3600
 ---> Using cache
 ---> 1608418b66da
Successfully built 1608418b66da
Successfully tagged beam-website:latest
:beam-website:buildDockerImage (Thread[Task worker for ':' Thread 2,5,main]) completed. Took 0.216 secs.
:beam-website:createDockerContainer (Thread[Task worker for ':' Thread 2,5,main]) started.

> Task :beam-website:createDockerContainer
Caching disabled for task ':beam-website:createDockerContainer': Caching has not been enabled for the task
Task ':beam-website:createDockerContainer' is not up-to-date because:
  Task has not declared any outputs despite executing actions.
Starting process 'command '/bin/bash''. Working directory: <https://builds.apache.org/job/beam_Release_Gradle_NightlySnapshot/ws/src/website> Command: /bin/bash -c docker create -v <https://builds.apache.org/job/beam_Release_Gradle_NightlySnapshot/ws/src>:/repo -u $(id -u):$(id -g) beam-website
Successfully started process 'command '/bin/bash''
:beam-website:createDockerContainer (Thread[Task worker for ':' Thread 2,5,main]) completed. Took 1.145 secs.
:beam-website:startDockerContainer (Thread[Task worker for ':' Thread 2,5,main]) started.

> Task :beam-website:startDockerContainer
Caching disabled for task ':beam-website:startDockerContainer': Caching has not been enabled for the task
Task ':beam-website:startDockerContainer' is not up-to-date because:
  Task has not declared any outputs despite executing actions.
Starting process 'command 'docker''. Working directory: <https://builds.apache.org/job/beam_Release_Gradle_NightlySnapshot/ws/src/website> Command: docker start 9b7190148eb8576c02fd6e932e84001482fa9ba2efad12635f83eacb2ec62153
Successfully started process 'command 'docker''
9b7190148eb8576c02fd6e932e84001482fa9ba2efad12635f83eacb2ec62153
:beam-website:startDockerContainer (Thread[Task worker for ':' Thread 2,5,main]) completed. Took 0.277 secs.
:beam-website:buildWebsite (Thread[Task worker for ':' Thread 2,5,main]) started.

> Task :beam-website:buildWebsite
Build cache key for task ':beam-website:buildWebsite' is f45f53d8f1cfceab54405ec167c19f40
Caching disabled for task ':beam-website:buildWebsite': Caching has not been enabled for the task
Task ':beam-website:buildWebsite' is not up-to-date because:
  No history is available.
Starting process 'command 'docker''. Working directory: <https://builds.apache.org/job/beam_Release_Gradle_NightlySnapshot/ws/src/website> Command: docker exec 9b7190148eb8576c02fd6e932e84001482fa9ba2efad12635f83eacb2ec62153 /bin/bash -c cd /repo/build/website &&       bundle exec jekyll build       --config /repo/website/_config.yml       --incremental       --source /repo/website/src
      
Successfully started process 'command 'docker''
`/` is not writable.
Bundler will use `/tmp/bundler/home/unknown' as your home directory temporarily.
Configuration file: /repo/website/_config.yml
            Source: /repo/website/src
       Destination: content
 Incremental build: enabled
      Generating... 
                    done in 11.502 seconds.
 Auto-regeneration: disabled. Use --watch to enable.
:beam-website:buildWebsite (Thread[Task worker for ':' Thread 2,5,main]) completed. Took 12.829 secs.
:beam-website:testWebsite (Thread[Task worker for ':' Thread 2,5,main]) started.

> Task :beam-website:testWebsite
Caching disabled for task ':beam-website:testWebsite': Caching has not been enabled for the task
Task ':beam-website:testWebsite' is not up-to-date because:
  Task has not declared any outputs despite executing actions.
Starting process 'command 'docker''. Working directory: <https://builds.apache.org/job/beam_Release_Gradle_NightlySnapshot/ws/src/website> Command: docker exec 9b7190148eb8576c02fd6e932e84001482fa9ba2efad12635f83eacb2ec62153 /bin/bash -c cd /repo/build/website &&       bundle exec rake test
Successfully started process 'command 'docker''
`/` is not writable.
Bundler will use `/tmp/bundler/home/unknown' as your home directory temporarily.
Running ["HtmlCheck", "LinkCheck", "ImageCheck", "ScriptCheck"] on ["./content"] on *.html... 


Checking 566 external links...
Ran on 135 files!


- ./content/contribute/release-guide/index.html
  *  External link https://github.com/apache/beam/blob/master/runners/google-cloud-dataflow-java/pom.xml failed: 404 No error
- ./content/get-started/downloads/index.html
  *  External link https://dist.apache.org/repos/dist/release/beam/2.5.0/apache-beam-2.5.0-source-release.zip failed: 404 No error
  *  External link https://dist.apache.org/repos/dist/release/beam/2.5.0/apache-beam-2.5.0-source-release.zip.asc failed: 404 No error
  *  External link https://dist.apache.org/repos/dist/release/beam/2.5.0/apache-beam-2.5.0-source-release.zip.sha512 failed: 404 No error
rake aborted!
HTML-Proofer found 4 failures!
/usr/local/bundle/ruby/2.5.0/gems/html-proofer-3.8.0/lib/html-proofer/runner.rb:167:in `print_failed_tests'
/usr/local/bundle/ruby/2.5.0/gems/html-proofer-3.8.0/lib/html-proofer/runner.rb:48:in `run'
/repo/build/website/Rakefile:23:in `block in <top (required)>'
/usr/local/bundle/ruby/2.5.0/gems/rake-12.3.0/exe/rake:27:in `<top (required)>'
/usr/local/bundle/bin/bundle:23:in `load'
/usr/local/bundle/bin/bundle:23:in `<main>'
Tasks: TOP => test
(See full trace by running task with --trace)

> Task :beam-website:testWebsite FAILED
:beam-website:testWebsite (Thread[Task worker for ':' Thread 2,5,main]) completed. Took 21.786 secs.
:beam-website:stopAndRemoveDockerContainer (Thread[Task worker for ':' Thread 2,5,main]) started.

> Task :beam-website:stopAndRemoveDockerContainer
Caching disabled for task ':beam-website:stopAndRemoveDockerContainer': Caching has not been enabled for the task
Task ':beam-website:stopAndRemoveDockerContainer' is not up-to-date because:
  Task has not declared any outputs despite executing actions.
Starting process 'command 'docker''. Working directory: <https://builds.apache.org/job/beam_Release_Gradle_NightlySnapshot/ws/src/website> Command: docker rm -f 9b7190148eb8576c02fd6e932e84001482fa9ba2efad12635f83eacb2ec62153
Successfully started process 'command 'docker''
9b7190148eb8576c02fd6e932e84001482fa9ba2efad12635f83eacb2ec62153
:beam-website:stopAndRemoveDockerContainer (Thread[Task worker for ':' Thread 2,5,main]) completed. Took 0.52 secs.
:release:compileJava (Thread[Task worker for ':' Thread 2,5,main]) started.

> Task :release:compileJava NO-SOURCE
file or directory '<https://builds.apache.org/job/beam_Release_Gradle_NightlySnapshot/ws/src/release/src/main/java',> not found
Skipping task ':release:compileJava' as it has no source files and no previous output files.
:release:compileJava (Thread[Task worker for ':' Thread 2,5,main]) completed. Took 0.001 secs.
:release:compileGroovy (Thread[Task worker for ':' Thread 2,5,main]) started.

> Task :release:compileGroovy FROM-CACHE
Build cache key for task ':release:compileGroovy' is 8963864c41ecab4c189a270fa94436aa
Task ':release:compileGroovy' is not up-to-date because:
  No history is available.
Origin for task ':release:compileGroovy': {executionTime=2052, hostName=apache-beam-jenkins-slave-group-51fn, operatingSystem=Linux, buildInvocationId=egdu4ymrovdqpefkmescupbfhu, creationTime=1533629360360, type=org.gradle.api.tasks.compile.GroovyCompile_Decorated, userName=jenkins, gradleVersion=4.8, rootPath=<https://builds.apache.org/job/beam_Release_Gradle_NightlySnapshot/ws/src,> path=:release:compileGroovy}
Unpacked output for task ':release:compileGroovy' from cache.
:release:compileGroovy (Thread[Task worker for ':' Thread 2,5,main]) completed. Took 0.265 secs.
:release:processResources (Thread[Task worker for ':' Thread 2,5,main]) started.

> Task :release:processResources NO-SOURCE
file or directory '<https://builds.apache.org/job/beam_Release_Gradle_NightlySnapshot/ws/src/release/src/main/resources',> not found
Skipping task ':release:processResources' as it has no source files and no previous output files.
:release:processResources (Thread[Task worker for ':' Thread 2,5,main]) completed. Took 0.005 secs.
:release:classes (Thread[Task worker for ':' Thread 2,5,main]) started.

> Task :release:classes UP-TO-DATE
Skipping task ':release:classes' as it has no actions.
:release:classes (Thread[Task worker for ':' Thread 2,5,main]) completed. Took 0.0 secs.
:release:jar (Thread[Task worker for ':' Thread 2,5,main]) started.

> Task :release:jar
Build cache key for task ':release:jar' is f2db96afb021a5cc9e6914be6de059db
Caching disabled for task ':release:jar': Caching has not been enabled for the task
Task ':release:jar' is not up-to-date because:
  No history is available.
:release:jar (Thread[Task worker for ':' Thread 2,5,main]) completed. Took 0.009 secs.
:release:assemble (Thread[Task worker for ':' Thread 2,5,main]) started.

> Task :release:assemble
Skipping task ':release:assemble' as it has no actions.
:release:assemble (Thread[Task worker for ':' Thread 2,5,main]) completed. Took 0.0 secs.
:release:compileTestJava (Thread[Task worker for ':' Thread 2,5,main]) started.

> Task :release:compileTestJava NO-SOURCE
file or directory '<https://builds.apache.org/job/beam_Release_Gradle_NightlySnapshot/ws/src/release/src/test/java',> not found
Skipping task ':release:compileTestJava' as it has no source files and no previous output files.
:release:compileTestJava (Thread[Task worker for ':' Thread 2,5,main]) completed. Took 0.0 secs.
:release:compileTestGroovy (Thread[Task worker for ':' Thread 2,5,main]) started.

> Task :release:compileTestGroovy NO-SOURCE
file or directory '<https://builds.apache.org/job/beam_Release_Gradle_NightlySnapshot/ws/src/release/src/test/groovy',> not found
Skipping task ':release:compileTestGroovy' as it has no source files and no previous output files.
:release:compileTestGroovy (Thread[Task worker for ':' Thread 2,5,main]) completed. Took 0.0 secs.
:release:processTestResources (Thread[Task worker for ':' Thread 2,5,main]) started.

> Task :release:processTestResources NO-SOURCE
file or directory '<https://builds.apache.org/job/beam_Release_Gradle_NightlySnapshot/ws/src/release/src/test/resources',> not found
Skipping task ':release:processTestResources' as it has no source files and no previous output files.
:release:processTestResources (Thread[Task worker for ':' Thread 2,5,main]) completed. Took 0.001 secs.
:release:testClasses (Thread[Task worker for ':' Thread 2,5,main]) started.

> Task :release:testClasses UP-TO-DATE
Skipping task ':release:testClasses' as it has no actions.
:release:testClasses (Thread[Task worker for ':' Thread 2,5,main]) completed. Took 0.0 secs.
:release:test (Thread[Task worker for ':' Thread 2,5,main]) started.

> Task :release:test NO-SOURCE
Skipping task ':release:test' as it has no source files and no previous output files.
:release:test (Thread[Task worker for ':' Thread 2,5,main]) completed. Took 0.001 secs.
:release:check (Thread[Task worker for ':' Thread 2,5,main]) started.

> Task :release:check UP-TO-DATE
Skipping task ':release:check' as it has no actions.
:release:check (Thread[Task worker for ':' Thread 2,5,main]) completed. Took 0.0 secs.
:release:build (Thread[Task worker for ':' Thread 2,5,main]) started.

> Task :release:build
Skipping task ':release:build' as it has no actions.
:release:build (Thread[Task worker for ':' Thread 2,5,main]) completed. Took 0.0 secs.

FAILURE: Build failed with an exception.

* What went wrong:
Execution failed for task ':beam-website:testWebsite'.
> Process 'command 'docker'' finished with non-zero exit value 1

* Try:
Run with --stacktrace option to get the stack trace. Run with --debug option to get more log output. Run with --scan to get full insights.

* Get more help at https://help.gradle.org

Deprecated Gradle features were used in this build, making it incompatible with Gradle 5.0.
See https://docs.gradle.org/4.8/userguide/command_line_interface.html#sec:command_line_warnings

BUILD FAILED in 59m 30s
821 actionable tasks: 813 executed, 8 from cache

Publishing build scan...
https://gradle.com/s/cwahqm3u7ruwm

Build step 'Invoke Gradle script' changed build result to FAILURE
Build step 'Invoke Gradle script' marked build as failure

Build failed in Jenkins: beam_Release_Gradle_NightlySnapshot #165

Posted by Apache Jenkins Server <je...@builds.apache.org>.
See <https://builds.apache.org/job/beam_Release_Gradle_NightlySnapshot/165/display/redirect?page=changes>

Changes:

[apilloud] [BEAM-5279] Don't wipe SQL metadata, keep types simple

[tweise] [BEAM-5332] Do not attempt to evict cache after shutdown (#6342)

[thw] Cleanup FlinkExecutableStageContext and related classes.

[tweise] Compatibility Matrix: Build 'shadowJar' instead of regular jar (#6348)

[yifanzou] [BEAM-5301] migrate datastore_worcount integration test to Beam

------------------------------------------
[...truncated 19.29 MB...]
Skipping task ':beam-vendor-sdks-java-extensions-protobuf:test' as it has no source files and no previous output files.
:beam-vendor-sdks-java-extensions-protobuf:test (Thread[Daemon worker,5,main]) completed. Took 0.0 secs.
:beam-vendor-sdks-java-extensions-protobuf:validateShadedJarDoesntLeakNonOrgApacheBeamClasses (Thread[Daemon worker,5,main]) started.

> Task :beam-vendor-sdks-java-extensions-protobuf:validateShadedJarDoesntLeakNonOrgApacheBeamClasses
Caching disabled for task ':beam-vendor-sdks-java-extensions-protobuf:validateShadedJarDoesntLeakNonOrgApacheBeamClasses': Caching has not been enabled for the task
Task ':beam-vendor-sdks-java-extensions-protobuf:validateShadedJarDoesntLeakNonOrgApacheBeamClasses' is not up-to-date because:
  Task has not declared any outputs despite executing actions.
:beam-vendor-sdks-java-extensions-protobuf:validateShadedJarDoesntLeakNonOrgApacheBeamClasses (Thread[Daemon worker,5,main]) completed. Took 0.034 secs.
:beam-vendor-sdks-java-extensions-protobuf:check (Thread[Daemon worker,5,main]) started.

> Task :beam-vendor-sdks-java-extensions-protobuf:check
Skipping task ':beam-vendor-sdks-java-extensions-protobuf:check' as it has no actions.
:beam-vendor-sdks-java-extensions-protobuf:check (Thread[Daemon worker,5,main]) completed. Took 0.0 secs.
:beam-vendor-sdks-java-extensions-protobuf:build (Thread[Daemon worker,5,main]) started.

> Task :beam-vendor-sdks-java-extensions-protobuf:build
Skipping task ':beam-vendor-sdks-java-extensions-protobuf:build' as it has no actions.
:beam-vendor-sdks-java-extensions-protobuf:build (Thread[Daemon worker,5,main]) completed. Took 0.0 secs.
:beam-website:assemble (Thread[Daemon worker,5,main]) started.

> Task :beam-website:assemble UP-TO-DATE
Skipping task ':beam-website:assemble' as it has no actions.
:beam-website:assemble (Thread[Daemon worker,5,main]) completed. Took 0.0 secs.
:beam-website:setupBuildDir (Thread[Daemon worker,5,main]) started.

> Task :beam-website:setupBuildDir
Build cache key for task ':beam-website:setupBuildDir' is 7afd3bd0c1a9269d50131165bb8a63a1
Caching disabled for task ':beam-website:setupBuildDir': Caching has not been enabled for the task
Task ':beam-website:setupBuildDir' is not up-to-date because:
  No history is available.
:beam-website:setupBuildDir (Thread[Daemon worker,5,main]) completed. Took 0.003 secs.
:beam-website:buildDockerImage (Thread[Daemon worker,5,main]) started.

> Task :beam-website:buildDockerImage
Caching disabled for task ':beam-website:buildDockerImage': Caching has not been enabled for the task
Task ':beam-website:buildDockerImage' is not up-to-date because:
  Task has not declared any outputs despite executing actions.
Starting process 'command 'docker''. Working directory: <https://builds.apache.org/job/beam_Release_Gradle_NightlySnapshot/ws/src/website> Command: docker build -t beam-website .
Successfully started process 'command 'docker''
Sending build context to Docker daemon  24.51MB
Step 1/7 : FROM ruby:2.5
 ---> 88666731c3e1
Step 2/7 : WORKDIR /ruby
 ---> Using cache
 ---> 9b7353f27cb5
Step 3/7 : RUN gem install bundler
 ---> Using cache
 ---> cd46d9b7ccbe
Step 4/7 : ADD Gemfile Gemfile.lock /ruby/
 ---> Using cache
 ---> d50c22e097f2
Step 5/7 : RUN bundle install --deployment --path $GEM_HOME
 ---> Using cache
 ---> e8881d09b465
Step 6/7 : ENV LC_ALL C.UTF-8
 ---> Using cache
 ---> 3787b82c937d
Step 7/7 : CMD sleep 3600
 ---> Using cache
 ---> 1608418b66da
Successfully built 1608418b66da
Successfully tagged beam-website:latest
:beam-website:buildDockerImage (Thread[Daemon worker,5,main]) completed. Took 0.267 secs.
:beam-website:createDockerContainer (Thread[Daemon worker,5,main]) started.

> Task :beam-website:createDockerContainer
Caching disabled for task ':beam-website:createDockerContainer': Caching has not been enabled for the task
Task ':beam-website:createDockerContainer' is not up-to-date because:
  Task has not declared any outputs despite executing actions.
Starting process 'command '/bin/bash''. Working directory: <https://builds.apache.org/job/beam_Release_Gradle_NightlySnapshot/ws/src/website> Command: /bin/bash -c docker create -v <https://builds.apache.org/job/beam_Release_Gradle_NightlySnapshot/ws/src>:/repo -u $(id -u):$(id -g) beam-website
Successfully started process 'command '/bin/bash''
:beam-website:createDockerContainer (Thread[Daemon worker,5,main]) completed. Took 2.375 secs.
:beam-website:startDockerContainer (Thread[Daemon worker,5,main]) started.

> Task :beam-website:startDockerContainer
Caching disabled for task ':beam-website:startDockerContainer': Caching has not been enabled for the task
Task ':beam-website:startDockerContainer' is not up-to-date because:
  Task has not declared any outputs despite executing actions.
Starting process 'command 'docker''. Working directory: <https://builds.apache.org/job/beam_Release_Gradle_NightlySnapshot/ws/src/website> Command: docker start f2cd97b1a764e32eee0cbb74267e6e34771675b1b6acee2b6925e9453bd2e167
Successfully started process 'command 'docker''
f2cd97b1a764e32eee0cbb74267e6e34771675b1b6acee2b6925e9453bd2e167
:beam-website:startDockerContainer (Thread[Daemon worker,5,main]) completed. Took 0.281 secs.
:beam-website:buildWebsite (Thread[Daemon worker,5,main]) started.

> Task :beam-website:buildWebsite
Build cache key for task ':beam-website:buildWebsite' is 4471881d74d3b528afb3f845bb540f58
Caching disabled for task ':beam-website:buildWebsite': Caching has not been enabled for the task
Task ':beam-website:buildWebsite' is not up-to-date because:
  No history is available.
Starting process 'command 'docker''. Working directory: <https://builds.apache.org/job/beam_Release_Gradle_NightlySnapshot/ws/src/website> Command: docker exec f2cd97b1a764e32eee0cbb74267e6e34771675b1b6acee2b6925e9453bd2e167 /bin/bash -c cd /repo/build/website &&       bundle exec jekyll build       --config /repo/website/_config.yml       --incremental       --source /repo/website/src
      
Successfully started process 'command 'docker''
`/` is not writable.
Bundler will use `/tmp/bundler/home/unknown' as your home directory temporarily.
Configuration file: /repo/website/_config.yml
            Source: /repo/website/src
       Destination: content
 Incremental build: enabled
      Generating... 
                    done in 11.122 seconds.
 Auto-regeneration: disabled. Use --watch to enable.
:beam-website:buildWebsite (Thread[Daemon worker,5,main]) completed. Took 12.545 secs.
:beam-website:testWebsite (Thread[Daemon worker,5,main]) started.

> Task :beam-website:testWebsite
Caching disabled for task ':beam-website:testWebsite': Caching has not been enabled for the task
Task ':beam-website:testWebsite' is not up-to-date because:
  Task has not declared any outputs despite executing actions.
Starting process 'command 'docker''. Working directory: <https://builds.apache.org/job/beam_Release_Gradle_NightlySnapshot/ws/src/website> Command: docker exec f2cd97b1a764e32eee0cbb74267e6e34771675b1b6acee2b6925e9453bd2e167 /bin/bash -c cd /repo/build/website &&       bundle exec rake test
Successfully started process 'command 'docker''
`/` is not writable.
Bundler will use `/tmp/bundler/home/unknown' as your home directory temporarily.
Running ["HtmlCheck", "LinkCheck", "ImageCheck", "ScriptCheck"] on ["./content"] on *.html... 


Checking 566 external links...
Ran on 135 files!


- ./content/contribute/release-guide/index.html
  *  External link https://github.com/apache/beam/blob/master/runners/google-cloud-dataflow-java/pom.xml failed: 404 No error
- ./content/get-started/downloads/index.html
  *  External link https://dist.apache.org/repos/dist/release/beam/2.5.0/apache-beam-2.5.0-source-release.zip failed: 404 No error
  *  External link https://dist.apache.org/repos/dist/release/beam/2.5.0/apache-beam-2.5.0-source-release.zip.asc failed: 404 No error
  *  External link https://dist.apache.org/repos/dist/release/beam/2.5.0/apache-beam-2.5.0-source-release.zip.sha512 failed: 404 No error
rake aborted!
HTML-Proofer found 4 failures!
/usr/local/bundle/ruby/2.5.0/gems/html-proofer-3.8.0/lib/html-proofer/runner.rb:167:in `print_failed_tests'
/usr/local/bundle/ruby/2.5.0/gems/html-proofer-3.8.0/lib/html-proofer/runner.rb:48:in `run'
/repo/build/website/Rakefile:23:in `block in <top (required)>'
/usr/local/bundle/ruby/2.5.0/gems/rake-12.3.0/exe/rake:27:in `<top (required)>'
/usr/local/bundle/bin/bundle:23:in `load'
/usr/local/bundle/bin/bundle:23:in `<main>'
Tasks: TOP => test
(See full trace by running task with --trace)

> Task :beam-website:testWebsite FAILED
:beam-website:testWebsite (Thread[Daemon worker,5,main]) completed. Took 21.384 secs.
:beam-website:stopAndRemoveDockerContainer (Thread[Daemon worker,5,main]) started.

> Task :beam-website:stopAndRemoveDockerContainer
Caching disabled for task ':beam-website:stopAndRemoveDockerContainer': Caching has not been enabled for the task
Task ':beam-website:stopAndRemoveDockerContainer' is not up-to-date because:
  Task has not declared any outputs despite executing actions.
Starting process 'command 'docker''. Working directory: <https://builds.apache.org/job/beam_Release_Gradle_NightlySnapshot/ws/src/website> Command: docker rm -f f2cd97b1a764e32eee0cbb74267e6e34771675b1b6acee2b6925e9453bd2e167
Successfully started process 'command 'docker''
f2cd97b1a764e32eee0cbb74267e6e34771675b1b6acee2b6925e9453bd2e167
:beam-website:stopAndRemoveDockerContainer (Thread[Daemon worker,5,main]) completed. Took 0.528 secs.
:release:compileJava (Thread[Daemon worker,5,main]) started.

> Task :release:compileJava NO-SOURCE
file or directory '<https://builds.apache.org/job/beam_Release_Gradle_NightlySnapshot/ws/src/release/src/main/java',> not found
Skipping task ':release:compileJava' as it has no source files and no previous output files.
:release:compileJava (Thread[Daemon worker,5,main]) completed. Took 0.001 secs.
:release:compileGroovy (Thread[Daemon worker,5,main]) started.

> Task :release:compileGroovy FROM-CACHE
Build cache key for task ':release:compileGroovy' is 8963864c41ecab4c189a270fa94436aa
Task ':release:compileGroovy' is not up-to-date because:
  No history is available.
Origin for task ':release:compileGroovy': {executionTime=2052, hostName=apache-beam-jenkins-slave-group-51fn, operatingSystem=Linux, buildInvocationId=egdu4ymrovdqpefkmescupbfhu, creationTime=1533629360360, type=org.gradle.api.tasks.compile.GroovyCompile_Decorated, userName=jenkins, gradleVersion=4.8, rootPath=<https://builds.apache.org/job/beam_Release_Gradle_NightlySnapshot/ws/src,> path=:release:compileGroovy}
Unpacked output for task ':release:compileGroovy' from cache.
:release:compileGroovy (Thread[Daemon worker,5,main]) completed. Took 0.277 secs.
:release:processResources (Thread[Daemon worker,5,main]) started.

> Task :release:processResources NO-SOURCE
file or directory '<https://builds.apache.org/job/beam_Release_Gradle_NightlySnapshot/ws/src/release/src/main/resources',> not found
Skipping task ':release:processResources' as it has no source files and no previous output files.
:release:processResources (Thread[Daemon worker,5,main]) completed. Took 0.0 secs.
:release:classes (Thread[Daemon worker,5,main]) started.

> Task :release:classes UP-TO-DATE
Skipping task ':release:classes' as it has no actions.
:release:classes (Thread[Daemon worker,5,main]) completed. Took 0.0 secs.
:release:jar (Thread[Daemon worker,5,main]) started.

> Task :release:jar
Build cache key for task ':release:jar' is f2db96afb021a5cc9e6914be6de059db
Caching disabled for task ':release:jar': Caching has not been enabled for the task
Task ':release:jar' is not up-to-date because:
  No history is available.
:release:jar (Thread[Daemon worker,5,main]) completed. Took 0.013 secs.
:release:assemble (Thread[Daemon worker,5,main]) started.

> Task :release:assemble
Skipping task ':release:assemble' as it has no actions.
:release:assemble (Thread[Daemon worker,5,main]) completed. Took 0.0 secs.
:release:compileTestJava (Thread[Daemon worker,5,main]) started.

> Task :release:compileTestJava NO-SOURCE
file or directory '<https://builds.apache.org/job/beam_Release_Gradle_NightlySnapshot/ws/src/release/src/test/java',> not found
Skipping task ':release:compileTestJava' as it has no source files and no previous output files.
:release:compileTestJava (Thread[Daemon worker,5,main]) completed. Took 0.0 secs.
:release:compileTestGroovy (Thread[Daemon worker,5,main]) started.

> Task :release:compileTestGroovy NO-SOURCE
file or directory '<https://builds.apache.org/job/beam_Release_Gradle_NightlySnapshot/ws/src/release/src/test/groovy',> not found
Skipping task ':release:compileTestGroovy' as it has no source files and no previous output files.
:release:compileTestGroovy (Thread[Daemon worker,5,main]) completed. Took 0.0 secs.
:release:processTestResources (Thread[Daemon worker,5,main]) started.

> Task :release:processTestResources NO-SOURCE
file or directory '<https://builds.apache.org/job/beam_Release_Gradle_NightlySnapshot/ws/src/release/src/test/resources',> not found
Skipping task ':release:processTestResources' as it has no source files and no previous output files.
:release:processTestResources (Thread[Daemon worker,5,main]) completed. Took 0.0 secs.
:release:testClasses (Thread[Daemon worker,5,main]) started.

> Task :release:testClasses UP-TO-DATE
Skipping task ':release:testClasses' as it has no actions.
:release:testClasses (Thread[Daemon worker,5,main]) completed. Took 0.0 secs.
:release:test (Thread[Task worker for ':' Thread 2,5,main]) started.

> Task :release:test NO-SOURCE
Skipping task ':release:test' as it has no source files and no previous output files.
:release:test (Thread[Task worker for ':' Thread 2,5,main]) completed. Took 0.001 secs.
:release:check (Thread[Task worker for ':' Thread 2,5,main]) started.

> Task :release:check UP-TO-DATE
Skipping task ':release:check' as it has no actions.
:release:check (Thread[Task worker for ':' Thread 2,5,main]) completed. Took 0.0 secs.
:release:build (Thread[Task worker for ':' Thread 2,5,main]) started.

> Task :release:build
Skipping task ':release:build' as it has no actions.
:release:build (Thread[Task worker for ':' Thread 2,5,main]) completed. Took 0.0 secs.

FAILURE: Build failed with an exception.

* What went wrong:
Execution failed for task ':beam-website:testWebsite'.
> Process 'command 'docker'' finished with non-zero exit value 1

* Try:
Run with --stacktrace option to get the stack trace. Run with --debug option to get more log output. Run with --scan to get full insights.

* Get more help at https://help.gradle.org

Deprecated Gradle features were used in this build, making it incompatible with Gradle 5.0.
See https://docs.gradle.org/4.8/userguide/command_line_interface.html#sec:command_line_warnings

BUILD FAILED in 59m 54s
821 actionable tasks: 813 executed, 8 from cache

Publishing build scan...
https://gradle.com/s/fuhyhmlkx52yq

Build step 'Invoke Gradle script' changed build result to FAILURE
Build step 'Invoke Gradle script' marked build as failure