You are viewing a plain text version of this content. The canonical link for it is here.
Posted to dev@kafka.apache.org by Apache Jenkins Server <je...@builds.apache.org> on 2024/03/25 16:15:33 UTC
Build failed in Jenkins: Kafka » Kafka Branch Builder » 3.6 #164
See <https://ci-builds.apache.org/job/Kafka/job/kafka/job/3.6/164/display/redirect>
Changes:
------------------------------------------
[...truncated 373413 lines...]
[2024-03-25T15:05:09.623Z] Gradle Test Run :core:test > Gradle Test Executor 92 > ZkMigrationClientTest > testEmptyWrite() PASSED
[2024-03-25T15:05:09.623Z]
[2024-03-25T15:05:09.623Z] Gradle Test Run :core:test > Gradle Test Executor 92 > ZkMigrationClientTest > testReadMigrateAndWriteProducerId() STARTED
[2024-03-25T15:05:09.824Z]
[2024-03-25T15:05:09.824Z] Gradle Test Run :core:test > Gradle Test Executor 92 > ZkMigrationClientTest > testReadMigrateAndWriteProducerId() PASSED
[2024-03-25T15:05:09.824Z]
[2024-03-25T15:05:09.824Z] Gradle Test Run :core:test > Gradle Test Executor 92 > ZkMigrationClientTest > testExistingKRaftControllerClaim() STARTED
[2024-03-25T15:05:09.925Z]
[2024-03-25T15:05:09.925Z] Gradle Test Run :core:test > Gradle Test Executor 92 > ZkMigrationClientTest > testExistingKRaftControllerClaim() PASSED
[2024-03-25T15:05:09.925Z]
[2024-03-25T15:05:09.925Z] Gradle Test Run :core:test > Gradle Test Executor 92 > ZkMigrationClientTest > testMigrateTopicConfigs() STARTED
[2024-03-25T15:05:10.126Z]
[2024-03-25T15:05:10.126Z] Gradle Test Run :core:test > Gradle Test Executor 92 > ZkMigrationClientTest > testMigrateTopicConfigs() PASSED
[2024-03-25T15:05:10.126Z]
[2024-03-25T15:05:10.126Z] Gradle Test Run :core:test > Gradle Test Executor 92 > ZkMigrationClientTest > testNonIncreasingKRaftEpoch() STARTED
[2024-03-25T15:05:10.327Z]
[2024-03-25T15:05:10.327Z] Gradle Test Run :core:test > Gradle Test Executor 92 > ZkMigrationClientTest > testNonIncreasingKRaftEpoch() PASSED
[2024-03-25T15:05:10.327Z]
[2024-03-25T15:05:10.327Z] Gradle Test Run :core:test > Gradle Test Executor 92 > ZkMigrationClientTest > testMigrateEmptyZk() STARTED
[2024-03-25T15:05:10.427Z]
[2024-03-25T15:05:10.427Z] Gradle Test Run :core:test > Gradle Test Executor 92 > ZkMigrationClientTest > testMigrateEmptyZk() PASSED
[2024-03-25T15:05:10.427Z]
[2024-03-25T15:05:10.427Z] Gradle Test Run :core:test > Gradle Test Executor 92 > ZkMigrationClientTest > testTopicAndBrokerConfigsMigrationWithSnapshots() STARTED
[2024-03-25T15:05:10.829Z]
[2024-03-25T15:05:10.829Z] Gradle Test Run :core:test > Gradle Test Executor 92 > ZkMigrationClientTest > testTopicAndBrokerConfigsMigrationWithSnapshots() PASSED
[2024-03-25T15:05:10.829Z]
[2024-03-25T15:05:10.829Z] Gradle Test Run :core:test > Gradle Test Executor 92 > ZkMigrationClientTest > testClaimAndReleaseExistingController() STARTED
[2024-03-25T15:05:10.929Z]
[2024-03-25T15:05:10.929Z] Gradle Test Run :core:test > Gradle Test Executor 92 > ZkMigrationClientTest > testClaimAndReleaseExistingController() PASSED
[2024-03-25T15:05:10.929Z]
[2024-03-25T15:05:10.929Z] Gradle Test Run :core:test > Gradle Test Executor 92 > ZkMigrationClientTest > testClaimAbsentController() STARTED
[2024-03-25T15:05:11.130Z]
[2024-03-25T15:05:11.130Z] Gradle Test Run :core:test > Gradle Test Executor 92 > ZkMigrationClientTest > testClaimAbsentController() PASSED
[2024-03-25T15:05:11.130Z]
[2024-03-25T15:05:11.130Z] Gradle Test Run :core:test > Gradle Test Executor 92 > ZkMigrationClientTest > testIdempotentCreateTopics() STARTED
[2024-03-25T15:05:11.231Z]
[2024-03-25T15:05:11.231Z] Gradle Test Run :core:test > Gradle Test Executor 92 > ZkMigrationClientTest > testIdempotentCreateTopics() PASSED
[2024-03-25T15:05:11.231Z]
[2024-03-25T15:05:11.231Z] Gradle Test Run :core:test > Gradle Test Executor 92 > ZkMigrationClientTest > testCreateNewTopic() STARTED
[2024-03-25T15:05:11.432Z]
[2024-03-25T15:05:11.432Z] Gradle Test Run :core:test > Gradle Test Executor 92 > ZkMigrationClientTest > testCreateNewTopic() PASSED
[2024-03-25T15:05:11.432Z]
[2024-03-25T15:05:11.432Z] Gradle Test Run :core:test > Gradle Test Executor 92 > ZkMigrationClientTest > testUpdateExistingTopicWithNewAndChangedPartitions() STARTED
[2024-03-25T15:05:11.633Z]
[2024-03-25T15:05:11.633Z] Gradle Test Run :core:test > Gradle Test Executor 92 > ZkMigrationClientTest > testUpdateExistingTopicWithNewAndChangedPartitions() PASSED
[2024-03-25T15:05:11.633Z]
[2024-03-25T15:05:11.633Z] Gradle Test Run :core:test > Gradle Test Executor 92 > ZooKeeperClientTest > testZNodeChangeHandlerForDataChange() STARTED
[2024-03-25T15:05:11.834Z]
[2024-03-25T15:05:11.834Z] Gradle Test Run :core:test > Gradle Test Executor 92 > ZooKeeperClientTest > testZNodeChangeHandlerForDataChange() PASSED
[2024-03-25T15:05:11.834Z]
[2024-03-25T15:05:11.834Z] Gradle Test Run :core:test > Gradle Test Executor 92 > ZooKeeperClientTest > testZooKeeperSessionStateMetric() STARTED
[2024-03-25T15:05:12.035Z]
[2024-03-25T15:05:12.035Z] Gradle Test Run :core:test > Gradle Test Executor 92 > ZooKeeperClientTest > testZooKeeperSessionStateMetric() PASSED
[2024-03-25T15:05:12.035Z]
[2024-03-25T15:05:12.035Z] Gradle Test Run :core:test > Gradle Test Executor 92 > ZooKeeperClientTest > testExceptionInBeforeInitializingSession() STARTED
[2024-03-25T15:05:12.537Z]
[2024-03-25T15:05:12.537Z] Gradle Test Run :core:test > Gradle Test Executor 92 > ZooKeeperClientTest > testExceptionInBeforeInitializingSession() PASSED
[2024-03-25T15:05:12.537Z]
[2024-03-25T15:05:12.537Z] Gradle Test Run :core:test > Gradle Test Executor 92 > ZooKeeperClientTest > testGetChildrenExistingZNode() STARTED
[2024-03-25T15:05:12.738Z]
[2024-03-25T15:05:12.738Z] Gradle Test Run :core:test > Gradle Test Executor 92 > ZooKeeperClientTest > testGetChildrenExistingZNode() PASSED
[2024-03-25T15:05:12.738Z]
[2024-03-25T15:05:12.738Z] Gradle Test Run :core:test > Gradle Test Executor 92 > ZooKeeperClientTest > testConnection() STARTED
[2024-03-25T15:05:13.039Z]
[2024-03-25T15:05:13.039Z] Gradle Test Run :core:test > Gradle Test Executor 92 > ZooKeeperClientTest > testConnection() PASSED
[2024-03-25T15:05:13.039Z]
[2024-03-25T15:05:13.039Z] Gradle Test Run :core:test > Gradle Test Executor 92 > ZooKeeperClientTest > testZNodeChangeHandlerForCreation() STARTED
[2024-03-25T15:05:13.340Z]
[2024-03-25T15:05:13.340Z] Gradle Test Run :core:test > Gradle Test Executor 92 > ZooKeeperClientTest > testZNodeChangeHandlerForCreation() PASSED
[2024-03-25T15:05:13.340Z]
[2024-03-25T15:05:13.340Z] Gradle Test Run :core:test > Gradle Test Executor 92 > ZooKeeperClientTest > testGetAclExistingZNode() STARTED
[2024-03-25T15:05:13.541Z]
[2024-03-25T15:05:13.541Z] Gradle Test Run :core:test > Gradle Test Executor 92 > ZooKeeperClientTest > testGetAclExistingZNode() PASSED
[2024-03-25T15:05:13.541Z]
[2024-03-25T15:05:13.541Z] Gradle Test Run :core:test > Gradle Test Executor 92 > ZooKeeperClientTest > testSessionExpiryDuringClose() STARTED
[2024-03-25T15:05:13.742Z]
[2024-03-25T15:05:13.742Z] Gradle Test Run :core:test > Gradle Test Executor 92 > ZooKeeperClientTest > testSessionExpiryDuringClose() PASSED
[2024-03-25T15:05:13.742Z]
[2024-03-25T15:05:13.742Z] Gradle Test Run :core:test > Gradle Test Executor 92 > ZooKeeperClientTest > testReinitializeAfterAuthFailure() STARTED
[2024-03-25T15:05:16.449Z]
[2024-03-25T15:05:16.449Z] Gradle Test Run :core:test > Gradle Test Executor 92 > ZooKeeperClientTest > testReinitializeAfterAuthFailure() PASSED
[2024-03-25T15:05:16.449Z]
[2024-03-25T15:05:16.449Z] Gradle Test Run :core:test > Gradle Test Executor 92 > ZooKeeperClientTest > testSetAclNonExistentZNode() STARTED
[2024-03-25T15:05:16.650Z]
[2024-03-25T15:05:16.650Z] Gradle Test Run :core:test > Gradle Test Executor 92 > ZooKeeperClientTest > testSetAclNonExistentZNode() PASSED
[2024-03-25T15:05:16.650Z]
[2024-03-25T15:05:16.650Z] Gradle Test Run :core:test > Gradle Test Executor 92 > ZooKeeperClientTest > testConnectionLossRequestTermination() STARTED
[2024-03-25T15:05:25.972Z]
[2024-03-25T15:05:25.972Z] Gradle Test Run :core:test > Gradle Test Executor 92 > ZooKeeperClientTest > testConnectionLossRequestTermination() PASSED
[2024-03-25T15:05:25.972Z]
[2024-03-25T15:05:25.972Z] Gradle Test Run :core:test > Gradle Test Executor 92 > ZooKeeperClientTest > testExistsNonExistentZNode() STARTED
[2024-03-25T15:05:26.173Z]
[2024-03-25T15:05:26.173Z] Gradle Test Run :core:test > Gradle Test Executor 92 > ZooKeeperClientTest > testExistsNonExistentZNode() PASSED
[2024-03-25T15:05:26.173Z]
[2024-03-25T15:05:26.173Z] Gradle Test Run :core:test > Gradle Test Executor 92 > ZooKeeperClientTest > testGetDataNonExistentZNode() STARTED
[2024-03-25T15:05:26.474Z]
[2024-03-25T15:05:26.474Z] Gradle Test Run :core:test > Gradle Test Executor 92 > ZooKeeperClientTest > testGetDataNonExistentZNode() PASSED
[2024-03-25T15:05:26.474Z]
[2024-03-25T15:05:26.475Z] Gradle Test Run :core:test > Gradle Test Executor 92 > ZooKeeperClientTest > testConnectionTimeout() STARTED
[2024-03-25T15:05:28.580Z]
[2024-03-25T15:05:28.581Z] Gradle Test Run :core:test > Gradle Test Executor 92 > ZooKeeperClientTest > testConnectionTimeout() PASSED
[2024-03-25T15:05:28.581Z]
[2024-03-25T15:05:28.581Z] Gradle Test Run :core:test > Gradle Test Executor 92 > ZooKeeperClientTest > testBlockOnRequestCompletionFromStateChangeHandler() STARTED
[2024-03-25T15:05:29.082Z]
[2024-03-25T15:05:29.082Z] Gradle Test Run :core:test > Gradle Test Executor 92 > ZooKeeperClientTest > testBlockOnRequestCompletionFromStateChangeHandler() PASSED
[2024-03-25T15:05:29.082Z]
[2024-03-25T15:05:29.082Z] Gradle Test Run :core:test > Gradle Test Executor 92 > ZooKeeperClientTest > testUnresolvableConnectString() STARTED
[2024-03-25T15:05:29.484Z]
[2024-03-25T15:05:29.484Z] Gradle Test Run :core:test > Gradle Test Executor 92 > ZooKeeperClientTest > testUnresolvableConnectString() PASSED
[2024-03-25T15:05:29.484Z]
[2024-03-25T15:05:29.484Z] Gradle Test Run :core:test > Gradle Test Executor 92 > ZooKeeperClientTest > testGetChildrenNonExistentZNode() STARTED
[2024-03-25T15:05:29.685Z]
[2024-03-25T15:05:29.685Z] Gradle Test Run :core:test > Gradle Test Executor 92 > ZooKeeperClientTest > testGetChildrenNonExistentZNode() PASSED
[2024-03-25T15:05:29.685Z]
[2024-03-25T15:05:29.685Z] Gradle Test Run :core:test > Gradle Test Executor 92 > ZooKeeperClientTest > testPipelinedGetData() STARTED
[2024-03-25T15:05:29.886Z]
[2024-03-25T15:05:29.886Z] Gradle Test Run :core:test > Gradle Test Executor 92 > ZooKeeperClientTest > testPipelinedGetData() PASSED
[2024-03-25T15:05:29.886Z]
[2024-03-25T15:05:29.886Z] Gradle Test Run :core:test > Gradle Test Executor 92 > ZooKeeperClientTest > testZNodeChildChangeHandlerForChildChange() STARTED
[2024-03-25T15:05:30.087Z]
[2024-03-25T15:05:30.087Z] Gradle Test Run :core:test > Gradle Test Executor 92 > ZooKeeperClientTest > testZNodeChildChangeHandlerForChildChange() PASSED
[2024-03-25T15:05:30.087Z]
[2024-03-25T15:05:30.087Z] Gradle Test Run :core:test > Gradle Test Executor 92 > ZooKeeperClientTest > testGetChildrenExistingZNodeWithChildren() STARTED
[2024-03-25T15:05:30.388Z]
[2024-03-25T15:05:30.388Z] Gradle Test Run :core:test > Gradle Test Executor 92 > ZooKeeperClientTest > testGetChildrenExistingZNodeWithChildren() PASSED
[2024-03-25T15:05:30.388Z]
[2024-03-25T15:05:30.388Z] Gradle Test Run :core:test > Gradle Test Executor 92 > ZooKeeperClientTest > testSetDataExistingZNode() STARTED
[2024-03-25T15:05:30.589Z]
[2024-03-25T15:05:30.589Z] Gradle Test Run :core:test > Gradle Test Executor 92 > ZooKeeperClientTest > testSetDataExistingZNode() PASSED
[2024-03-25T15:05:30.589Z]
[2024-03-25T15:05:30.589Z] Gradle Test Run :core:test > Gradle Test Executor 92 > ZooKeeperClientTest > testZNodeChildChangeHandlerForChildChangeNotTriggered() STARTED
[2024-03-25T15:05:30.890Z]
[2024-03-25T15:05:30.890Z] Gradle Test Run :core:test > Gradle Test Executor 92 > ZooKeeperClientTest > testZNodeChildChangeHandlerForChildChangeNotTriggered() PASSED
[2024-03-25T15:05:30.890Z]
[2024-03-25T15:05:30.890Z] Gradle Test Run :core:test > Gradle Test Executor 92 > ZooKeeperClientTest > testMixedPipeline() STARTED
[2024-03-25T15:05:31.191Z]
[2024-03-25T15:05:31.191Z] Gradle Test Run :core:test > Gradle Test Executor 92 > ZooKeeperClientTest > testMixedPipeline() PASSED
[2024-03-25T15:05:31.191Z]
[2024-03-25T15:05:31.191Z] Gradle Test Run :core:test > Gradle Test Executor 92 > ZooKeeperClientTest > testGetDataExistingZNode() STARTED
[2024-03-25T15:05:31.392Z]
[2024-03-25T15:05:31.392Z] Gradle Test Run :core:test > Gradle Test Executor 92 > ZooKeeperClientTest > testGetDataExistingZNode() PASSED
[2024-03-25T15:05:31.392Z]
[2024-03-25T15:05:31.392Z] Gradle Test Run :core:test > Gradle Test Executor 92 > ZooKeeperClientTest > testDeleteExistingZNode() STARTED
[2024-03-25T15:05:31.593Z]
[2024-03-25T15:05:31.593Z] Gradle Test Run :core:test > Gradle Test Executor 92 > ZooKeeperClientTest > testDeleteExistingZNode() PASSED
[2024-03-25T15:05:31.593Z]
[2024-03-25T15:05:31.593Z] Gradle Test Run :core:test > Gradle Test Executor 92 > ZooKeeperClientTest > testSessionExpiry() STARTED
[2024-03-25T15:05:33.800Z]
[2024-03-25T15:05:33.800Z] Gradle Test Run :core:test > Gradle Test Executor 92 > ZooKeeperClientTest > testSessionExpiry() PASSED
[2024-03-25T15:05:33.800Z]
[2024-03-25T15:05:33.800Z] Gradle Test Run :core:test > Gradle Test Executor 92 > ZooKeeperClientTest > testSetDataNonExistentZNode() STARTED
[2024-03-25T15:05:34.101Z]
[2024-03-25T15:05:34.101Z] Gradle Test Run :core:test > Gradle Test Executor 92 > ZooKeeperClientTest > testSetDataNonExistentZNode() PASSED
[2024-03-25T15:05:34.101Z]
[2024-03-25T15:05:34.101Z] Gradle Test Run :core:test > Gradle Test Executor 92 > ZooKeeperClientTest > testConnectionViaNettyClient() STARTED
[2024-03-25T15:05:34.703Z]
[2024-03-25T15:05:34.703Z] Gradle Test Run :core:test > Gradle Test Executor 92 > ZooKeeperClientTest > testConnectionViaNettyClient() PASSED
[2024-03-25T15:05:34.703Z]
[2024-03-25T15:05:34.703Z] Gradle Test Run :core:test > Gradle Test Executor 92 > ZooKeeperClientTest > testDeleteNonExistentZNode() STARTED
[2024-03-25T15:05:34.904Z]
[2024-03-25T15:05:34.904Z] Gradle Test Run :core:test > Gradle Test Executor 92 > ZooKeeperClientTest > testDeleteNonExistentZNode() PASSED
[2024-03-25T15:05:34.904Z]
[2024-03-25T15:05:34.904Z] Gradle Test Run :core:test > Gradle Test Executor 92 > ZooKeeperClientTest > testExistsExistingZNode() STARTED
[2024-03-25T15:05:35.105Z]
[2024-03-25T15:05:35.105Z] Gradle Test Run :core:test > Gradle Test Executor 92 > ZooKeeperClientTest > testExistsExistingZNode() PASSED
[2024-03-25T15:05:35.105Z]
[2024-03-25T15:05:35.105Z] Gradle Test Run :core:test > Gradle Test Executor 92 > ZooKeeperClientTest > testZooKeeperStateChangeRateMetrics() STARTED
[2024-03-25T15:05:35.406Z]
[2024-03-25T15:05:35.406Z] Gradle Test Run :core:test > Gradle Test Executor 92 > ZooKeeperClientTest > testZooKeeperStateChangeRateMetrics() PASSED
[2024-03-25T15:05:35.406Z]
[2024-03-25T15:05:35.406Z] Gradle Test Run :core:test > Gradle Test Executor 92 > ZooKeeperClientTest > testZNodeChangeHandlerForDeletion() STARTED
[2024-03-25T15:05:35.607Z]
[2024-03-25T15:05:35.607Z] Gradle Test Run :core:test > Gradle Test Executor 92 > ZooKeeperClientTest > testZNodeChangeHandlerForDeletion() PASSED
[2024-03-25T15:05:35.607Z]
[2024-03-25T15:05:35.607Z] Gradle Test Run :core:test > Gradle Test Executor 92 > ZooKeeperClientTest > testGetAclNonExistentZNode() STARTED
[2024-03-25T15:05:35.807Z]
[2024-03-25T15:05:35.807Z] Gradle Test Run :core:test > Gradle Test Executor 92 > ZooKeeperClientTest > testGetAclNonExistentZNode() PASSED
[2024-03-25T15:05:35.807Z]
[2024-03-25T15:05:35.808Z] Gradle Test Run :core:test > Gradle Test Executor 92 > ZooKeeperClientTest > testStateChangeHandlerForAuthFailure() STARTED
[2024-03-25T15:05:36.309Z]
[2024-03-25T15:05:36.309Z] Gradle Test Run :core:test > Gradle Test Executor 92 > ZooKeeperClientTest > testStateChangeHandlerForAuthFailure() PASSED
[2024-03-25T15:05:36.309Z]
[2024-03-25T15:05:36.309Z] Gradle Test Run :core:test > Gradle Test Executor 92 > AllocateProducerIdsRequestTest > testAllocateProducersIdSentToController() > [1] Type=Raft-Isolated, Name=testAllocateProducersIdSentToController, MetadataVersion=3.6-IV2, Security=PLAINTEXT STARTED
[2024-03-25T15:05:37.613Z]
[2024-03-25T15:05:37.613Z] Gradle Test Run :core:test > Gradle Test Executor 92 > AllocateProducerIdsRequestTest > testAllocateProducersIdSentToController() > [1] Type=Raft-Isolated, Name=testAllocateProducersIdSentToController, MetadataVersion=3.6-IV2, Security=PLAINTEXT PASSED
[2024-03-25T15:05:37.613Z]
[2024-03-25T15:05:37.613Z] Gradle Test Run :core:test > Gradle Test Executor 92 > AllocateProducerIdsRequestTest > testAllocateProducersIdSentToNonController() > [1] Type=Raft-Isolated, Name=testAllocateProducersIdSentToNonController, MetadataVersion=3.6-IV2, Security=PLAINTEXT STARTED
[2024-03-25T15:05:46.634Z]
[2024-03-25T15:05:46.634Z] Gradle Test Run :core:test > Gradle Test Executor 92 > AllocateProducerIdsRequestTest > testAllocateProducersIdSentToNonController() > [1] Type=Raft-Isolated, Name=testAllocateProducersIdSentToNonController, MetadataVersion=3.6-IV2, Security=PLAINTEXT PASSED
[2024-03-25T15:05:54.857Z]
[2024-03-25T15:05:54.857Z] Gradle Test Run :core:test > Gradle Test Executor 98 > DelegationTokenEndToEndAuthorizationWithOwnerTest > testNoGroupAcl(String) > testNoGroupAcl(String).quorum=kraft STARTED
[2024-03-25T15:06:05.787Z]
[2024-03-25T15:06:05.787Z] Gradle Test Run :core:test > Gradle Test Executor 98 > DelegationTokenEndToEndAuthorizationWithOwnerTest > testNoGroupAcl(String) > testNoGroupAcl(String).quorum=kraft PASSED
[2024-03-25T15:06:05.787Z]
[2024-03-25T15:06:05.787Z] Gradle Test Run :core:test > Gradle Test Executor 98 > DelegationTokenEndToEndAuthorizationWithOwnerTest > testNoGroupAcl(String) > testNoGroupAcl(String).quorum=zk STARTED
[2024-03-25T15:06:15.312Z]
[2024-03-25T15:06:15.312Z] Gradle Test Run :core:test > Gradle Test Executor 98 > DelegationTokenEndToEndAuthorizationWithOwnerTest > testNoGroupAcl(String) > testNoGroupAcl(String).quorum=zk PASSED
[2024-03-25T15:06:15.513Z]
[2024-03-25T15:06:15.513Z] 5165 tests completed, 1 failed, 12 skipped
[2024-03-25T15:06:23.832Z] There were failing tests. See the report at: file:///home/jenkins/workspace/Kafka_kafka_3.6/core/build/reports/tests/test/index.html
[2024-03-25T15:06:25.637Z]
[2024-03-25T15:06:25.637Z] Deprecated Gradle features were used in this build, making it incompatible with Gradle 9.0.
[2024-03-25T15:06:25.637Z]
[2024-03-25T15:06:25.638Z] You can use '--warning-mode all' to show the individual deprecation warnings and determine if they come from your own scripts or plugins.
[2024-03-25T15:06:25.638Z]
[2024-03-25T15:06:25.638Z] For more on this, please refer to https://docs.gradle.org/8.2.1/userguide/command_line_interface.html#sec:command_line_warnings in the Gradle documentation.
[2024-03-25T15:06:25.638Z]
[2024-03-25T15:06:25.638Z] BUILD SUCCESSFUL in 2h 39m 58s
[2024-03-25T15:06:25.638Z] 302 actionable tasks: 111 executed, 191 up-to-date
[2024-03-25T15:06:25.939Z]
[2024-03-25T15:06:25.939Z] Publishing build scan...
[2024-03-25T15:06:27.745Z] https://ge.apache.org/s/av6iytz7w3cuc
[2024-03-25T15:06:27.745Z]
[2024-03-25T15:06:27.845Z]
[2024-03-25T15:06:27.845Z] See the profiling report at: file:///home/jenkins/workspace/Kafka_kafka_3.6/build/reports/profile/profile-2024-03-25-12-26-34.html
[2024-03-25T15:06:27.845Z] A fine-grained performance profile is available: use the --scan option.
[Pipeline] junit
[2024-03-25T15:06:28.532Z] Recording test results
[2024-03-25T15:07:19.174Z] [Checks API] No suitable checks publisher found.
[Pipeline] echo
[2024-03-25T15:07:19.175Z] Skipping Kafka Streams archetype test for Java 17
[Pipeline] }
[Pipeline] // withEnv
[Pipeline] }
[Pipeline] // withEnv
[Pipeline] }
[Pipeline] // withEnv
[Pipeline] }
[Pipeline] // node
[Pipeline] }
[Pipeline] // timestamps
[Pipeline] }
[Pipeline] // timeout
[Pipeline] }
[Pipeline] // stage
[Pipeline] }
[Pipeline] // parallel
[Pipeline] }
[Pipeline] // stage
[Pipeline] stage
[Pipeline] { (Declarative: Post Actions)
[Pipeline] script
[Pipeline] {
[Pipeline] node
Still waiting to schedule task
Waiting for next available executor on ‘ubuntu’
Running on EC2 (ec2-Jenkins Ephemeral Node User-CLI) - Jenkins Ephemeral Node - ubuntu label (i-0988cf10251d119fc) in /home/jenkins/workspace/Kafka_kafka_3.6
[Pipeline] {
[Pipeline] step
Jenkins build is still unstable: Kafka » Kafka Branch Builder » 3.6 #168
Posted by Apache Jenkins Server <je...@builds.apache.org>.
See <https://ci-builds.apache.org/job/Kafka/job/kafka/job/3.6/168/display/redirect>
Jenkins build is still unstable: Kafka » Kafka Branch Builder » 3.6 #167
Posted by Apache Jenkins Server <je...@builds.apache.org>.
See <https://ci-builds.apache.org/job/Kafka/job/kafka/job/3.6/167/display/redirect>
Jenkins build is unstable: Kafka » Kafka Branch Builder » 3.6 #166
Posted by Apache Jenkins Server <je...@builds.apache.org>.
See <https://ci-builds.apache.org/job/Kafka/job/kafka/job/3.6/166/display/redirect>
Build failed in Jenkins: Kafka » Kafka Branch Builder » 3.6 #165
Posted by Apache Jenkins Server <je...@builds.apache.org>.
See <https://ci-builds.apache.org/job/Kafka/job/kafka/job/3.6/165/display/redirect>
Changes:
------------------------------------------
[...truncated 307913 lines...]
[2024-03-27T22:56:04.656Z] Gradle Test Run :streams:test > Gradle Test Executor 88 > DefaultStateUpdaterTest > shouldRestoreActiveStatefulTasksAndUpdateStandbyTasks() PASSED
[2024-03-27T22:56:04.656Z]
[2024-03-27T22:56:04.656Z] Gradle Test Run :streams:test > Gradle Test Executor 88 > DefaultStateUpdaterTest > shouldPauseStandbyTask() STARTED
[2024-03-27T22:56:04.656Z]
[2024-03-27T22:56:04.656Z] Gradle Test Run :streams:test > Gradle Test Executor 88 > DefaultStateUpdaterTest > shouldPauseStandbyTask() PASSED
[2024-03-27T22:56:04.656Z]
[2024-03-27T22:56:04.656Z] Gradle Test Run :streams:test > Gradle Test Executor 88 > DefaultStateUpdaterTest > shouldThrowIfStatefulTaskNotInStateRestoring() STARTED
[2024-03-27T22:56:04.656Z]
[2024-03-27T22:56:04.656Z] Gradle Test Run :streams:test > Gradle Test Executor 88 > DefaultStateUpdaterTest > shouldThrowIfStatefulTaskNotInStateRestoring() PASSED
[2024-03-27T22:56:08.108Z]
[2024-03-27T22:56:08.108Z] Gradle Test Run :streams:test > Gradle Test Executor 88 > DefaultTaskExecutorTest > shouldSetUncaughtStreamsException() STARTED
[2024-03-27T22:56:09.691Z]
[2024-03-27T22:56:09.692Z] Gradle Test Run :streams:test > Gradle Test Executor 88 > DefaultTaskExecutorTest > shouldSetUncaughtStreamsException() PASSED
[2024-03-27T22:56:09.692Z]
[2024-03-27T22:56:09.692Z] Gradle Test Run :streams:test > Gradle Test Executor 88 > DefaultTaskExecutorTest > shouldUnassignTaskWhenRequired() STARTED
[2024-03-27T22:56:09.692Z]
[2024-03-27T22:56:09.692Z] Gradle Test Run :streams:test > Gradle Test Executor 88 > DefaultTaskExecutorTest > shouldUnassignTaskWhenRequired() PASSED
[2024-03-27T22:56:09.692Z]
[2024-03-27T22:56:09.692Z] Gradle Test Run :streams:test > Gradle Test Executor 88 > DefaultTaskExecutorTest > shouldProcessTasks() STARTED
[2024-03-27T22:56:09.692Z]
[2024-03-27T22:56:09.692Z] Gradle Test Run :streams:test > Gradle Test Executor 88 > DefaultTaskExecutorTest > shouldProcessTasks() PASSED
[2024-03-27T22:56:09.692Z]
[2024-03-27T22:56:09.692Z] Gradle Test Run :streams:test > Gradle Test Executor 88 > DefaultTaskExecutorTest > shouldPunctuateStreamTime() STARTED
[2024-03-27T22:56:09.692Z]
[2024-03-27T22:56:09.692Z] Gradle Test Run :streams:test > Gradle Test Executor 88 > DefaultTaskExecutorTest > shouldPunctuateStreamTime() PASSED
[2024-03-27T22:56:09.692Z]
[2024-03-27T22:56:09.692Z] Gradle Test Run :streams:test > Gradle Test Executor 88 > DefaultTaskExecutorTest > shouldShutdownTaskExecutor() STARTED
[2024-03-27T22:56:09.692Z]
[2024-03-27T22:56:09.692Z] Gradle Test Run :streams:test > Gradle Test Executor 88 > DefaultTaskExecutorTest > shouldShutdownTaskExecutor() PASSED
[2024-03-27T22:56:09.692Z]
[2024-03-27T22:56:09.692Z] Gradle Test Run :streams:test > Gradle Test Executor 88 > DefaultTaskExecutorTest > shouldRespectPunctuationDisabledByTaskExecutionMetadata() STARTED
[2024-03-27T22:56:09.692Z]
[2024-03-27T22:56:09.692Z] Gradle Test Run :streams:test > Gradle Test Executor 88 > DefaultTaskExecutorTest > shouldRespectPunctuationDisabledByTaskExecutionMetadata() PASSED
[2024-03-27T22:56:09.692Z]
[2024-03-27T22:56:09.692Z] Gradle Test Run :streams:test > Gradle Test Executor 88 > DefaultTaskExecutorTest > shouldPunctuateSystemTime() STARTED
[2024-03-27T22:56:09.692Z]
[2024-03-27T22:56:09.692Z] Gradle Test Run :streams:test > Gradle Test Executor 88 > DefaultTaskExecutorTest > shouldPunctuateSystemTime() PASSED
[2024-03-27T22:56:09.692Z]
[2024-03-27T22:56:09.692Z] Gradle Test Run :streams:test > Gradle Test Executor 88 > DefaultTaskExecutorTest > shouldUnassignTaskWhenNotProgressing() STARTED
[2024-03-27T22:56:09.692Z]
[2024-03-27T22:56:09.692Z] Gradle Test Run :streams:test > Gradle Test Executor 88 > DefaultTaskExecutorTest > shouldUnassignTaskWhenNotProgressing() PASSED
[2024-03-27T22:56:09.692Z]
[2024-03-27T22:56:09.692Z] Gradle Test Run :streams:test > Gradle Test Executor 88 > DefaultTaskExecutorTest > shouldRespectProcessingDisabledByTaskExecutionMetadata() STARTED
[2024-03-27T22:56:09.692Z]
[2024-03-27T22:56:09.692Z] Gradle Test Run :streams:test > Gradle Test Executor 88 > DefaultTaskExecutorTest > shouldRespectProcessingDisabledByTaskExecutionMetadata() PASSED
[2024-03-27T22:56:09.692Z]
[2024-03-27T22:56:09.692Z] Gradle Test Run :streams:test > Gradle Test Executor 88 > StateQueryResultTest > More than one query result throws IllegalArgumentException STARTED
[2024-03-27T22:56:09.692Z]
[2024-03-27T22:56:09.692Z] Gradle Test Run :streams:test > Gradle Test Executor 88 > StateQueryResultTest > More than one query result throws IllegalArgumentException PASSED
[2024-03-27T22:56:09.692Z]
[2024-03-27T22:56:09.692Z] Gradle Test Run :streams:test > Gradle Test Executor 88 > StateQueryResultTest > Zero query results shouldn't error STARTED
[2024-03-27T22:56:09.692Z]
[2024-03-27T22:56:09.692Z] Gradle Test Run :streams:test > Gradle Test Executor 88 > StateQueryResultTest > Zero query results shouldn't error PASSED
[2024-03-27T22:56:09.692Z]
[2024-03-27T22:56:09.692Z] Gradle Test Run :streams:test > Gradle Test Executor 88 > StateQueryResultTest > Valid query results still works STARTED
[2024-03-27T22:56:09.692Z]
[2024-03-27T22:56:09.692Z] Gradle Test Run :streams:test > Gradle Test Executor 88 > StateQueryResultTest > Valid query results still works PASSED
[2024-03-27T22:56:09.692Z]
[2024-03-27T22:56:09.692Z] Gradle Test Run :streams:test > Gradle Test Executor 88 > RocksDBBlockCacheMetricsTest > shouldRecordCorrectBlockCacheUsage(RocksDBStore, StateStoreContext) > [1] org.apache.kafka.streams.state.internals.RocksDBStore@42d013e5, org.apache.kafka.test.MockInternalProcessorContext@465047ee STARTED
[2024-03-27T22:56:11.099Z]
[2024-03-27T22:56:11.099Z] Gradle Test Run :streams:test > Gradle Test Executor 88 > RocksDBBlockCacheMetricsTest > shouldRecordCorrectBlockCacheUsage(RocksDBStore, StateStoreContext) > [1] org.apache.kafka.streams.state.internals.RocksDBStore@42d013e5, org.apache.kafka.test.MockInternalProcessorContext@465047ee PASSED
[2024-03-27T22:56:11.099Z]
[2024-03-27T22:56:11.099Z] Gradle Test Run :streams:test > Gradle Test Executor 88 > RocksDBBlockCacheMetricsTest > shouldRecordCorrectBlockCacheUsage(RocksDBStore, StateStoreContext) > [2] org.apache.kafka.streams.state.internals.RocksDBTimestampedStore@655fd70e, org.apache.kafka.test.MockInternalProcessorContext@31735ac0 STARTED
[2024-03-27T22:56:11.099Z]
[2024-03-27T22:56:11.099Z] Gradle Test Run :streams:test > Gradle Test Executor 88 > RocksDBBlockCacheMetricsTest > shouldRecordCorrectBlockCacheUsage(RocksDBStore, StateStoreContext) > [2] org.apache.kafka.streams.state.internals.RocksDBTimestampedStore@655fd70e, org.apache.kafka.test.MockInternalProcessorContext@31735ac0 PASSED
[2024-03-27T22:56:11.099Z]
[2024-03-27T22:56:11.099Z] Gradle Test Run :streams:test > Gradle Test Executor 88 > RocksDBBlockCacheMetricsTest > shouldRecordCorrectBlockCachePinnedUsage(RocksDBStore, StateStoreContext) > [1] org.apache.kafka.streams.state.internals.RocksDBStore@18348bc3, org.apache.kafka.test.MockInternalProcessorContext@7846cb50 STARTED
[2024-03-27T22:56:12.682Z]
[2024-03-27T22:56:12.683Z] Gradle Test Run :streams:test > Gradle Test Executor 88 > RocksDBBlockCacheMetricsTest > shouldRecordCorrectBlockCachePinnedUsage(RocksDBStore, StateStoreContext) > [1] org.apache.kafka.streams.state.internals.RocksDBStore@18348bc3, org.apache.kafka.test.MockInternalProcessorContext@7846cb50 PASSED
[2024-03-27T22:56:12.683Z]
[2024-03-27T22:56:12.683Z] Gradle Test Run :streams:test > Gradle Test Executor 88 > RocksDBBlockCacheMetricsTest > shouldRecordCorrectBlockCachePinnedUsage(RocksDBStore, StateStoreContext) > [2] org.apache.kafka.streams.state.internals.RocksDBTimestampedStore@4f85ff4c, org.apache.kafka.test.MockInternalProcessorContext@187efec0 STARTED
[2024-03-27T22:56:12.683Z]
[2024-03-27T22:56:12.683Z] Gradle Test Run :streams:test > Gradle Test Executor 88 > RocksDBBlockCacheMetricsTest > shouldRecordCorrectBlockCachePinnedUsage(RocksDBStore, StateStoreContext) > [2] org.apache.kafka.streams.state.internals.RocksDBTimestampedStore@4f85ff4c, org.apache.kafka.test.MockInternalProcessorContext@187efec0 PASSED
[2024-03-27T22:56:12.683Z]
[2024-03-27T22:56:12.683Z] Gradle Test Run :streams:test > Gradle Test Executor 88 > RocksDBBlockCacheMetricsTest > shouldRecordCorrectBlockCacheCapacity(RocksDBStore, StateStoreContext) > [1] org.apache.kafka.streams.state.internals.RocksDBStore@48354871, org.apache.kafka.test.MockInternalProcessorContext@1f294202 STARTED
[2024-03-27T22:56:12.683Z]
[2024-03-27T22:56:12.683Z] Gradle Test Run :streams:test > Gradle Test Executor 88 > RocksDBBlockCacheMetricsTest > shouldRecordCorrectBlockCacheCapacity(RocksDBStore, StateStoreContext) > [1] org.apache.kafka.streams.state.internals.RocksDBStore@48354871, org.apache.kafka.test.MockInternalProcessorContext@1f294202 PASSED
[2024-03-27T22:56:12.683Z]
[2024-03-27T22:56:12.683Z] Gradle Test Run :streams:test > Gradle Test Executor 88 > RocksDBBlockCacheMetricsTest > shouldRecordCorrectBlockCacheCapacity(RocksDBStore, StateStoreContext) > [2] org.apache.kafka.streams.state.internals.RocksDBTimestampedStore@69571d7, org.apache.kafka.test.MockInternalProcessorContext@17f07633 STARTED
[2024-03-27T22:56:14.441Z]
[2024-03-27T22:56:14.441Z] Gradle Test Run :streams:test > Gradle Test Executor 88 > RocksDBBlockCacheMetricsTest > shouldRecordCorrectBlockCacheCapacity(RocksDBStore, StateStoreContext) > [2] org.apache.kafka.streams.state.internals.RocksDBTimestampedStore@69571d7, org.apache.kafka.test.MockInternalProcessorContext@17f07633 PASSED
[2024-03-27T22:56:20.608Z]
[2024-03-27T22:56:20.608Z] Gradle Test Run :streams:test > Gradle Test Executor 88 > RocksDBMetricsRecorderTest > shouldThrowIfDbToAddWasAlreadyAddedForOtherSegment() STARTED
[2024-03-27T22:56:23.425Z]
[2024-03-27T22:56:23.425Z] Gradle Test Run :streams:test > Gradle Test Executor 88 > RocksDBMetricsRecorderTest > shouldThrowIfDbToAddWasAlreadyAddedForOtherSegment() PASSED
[2024-03-27T22:56:23.425Z]
[2024-03-27T22:56:23.425Z] Gradle Test Run :streams:test > Gradle Test Executor 88 > RocksDBMetricsRecorderTest > shouldAddItselfToRecordingTriggerWhenFirstValueProvidersAreAddedAfterLastValueProvidersWereRemoved() STARTED
[2024-03-27T22:56:23.425Z]
[2024-03-27T22:56:23.425Z] Gradle Test Run :streams:test > Gradle Test Executor 88 > RocksDBMetricsRecorderTest > shouldAddItselfToRecordingTriggerWhenFirstValueProvidersAreAddedAfterLastValueProvidersWereRemoved() PASSED
[2024-03-27T22:56:23.425Z]
[2024-03-27T22:56:23.425Z] Gradle Test Run :streams:test > Gradle Test Executor 88 > RocksDBMetricsRecorderTest > shouldThrowIfValueProvidersToRemoveNotFound() STARTED
[2024-03-27T22:56:23.425Z]
[2024-03-27T22:56:23.425Z] Gradle Test Run :streams:test > Gradle Test Executor 88 > RocksDBMetricsRecorderTest > shouldThrowIfValueProvidersToRemoveNotFound() PASSED
[2024-03-27T22:56:23.425Z]
[2024-03-27T22:56:23.425Z] Gradle Test Run :streams:test > Gradle Test Executor 88 > RocksDBMetricsRecorderTest > shouldThrowIfCacheToAddIsSameAsOnlyOneOfMultipleCaches() STARTED
[2024-03-27T22:56:23.425Z]
[2024-03-27T22:56:23.425Z] Gradle Test Run :streams:test > Gradle Test Executor 88 > RocksDBMetricsRecorderTest > shouldThrowIfCacheToAddIsSameAsOnlyOneOfMultipleCaches() PASSED
[2024-03-27T22:56:23.425Z]
[2024-03-27T22:56:23.425Z] Gradle Test Run :streams:test > Gradle Test Executor 88 > RocksDBMetricsRecorderTest > shouldNotSetStatsLevelToExceptDetailedTimersWhenValueProvidersWithoutStatisticsAreAdded() STARTED
[2024-03-27T22:56:23.425Z]
[2024-03-27T22:56:23.425Z] Gradle Test Run :streams:test > Gradle Test Executor 88 > RocksDBMetricsRecorderTest > shouldNotSetStatsLevelToExceptDetailedTimersWhenValueProvidersWithoutStatisticsAreAdded() PASSED
[2024-03-27T22:56:23.425Z]
[2024-03-27T22:56:23.425Z] Gradle Test Run :streams:test > Gradle Test Executor 88 > RocksDBMetricsRecorderTest > shouldNotRemoveItselfFromRecordingTriggerWhenAtLeastOneValueProviderIsPresent() STARTED
[2024-03-27T22:56:23.425Z]
[2024-03-27T22:56:23.425Z] Gradle Test Run :streams:test > Gradle Test Executor 88 > RocksDBMetricsRecorderTest > shouldNotRemoveItselfFromRecordingTriggerWhenAtLeastOneValueProviderIsPresent() PASSED
[2024-03-27T22:56:23.425Z]
[2024-03-27T22:56:23.425Z] Gradle Test Run :streams:test > Gradle Test Executor 88 > RocksDBMetricsRecorderTest > shouldRemoveItselfFromRecordingTriggerWhenAllValueProvidersAreRemoved() STARTED
[2024-03-27T22:56:23.425Z]
[2024-03-27T22:56:23.425Z] Gradle Test Run :streams:test > Gradle Test Executor 88 > RocksDBMetricsRecorderTest > shouldRemoveItselfFromRecordingTriggerWhenAllValueProvidersAreRemoved() PASSED
[2024-03-27T22:56:23.425Z]
[2024-03-27T22:56:23.425Z] Gradle Test Run :streams:test > Gradle Test Executor 88 > RocksDBMetricsRecorderTest > shouldAddItselfToRecordingTriggerWhenFirstValueProvidersAreAddedToNewlyCreatedRecorder() STARTED
[2024-03-27T22:56:23.425Z]
[2024-03-27T22:56:23.425Z] Gradle Test Run :streams:test > Gradle Test Executor 88 > RocksDBMetricsRecorderTest > shouldAddItselfToRecordingTriggerWhenFirstValueProvidersAreAddedToNewlyCreatedRecorder() PASSED
[2024-03-27T22:56:23.425Z]
[2024-03-27T22:56:23.425Z] Gradle Test Run :streams:test > Gradle Test Executor 88 > RocksDBMetricsRecorderTest > shouldThrowIfValueProvidersForASegmentHasBeenAlreadyAdded() STARTED
[2024-03-27T22:56:23.425Z]
[2024-03-27T22:56:23.425Z] Gradle Test Run :streams:test > Gradle Test Executor 88 > RocksDBMetricsRecorderTest > shouldThrowIfValueProvidersForASegmentHasBeenAlreadyAdded() PASSED
[2024-03-27T22:56:23.425Z]
[2024-03-27T22:56:23.425Z] Gradle Test Run :streams:test > Gradle Test Executor 88 > RocksDBMetricsRecorderTest > shouldCorrectlyHandleHitRatioRecordingsWithZeroHitsAndMisses() STARTED
[2024-03-27T22:56:23.425Z]
[2024-03-27T22:56:23.425Z] Gradle Test Run :streams:test > Gradle Test Executor 88 > RocksDBMetricsRecorderTest > shouldCorrectlyHandleHitRatioRecordingsWithZeroHitsAndMisses() PASSED
[2024-03-27T22:56:23.425Z]
[2024-03-27T22:56:23.425Z] Gradle Test Run :streams:test > Gradle Test Executor 88 > RocksDBMetricsRecorderTest > shouldThrowIfCacheToAddIsNotNullButExistingCacheIsNull() STARTED
[2024-03-27T22:56:23.425Z]
[2024-03-27T22:56:23.425Z] Gradle Test Run :streams:test > Gradle Test Executor 88 > RocksDBMetricsRecorderTest > shouldThrowIfCacheToAddIsNotNullButExistingCacheIsNull() PASSED
[2024-03-27T22:56:23.425Z]
[2024-03-27T22:56:23.425Z] Gradle Test Run :streams:test > Gradle Test Executor 88 > RocksDBMetricsRecorderTest > shouldThrowIfCacheToAddIsNullButExistingCacheIsNotNull() STARTED
[2024-03-27T22:56:23.425Z]
[2024-03-27T22:56:23.425Z] Gradle Test Run :streams:test > Gradle Test Executor 88 > RocksDBMetricsRecorderTest > shouldThrowIfCacheToAddIsNullButExistingCacheIsNotNull() PASSED
[2024-03-27T22:56:23.426Z]
[2024-03-27T22:56:23.426Z] Gradle Test Run :streams:test > Gradle Test Executor 88 > RocksDBMetricsRecorderTest > shouldThrowIfStatisticsToAddIsNotNullButExistingStatisticsAreNull() STARTED
[2024-03-27T22:56:23.426Z]
[2024-03-27T22:56:23.426Z] Gradle Test Run :streams:test > Gradle Test Executor 88 > RocksDBMetricsRecorderTest > shouldThrowIfStatisticsToAddIsNotNullButExistingStatisticsAreNull() PASSED
[2024-03-27T22:56:23.426Z]
[2024-03-27T22:56:23.426Z] Gradle Test Run :streams:test > Gradle Test Executor 88 > RocksDBMetricsRecorderTest > shouldThrowIfCacheToAddIsNotSameAsAllExistingCaches() STARTED
[2024-03-27T22:56:23.426Z]
[2024-03-27T22:56:23.426Z] Gradle Test Run :streams:test > Gradle Test Executor 88 > RocksDBMetricsRecorderTest > shouldThrowIfCacheToAddIsNotSameAsAllExistingCaches() PASSED
[2024-03-27T22:56:23.426Z]
[2024-03-27T22:56:23.426Z] Gradle Test Run :streams:test > Gradle Test Executor 88 > RocksDBMetricsRecorderTest > shouldNotRecordStatisticsBasedMetricsIfStatisticsIsNull() STARTED
[2024-03-27T22:56:23.426Z]
[2024-03-27T22:56:23.426Z] Gradle Test Run :streams:test > Gradle Test Executor 88 > RocksDBMetricsRecorderTest > shouldNotRecordStatisticsBasedMetricsIfStatisticsIsNull() PASSED
[2024-03-27T22:56:23.426Z]
[2024-03-27T22:56:23.426Z] Gradle Test Run :streams:test > Gradle Test Executor 88 > RocksDBMetricsRecorderTest > shouldSetStatsLevelToExceptDetailedTimersWhenValueProvidersWithStatisticsAreAdded() STARTED
[2024-03-27T22:56:23.426Z]
[2024-03-27T22:56:23.426Z] Gradle Test Run :streams:test > Gradle Test Executor 88 > RocksDBMetricsRecorderTest > shouldSetStatsLevelToExceptDetailedTimersWhenValueProvidersWithStatisticsAreAdded() PASSED
[2024-03-27T22:56:23.426Z]
[2024-03-27T22:56:23.426Z] Gradle Test Run :streams:test > Gradle Test Executor 88 > RocksDBMetricsRecorderTest > shouldRecordStatisticsBasedMetrics() STARTED
[2024-03-27T22:56:23.426Z]
[2024-03-27T22:56:23.426Z] Gradle Test Run :streams:test > Gradle Test Executor 88 > RocksDBMetricsRecorderTest > shouldRecordStatisticsBasedMetrics() PASSED
[2024-03-27T22:56:23.426Z]
[2024-03-27T22:56:23.426Z] Gradle Test Run :streams:test > Gradle Test Executor 88 > RocksDBMetricsRecorderTest > shouldThrowIfMetricRecorderIsReInitialisedWithDifferentStreamsMetrics() STARTED
[2024-03-27T22:56:23.426Z]
[2024-03-27T22:56:23.426Z] Gradle Test Run :streams:test > Gradle Test Executor 88 > RocksDBMetricsRecorderTest > shouldThrowIfMetricRecorderIsReInitialisedWithDifferentStreamsMetrics() PASSED
[2024-03-27T22:56:23.426Z]
[2024-03-27T22:56:23.426Z] Gradle Test Run :streams:test > Gradle Test Executor 88 > RocksDBMetricsRecorderTest > shouldInitMetricsRecorder() STARTED
[2024-03-27T22:56:23.426Z]
[2024-03-27T22:56:23.426Z] Gradle Test Run :streams:test > Gradle Test Executor 88 > RocksDBMetricsRecorderTest > shouldInitMetricsRecorder() PASSED
[2024-03-27T22:56:23.426Z]
[2024-03-27T22:56:23.426Z] Gradle Test Run :streams:test > Gradle Test Executor 88 > RocksDBMetricsRecorderTest > shouldThrowIfMetricRecorderIsReInitialisedWithDifferentTask() STARTED
[2024-03-27T22:56:23.426Z]
[2024-03-27T22:56:23.426Z] Gradle Test Run :streams:test > Gradle Test Executor 88 > RocksDBMetricsRecorderTest > shouldThrowIfMetricRecorderIsReInitialisedWithDifferentTask() PASSED
[2024-03-27T22:56:23.426Z]
[2024-03-27T22:56:23.426Z] Gradle Test Run :streams:test > Gradle Test Executor 88 > RocksDBMetricsRecorderTest > shouldCorrectlyHandleAvgRecordingsWithZeroSumAndCount() STARTED
[2024-03-27T22:56:23.426Z]
[2024-03-27T22:56:23.426Z] Gradle Test Run :streams:test > Gradle Test Executor 88 > RocksDBMetricsRecorderTest > shouldCorrectlyHandleAvgRecordingsWithZeroSumAndCount() PASSED
[2024-03-27T22:56:23.426Z]
[2024-03-27T22:56:23.426Z] Gradle Test Run :streams:test > Gradle Test Executor 88 > RocksDBMetricsRecorderTest > shouldThrowIfStatisticsToAddIsNullButExistingStatisticsAreNotNull() STARTED
[2024-03-27T22:56:23.426Z]
[2024-03-27T22:56:23.426Z] Gradle Test Run :streams:test > Gradle Test Executor 88 > RocksDBMetricsRecorderTest > shouldThrowIfStatisticsToAddIsNullButExistingStatisticsAreNotNull() PASSED
[2024-03-27T22:56:23.426Z]
[2024-03-27T22:56:23.426Z] Gradle Test Run :streams:test > Gradle Test Executor 88 > RocksDBMetricsRecorderTest > shouldNotAddItselfToRecordingTriggerWhenNotEmpty() STARTED
[2024-03-27T22:56:24.833Z]
[2024-03-27T22:56:24.833Z] Gradle Test Run :streams:test > Gradle Test Executor 88 > RocksDBMetricsRecorderTest > shouldNotAddItselfToRecordingTriggerWhenNotEmpty() PASSED
Cancelling nested steps due to timeout
[2024-03-28T01:57:40.938Z] Sending interrupt signal to process
[2024-03-28T01:57:59.106Z]
[2024-03-28T01:57:59.106Z] > Task :core:test FAILED
[2024-03-28T01:57:59.106Z]
[2024-03-28T01:57:59.106Z] FAILURE: Build completed with 2 failures.
[2024-03-28T01:57:59.106Z]
[2024-03-28T01:57:59.106Z] 1: Task failed with an exception.
[2024-03-28T01:57:59.106Z] -----------
[2024-03-28T01:57:59.106Z] * What went wrong:
[2024-03-28T01:57:59.106Z] Execution failed for task ':streams:upgrade-system-tests-35:test'.
[2024-03-28T01:57:59.106Z] > Process 'Gradle Test Executor 6' finished with non-zero exit value 1
[2024-03-28T01:57:59.106Z] This problem might be caused by incorrect test process configuration.
[2024-03-28T01:57:59.106Z] For more on test execution, please refer to https://docs.gradle.org/8.2.1/userguide/java_testing.html#sec:test_execution in the Gradle documentation.
[2024-03-28T01:57:59.106Z]
[2024-03-28T01:57:59.106Z] * Try:
[2024-03-28T01:57:59.106Z] > Run with --stacktrace option to get the stack trace.
[2024-03-28T01:57:59.106Z] > Run with --info or --debug option to get more log output.
[2024-03-28T01:57:59.106Z] > Get more help at https://help.gradle.org.
[2024-03-28T01:57:59.106Z] ==============================================================================
[2024-03-28T01:57:59.106Z]
[2024-03-28T01:57:59.106Z] 2: Task failed with an exception.
[2024-03-28T01:57:59.106Z] -----------
[2024-03-28T01:57:59.106Z] * What went wrong:
[2024-03-28T01:57:59.106Z] Execution failed for task ':core:test'.
[2024-03-28T01:57:59.106Z] > Process 'Gradle Test Executor 94' finished with non-zero exit value 143
[2024-03-28T01:57:59.106Z] This problem might be caused by incorrect test process configuration.
[2024-03-28T01:57:59.106Z] For more on test execution, please refer to https://docs.gradle.org/8.2.1/userguide/java_testing.html#sec:test_execution in the Gradle documentation.
[2024-03-28T01:57:59.106Z]
[2024-03-28T01:57:59.106Z] * Try:
[2024-03-28T01:57:59.106Z] > Run with --stacktrace option to get the stack trace.
[2024-03-28T01:57:59.106Z] > Run with --info or --debug option to get more log output.
[2024-03-28T01:57:59.106Z] > Get more help at https://help.gradle.org.
[2024-03-28T01:57:59.106Z] ==============================================================================
[2024-03-28T01:57:59.106Z]
[2024-03-28T01:57:59.106Z] Deprecated Gradle features were used in this build, making it incompatible with Gradle 9.0.
[2024-03-28T01:57:59.106Z]
[2024-03-28T01:57:59.106Z] You can use '--warning-mode all' to show the individual deprecation warnings and determine if they come from your own scripts or plugins.
[2024-03-28T01:57:59.106Z]
[2024-03-28T01:57:59.106Z] For more on this, please refer to https://docs.gradle.org/8.2.1/userguide/command_line_interface.html#sec:command_line_warnings in the Gradle documentation.
[2024-03-28T01:57:59.106Z]
[2024-03-28T01:57:59.106Z] BUILD FAILED in 6h 18m 19s
[2024-03-28T01:57:59.106Z] 302 actionable tasks: 111 executed, 191 up-to-date
[2024-03-28T01:57:59.106Z]
[2024-03-28T01:57:59.106Z] Publishing build scan...
[2024-03-28T01:57:59.106Z] The message received from the daemon indicates that the daemon has disappeared.
[2024-03-28T01:57:59.106Z] Build request sent: Build{id=93213a50-8629-4e22-976c-ac45b89a376b, currentDir=/home/jenkins/jenkins-agent/workspace/Kafka_kafka_3.6}
[2024-03-28T01:57:59.106Z] Attempting to read last messages from the daemon log...
[2024-03-28T01:58:00.161Z] script returned exit code 143
[Pipeline] }
[Pipeline] // withEnv
[Pipeline] }
[Pipeline] // withEnv
[Pipeline] }
[Pipeline] // withEnv
[Pipeline] }
[Pipeline] // node
[Pipeline] }
[Pipeline] // timestamps
[Pipeline] }
[Pipeline] // timeout
[Pipeline] }
[Pipeline] // stage
[Pipeline] }
Failed in branch JDK 17 and Scala 2.13
[Pipeline] // parallel
[Pipeline] }
[Pipeline] // stage
[Pipeline] stage
[Pipeline] { (Declarative: Post Actions)
[Pipeline] script
[Pipeline] {
[Pipeline] node
Running on builds37 in /home/jenkins/jenkins-agent/workspace/Kafka_kafka_3.6
[Pipeline] {
[Pipeline] step