You are viewing a plain text version of this content. The canonical link for it is here.
Posted to builds@beam.apache.org by Apache Jenkins Server <je...@builds.apache.org> on 2019/07/24 23:58:49 UTC
Build failed in Jenkins: beam_PostCommit_Python2 #45
See <https://builds.apache.org/job/beam_PostCommit_Python2/45/display/redirect?page=changes>
Changes:
[rohde.samuel] Update the Dataflow API version to 0607
------------------------------------------
[...truncated 1.03 MB...]
[CHAIN MapPartition (MapPartition at [3]{ExternalTransform(pytest:beam:transforms:filter_less_than), ExternalTransform(pytest:beam:transforms:count)}) -> FlatMap (FlatMap at ExtractOutput[0]) -> Map (Key Extractor) -> GroupCombine (GroupCombine at GroupCombine: ExternalTransform(pytest:beam:transforms:count)/Combine.perKey(Count)/Group) -> Map (Key Extractor) (1/2)] INFO org.apache.flink.runtime.taskmanager.Task - Ensuring all FileSystem streams are closed for task CHAIN MapPartition (MapPartition at [3]{ExternalTransform(pytest:beam:transforms:filter_less_than), ExternalTransform(pytest:beam:transforms:count)}) -> FlatMap (FlatMap at ExtractOutput[0]) -> Map (Key Extractor) -> GroupCombine (GroupCombine at GroupCombine: ExternalTransform(pytest:beam:transforms:count)/Combine.perKey(Count)/Group) -> Map (Key Extractor) (1/2) (d3a341b2f793377960d5f83a6c573d2d) [FINISHED]
[CHAIN MapPartition (MapPartition at [3]{ExternalTransform(pytest:beam:transforms:filter_less_than), ExternalTransform(pytest:beam:transforms:count)}) -> FlatMap (FlatMap at ExtractOutput[0]) -> Map (Key Extractor) -> GroupCombine (GroupCombine at GroupCombine: ExternalTransform(pytest:beam:transforms:count)/Combine.perKey(Count)/Group) -> Map (Key Extractor) (2/2)] INFO org.apache.flink.runtime.taskmanager.Task - Ensuring all FileSystem streams are closed for task CHAIN MapPartition (MapPartition at [3]{ExternalTransform(pytest:beam:transforms:filter_less_than), ExternalTransform(pytest:beam:transforms:count)}) -> FlatMap (FlatMap at ExtractOutput[0]) -> Map (Key Extractor) -> GroupCombine (GroupCombine at GroupCombine: ExternalTransform(pytest:beam:transforms:count)/Combine.perKey(Count)/Group) -> Map (Key Extractor) (2/2) (b67a4ec4b8b6d0da469218253a905893) [FINISHED]
[flink-akka.actor.default-dispatcher-9] INFO org.apache.flink.runtime.taskexecutor.TaskExecutor - Un-registering task and sending final execution state FINISHED to JobManager for task CHAIN MapPartition (MapPartition at [3]{ExternalTransform(pytest:beam:transforms:filter_less_than), ExternalTransform(pytest:beam:transforms:count)}) -> FlatMap (FlatMap at ExtractOutput[0]) -> Map (Key Extractor) -> GroupCombine (GroupCombine at GroupCombine: ExternalTransform(pytest:beam:transforms:count)/Combine.perKey(Count)/Group) -> Map (Key Extractor) d3a341b2f793377960d5f83a6c573d2d.
[flink-akka.actor.default-dispatcher-9] INFO org.apache.flink.runtime.taskexecutor.TaskExecutor - Un-registering task and sending final execution state FINISHED to JobManager for task CHAIN MapPartition (MapPartition at [3]{ExternalTransform(pytest:beam:transforms:filter_less_than), ExternalTransform(pytest:beam:transforms:count)}) -> FlatMap (FlatMap at ExtractOutput[0]) -> Map (Key Extractor) -> GroupCombine (GroupCombine at GroupCombine: ExternalTransform(pytest:beam:transforms:count)/Combine.perKey(Count)/Group) -> Map (Key Extractor) b67a4ec4b8b6d0da469218253a905893.
[flink-akka.actor.default-dispatcher-5] INFO org.apache.flink.runtime.executiongraph.ExecutionGraph - CHAIN MapPartition (MapPartition at [3]{ExternalTransform(pytest:beam:transforms:filter_less_than), ExternalTransform(pytest:beam:transforms:count)}) -> FlatMap (FlatMap at ExtractOutput[0]) -> Map (Key Extractor) -> GroupCombine (GroupCombine at GroupCombine: ExternalTransform(pytest:beam:transforms:count)/Combine.perKey(Count)/Group) -> Map (Key Extractor) (1/2) (d3a341b2f793377960d5f83a6c573d2d) switched from RUNNING to FINISHED.
[flink-akka.actor.default-dispatcher-5] INFO org.apache.flink.runtime.executiongraph.ExecutionGraph - CHAIN MapPartition (MapPartition at [3]{ExternalTransform(pytest:beam:transforms:filter_less_than), ExternalTransform(pytest:beam:transforms:count)}) -> FlatMap (FlatMap at ExtractOutput[0]) -> Map (Key Extractor) -> GroupCombine (GroupCombine at GroupCombine: ExternalTransform(pytest:beam:transforms:count)/Combine.perKey(Count)/Group) -> Map (Key Extractor) (2/2) (b67a4ec4b8b6d0da469218253a905893) switched from RUNNING to FINISHED.
[jobmanager-future-thread-13] INFO org.apache.flink.runtime.executiongraph.ExecutionGraph - CHAIN MapPartition (MapPartition at [2]ExternalTransform(pytest:beam:transforms:count)/Combine.perKey(Count)/{Merge, ExtractOutputs}) -> FlatMap (FlatMap at ExtractOutput[0]) (2/2) (da3efb61e9d4472cb0e4060feee05c64) switched from CREATED to SCHEDULED.
[flink-akka.actor.default-dispatcher-5] INFO org.apache.flink.runtime.executiongraph.ExecutionGraph - CHAIN MapPartition (MapPartition at [2]ExternalTransform(pytest:beam:transforms:count)/Combine.perKey(Count)/{Merge, ExtractOutputs}) -> FlatMap (FlatMap at ExtractOutput[0]) (2/2) (da3efb61e9d4472cb0e4060feee05c64) switched from SCHEDULED to DEPLOYING.
[flink-akka.actor.default-dispatcher-5] INFO org.apache.flink.runtime.executiongraph.ExecutionGraph - Deploying CHAIN MapPartition (MapPartition at [2]ExternalTransform(pytest:beam:transforms:count)/Combine.perKey(Count)/{Merge, ExtractOutputs}) -> FlatMap (FlatMap at ExtractOutput[0]) (2/2) (attempt #0) to localhost
[flink-akka.actor.default-dispatcher-8] INFO org.apache.flink.runtime.taskexecutor.TaskExecutor - Received task CHAIN MapPartition (MapPartition at [2]ExternalTransform(pytest:beam:transforms:count)/Combine.perKey(Count)/{Merge, ExtractOutputs}) -> FlatMap (FlatMap at ExtractOutput[0]) (2/2).
[CHAIN MapPartition (MapPartition at [2]ExternalTransform(pytest:beam:transforms:count)/Combine.perKey(Count)/{Merge, ExtractOutputs}) -> FlatMap (FlatMap at ExtractOutput[0]) (2/2)] INFO org.apache.flink.runtime.taskmanager.Task - CHAIN MapPartition (MapPartition at [2]ExternalTransform(pytest:beam:transforms:count)/Combine.perKey(Count)/{Merge, ExtractOutputs}) -> FlatMap (FlatMap at ExtractOutput[0]) (2/2) (da3efb61e9d4472cb0e4060feee05c64) switched from CREATED to DEPLOYING.
[CHAIN MapPartition (MapPartition at [2]ExternalTransform(pytest:beam:transforms:count)/Combine.perKey(Count)/{Merge, ExtractOutputs}) -> FlatMap (FlatMap at ExtractOutput[0]) (2/2)] INFO org.apache.flink.runtime.taskmanager.Task - Creating FileSystem stream leak safety net for task CHAIN MapPartition (MapPartition at [2]ExternalTransform(pytest:beam:transforms:count)/Combine.perKey(Count)/{Merge, ExtractOutputs}) -> FlatMap (FlatMap at ExtractOutput[0]) (2/2) (da3efb61e9d4472cb0e4060feee05c64) [DEPLOYING]
[CHAIN MapPartition (MapPartition at [2]ExternalTransform(pytest:beam:transforms:count)/Combine.perKey(Count)/{Merge, ExtractOutputs}) -> FlatMap (FlatMap at ExtractOutput[0]) (2/2)] INFO org.apache.flink.runtime.taskmanager.Task - Loading JAR files for task CHAIN MapPartition (MapPartition at [2]ExternalTransform(pytest:beam:transforms:count)/Combine.perKey(Count)/{Merge, ExtractOutputs}) -> FlatMap (FlatMap at ExtractOutput[0]) (2/2) (da3efb61e9d4472cb0e4060feee05c64) [DEPLOYING].
[CHAIN MapPartition (MapPartition at [2]ExternalTransform(pytest:beam:transforms:count)/Combine.perKey(Count)/{Merge, ExtractOutputs}) -> FlatMap (FlatMap at ExtractOutput[0]) (2/2)] INFO org.apache.flink.runtime.taskmanager.Task - Registering task at network: CHAIN MapPartition (MapPartition at [2]ExternalTransform(pytest:beam:transforms:count)/Combine.perKey(Count)/{Merge, ExtractOutputs}) -> FlatMap (FlatMap at ExtractOutput[0]) (2/2) (da3efb61e9d4472cb0e4060feee05c64) [DEPLOYING].
[CHAIN MapPartition (MapPartition at [2]ExternalTransform(pytest:beam:transforms:count)/Combine.perKey(Count)/{Merge, ExtractOutputs}) -> FlatMap (FlatMap at ExtractOutput[0]) (2/2)] INFO org.apache.flink.runtime.taskmanager.Task - CHAIN MapPartition (MapPartition at [2]ExternalTransform(pytest:beam:transforms:count)/Combine.perKey(Count)/{Merge, ExtractOutputs}) -> FlatMap (FlatMap at ExtractOutput[0]) (2/2) (da3efb61e9d4472cb0e4060feee05c64) switched from DEPLOYING to RUNNING.
[flink-akka.actor.default-dispatcher-8] INFO org.apache.flink.runtime.executiongraph.ExecutionGraph - CHAIN MapPartition (MapPartition at [2]ExternalTransform(pytest:beam:transforms:count)/Combine.perKey(Count)/{Merge, ExtractOutputs}) -> FlatMap (FlatMap at ExtractOutput[0]) (2/2) (da3efb61e9d4472cb0e4060feee05c64) switched from DEPLOYING to RUNNING.
[CHAIN MapPartition (MapPartition at [2]ExternalTransform(pytest:beam:transforms:count)/Combine.perKey(Count)/{Merge, ExtractOutputs}) -> FlatMap (FlatMap at ExtractOutput[0]) (2/2)] WARN org.apache.flink.metrics.MetricGroup - The operator name MapPartition (MapPartition at [2]ExternalTransform(pytest:beam:transforms:count)/Combine.perKey(Count)/{Merge, ExtractOutputs}) exceeded the 80 characters length limit and was truncated.
[jobmanager-future-thread-15] INFO org.apache.flink.runtime.executiongraph.ExecutionGraph - CHAIN MapPartition (MapPartition at [2]ExternalTransform(pytest:beam:transforms:count)/Combine.perKey(Count)/{Merge, ExtractOutputs}) -> FlatMap (FlatMap at ExtractOutput[0]) (1/2) (29d43e3b468144d5ea005435edae1bd6) switched from CREATED to SCHEDULED.
[flink-akka.actor.default-dispatcher-5] INFO org.apache.flink.runtime.executiongraph.ExecutionGraph - CHAIN MapPartition (MapPartition at [2]ExternalTransform(pytest:beam:transforms:count)/Combine.perKey(Count)/{Merge, ExtractOutputs}) -> FlatMap (FlatMap at ExtractOutput[0]) (1/2) (29d43e3b468144d5ea005435edae1bd6) switched from SCHEDULED to DEPLOYING.
[flink-akka.actor.default-dispatcher-5] INFO org.apache.flink.runtime.executiongraph.ExecutionGraph - Deploying CHAIN MapPartition (MapPartition at [2]ExternalTransform(pytest:beam:transforms:count)/Combine.perKey(Count)/{Merge, ExtractOutputs}) -> FlatMap (FlatMap at ExtractOutput[0]) (1/2) (attempt #0) to localhost
[flink-akka.actor.default-dispatcher-8] INFO org.apache.flink.runtime.taskexecutor.TaskExecutor - Received task CHAIN MapPartition (MapPartition at [2]ExternalTransform(pytest:beam:transforms:count)/Combine.perKey(Count)/{Merge, ExtractOutputs}) -> FlatMap (FlatMap at ExtractOutput[0]) (1/2).
[CHAIN MapPartition (MapPartition at [2]ExternalTransform(pytest:beam:transforms:count)/Combine.perKey(Count)/{Merge, ExtractOutputs}) -> FlatMap (FlatMap at ExtractOutput[0]) (1/2)] INFO org.apache.flink.runtime.taskmanager.Task - CHAIN MapPartition (MapPartition at [2]ExternalTransform(pytest:beam:transforms:count)/Combine.perKey(Count)/{Merge, ExtractOutputs}) -> FlatMap (FlatMap at ExtractOutput[0]) (1/2) (29d43e3b468144d5ea005435edae1bd6) switched from CREATED to DEPLOYING.
[CHAIN MapPartition (MapPartition at [2]ExternalTransform(pytest:beam:transforms:count)/Combine.perKey(Count)/{Merge, ExtractOutputs}) -> FlatMap (FlatMap at ExtractOutput[0]) (1/2)] INFO org.apache.flink.runtime.taskmanager.Task - Creating FileSystem stream leak safety net for task CHAIN MapPartition (MapPartition at [2]ExternalTransform(pytest:beam:transforms:count)/Combine.perKey(Count)/{Merge, ExtractOutputs}) -> FlatMap (FlatMap at ExtractOutput[0]) (1/2) (29d43e3b468144d5ea005435edae1bd6) [DEPLOYING]
[CHAIN MapPartition (MapPartition at [2]ExternalTransform(pytest:beam:transforms:count)/Combine.perKey(Count)/{Merge, ExtractOutputs}) -> FlatMap (FlatMap at ExtractOutput[0]) (1/2)] INFO org.apache.flink.runtime.taskmanager.Task - Loading JAR files for task CHAIN MapPartition (MapPartition at [2]ExternalTransform(pytest:beam:transforms:count)/Combine.perKey(Count)/{Merge, ExtractOutputs}) -> FlatMap (FlatMap at ExtractOutput[0]) (1/2) (29d43e3b468144d5ea005435edae1bd6) [DEPLOYING].
[CHAIN MapPartition (MapPartition at [2]ExternalTransform(pytest:beam:transforms:count)/Combine.perKey(Count)/{Merge, ExtractOutputs}) -> FlatMap (FlatMap at ExtractOutput[0]) (1/2)] INFO org.apache.flink.runtime.taskmanager.Task - Registering task at network: CHAIN MapPartition (MapPartition at [2]ExternalTransform(pytest:beam:transforms:count)/Combine.perKey(Count)/{Merge, ExtractOutputs}) -> FlatMap (FlatMap at ExtractOutput[0]) (1/2) (29d43e3b468144d5ea005435edae1bd6) [DEPLOYING].
[CHAIN MapPartition (MapPartition at [2]ExternalTransform(pytest:beam:transforms:count)/Combine.perKey(Count)/{Merge, ExtractOutputs}) -> FlatMap (FlatMap at ExtractOutput[0]) (1/2)] INFO org.apache.flink.runtime.taskmanager.Task - CHAIN MapPartition (MapPartition at [2]ExternalTransform(pytest:beam:transforms:count)/Combine.perKey(Count)/{Merge, ExtractOutputs}) -> FlatMap (FlatMap at ExtractOutput[0]) (1/2) (29d43e3b468144d5ea005435edae1bd6) switched from DEPLOYING to RUNNING.
[flink-akka.actor.default-dispatcher-8] INFO org.apache.flink.runtime.executiongraph.ExecutionGraph - CHAIN MapPartition (MapPartition at [2]ExternalTransform(pytest:beam:transforms:count)/Combine.perKey(Count)/{Merge, ExtractOutputs}) -> FlatMap (FlatMap at ExtractOutput[0]) (1/2) (29d43e3b468144d5ea005435edae1bd6) switched from DEPLOYING to RUNNING.
[CHAIN MapPartition (MapPartition at [2]ExternalTransform(pytest:beam:transforms:count)/Combine.perKey(Count)/{Merge, ExtractOutputs}) -> FlatMap (FlatMap at ExtractOutput[0]) (1/2)] WARN org.apache.flink.metrics.MetricGroup - The operator name MapPartition (MapPartition at [2]ExternalTransform(pytest:beam:transforms:count)/Combine.perKey(Count)/{Merge, ExtractOutputs}) exceeded the 80 characters length limit and was truncated.
[GroupReduce (GroupReduce at ExternalTransform(pytest:beam:transforms:count)/Combine.perKey(Count)/Group) (2/2)] INFO org.apache.flink.runtime.taskmanager.Task - GroupReduce (GroupReduce at ExternalTransform(pytest:beam:transforms:count)/Combine.perKey(Count)/Group) (2/2) (927a5edc5be756c8749857951abd77da) switched from RUNNING to FINISHED.
[GroupReduce (GroupReduce at ExternalTransform(pytest:beam:transforms:count)/Combine.perKey(Count)/Group) (2/2)] INFO org.apache.flink.runtime.taskmanager.Task - Freeing task resources for GroupReduce (GroupReduce at ExternalTransform(pytest:beam:transforms:count)/Combine.perKey(Count)/Group) (2/2) (927a5edc5be756c8749857951abd77da).
[GroupReduce (GroupReduce at ExternalTransform(pytest:beam:transforms:count)/Combine.perKey(Count)/Group) (1/2)] INFO org.apache.flink.runtime.taskmanager.Task - GroupReduce (GroupReduce at ExternalTransform(pytest:beam:transforms:count)/Combine.perKey(Count)/Group) (1/2) (9a58f30cf4a51650d44633e2304c327e) switched from RUNNING to FINISHED.
[GroupReduce (GroupReduce at ExternalTransform(pytest:beam:transforms:count)/Combine.perKey(Count)/Group) (2/2)] INFO org.apache.flink.runtime.taskmanager.Task - Ensuring all FileSystem streams are closed for task GroupReduce (GroupReduce at ExternalTransform(pytest:beam:transforms:count)/Combine.perKey(Count)/Group) (2/2) (927a5edc5be756c8749857951abd77da) [FINISHED]
[GroupReduce (GroupReduce at ExternalTransform(pytest:beam:transforms:count)/Combine.perKey(Count)/Group) (1/2)] INFO org.apache.flink.runtime.taskmanager.Task - Freeing task resources for GroupReduce (GroupReduce at ExternalTransform(pytest:beam:transforms:count)/Combine.perKey(Count)/Group) (1/2) (9a58f30cf4a51650d44633e2304c327e).
[flink-akka.actor.default-dispatcher-8] INFO org.apache.flink.runtime.taskexecutor.TaskExecutor - Un-registering task and sending final execution state FINISHED to JobManager for task GroupReduce (GroupReduce at ExternalTransform(pytest:beam:transforms:count)/Combine.perKey(Count)/Group) 927a5edc5be756c8749857951abd77da.
[GroupReduce (GroupReduce at ExternalTransform(pytest:beam:transforms:count)/Combine.perKey(Count)/Group) (1/2)] INFO org.apache.flink.runtime.taskmanager.Task - Ensuring all FileSystem streams are closed for task GroupReduce (GroupReduce at ExternalTransform(pytest:beam:transforms:count)/Combine.perKey(Count)/Group) (1/2) (9a58f30cf4a51650d44633e2304c327e) [FINISHED]
[flink-akka.actor.default-dispatcher-8] INFO org.apache.flink.runtime.taskexecutor.TaskExecutor - Un-registering task and sending final execution state FINISHED to JobManager for task GroupReduce (GroupReduce at ExternalTransform(pytest:beam:transforms:count)/Combine.perKey(Count)/Group) 9a58f30cf4a51650d44633e2304c327e.
[flink-akka.actor.default-dispatcher-4] INFO org.apache.flink.runtime.executiongraph.ExecutionGraph - GroupReduce (GroupReduce at ExternalTransform(pytest:beam:transforms:count)/Combine.perKey(Count)/Group) (2/2) (927a5edc5be756c8749857951abd77da) switched from RUNNING to FINISHED.
[flink-akka.actor.default-dispatcher-4] INFO org.apache.flink.runtime.executiongraph.ExecutionGraph - GroupReduce (GroupReduce at ExternalTransform(pytest:beam:transforms:count)/Combine.perKey(Count)/Group) (1/2) (9a58f30cf4a51650d44633e2304c327e) switched from RUNNING to FINISHED.
[jobmanager-future-thread-10] INFO org.apache.flink.runtime.executiongraph.ExecutionGraph - CHAIN MapPartition (MapPartition at [6]{Map(<lambda at external_test.py:212>), Map(<lambda at external_test.py:213>), assert_that}) -> FlatMap (FlatMap at ExtractOutput[0]) (2/2) (2dcaadfcc5587b4657c00a40fb98abd9) switched from CREATED to SCHEDULED.
[flink-akka.actor.default-dispatcher-5] INFO org.apache.flink.runtime.executiongraph.ExecutionGraph - CHAIN MapPartition (MapPartition at [6]{Map(<lambda at external_test.py:212>), Map(<lambda at external_test.py:213>), assert_that}) -> FlatMap (FlatMap at ExtractOutput[0]) (2/2) (2dcaadfcc5587b4657c00a40fb98abd9) switched from SCHEDULED to DEPLOYING.
[flink-akka.actor.default-dispatcher-5] INFO org.apache.flink.runtime.executiongraph.ExecutionGraph - Deploying CHAIN MapPartition (MapPartition at [6]{Map(<lambda at external_test.py:212>), Map(<lambda at external_test.py:213>), assert_that}) -> FlatMap (FlatMap at ExtractOutput[0]) (2/2) (attempt #0) to localhost
[flink-akka.actor.default-dispatcher-9] INFO org.apache.flink.runtime.taskexecutor.TaskExecutor - Received task CHAIN MapPartition (MapPartition at [6]{Map(<lambda at external_test.py:212>), Map(<lambda at external_test.py:213>), assert_that}) -> FlatMap (FlatMap at ExtractOutput[0]) (2/2).
[CHAIN MapPartition (MapPartition at [6]{Map(<lambda at external_test.py:212>), Map(<lambda at external_test.py:213>), assert_that}) -> FlatMap (FlatMap at ExtractOutput[0]) (2/2)] INFO org.apache.flink.runtime.taskmanager.Task - CHAIN MapPartition (MapPartition at [6]{Map(<lambda at external_test.py:212>), Map(<lambda at external_test.py:213>), assert_that}) -> FlatMap (FlatMap at ExtractOutput[0]) (2/2) (2dcaadfcc5587b4657c00a40fb98abd9) switched from CREATED to DEPLOYING.
[CHAIN MapPartition (MapPartition at [6]{Map(<lambda at external_test.py:212>), Map(<lambda at external_test.py:213>), assert_that}) -> FlatMap (FlatMap at ExtractOutput[0]) (2/2)] INFO org.apache.flink.runtime.taskmanager.Task - Creating FileSystem stream leak safety net for task CHAIN MapPartition (MapPartition at [6]{Map(<lambda at external_test.py:212>), Map(<lambda at external_test.py:213>), assert_that}) -> FlatMap (FlatMap at ExtractOutput[0]) (2/2) (2dcaadfcc5587b4657c00a40fb98abd9) [DEPLOYING]
[CHAIN MapPartition (MapPartition at [6]{Map(<lambda at external_test.py:212>), Map(<lambda at external_test.py:213>), assert_that}) -> FlatMap (FlatMap at ExtractOutput[0]) (2/2)] INFO org.apache.flink.runtime.taskmanager.Task - Loading JAR files for task CHAIN MapPartition (MapPartition at [6]{Map(<lambda at external_test.py:212>), Map(<lambda at external_test.py:213>), assert_that}) -> FlatMap (FlatMap at ExtractOutput[0]) (2/2) (2dcaadfcc5587b4657c00a40fb98abd9) [DEPLOYING].
[CHAIN MapPartition (MapPartition at [6]{Map(<lambda at external_test.py:212>), Map(<lambda at external_test.py:213>), assert_that}) -> FlatMap (FlatMap at ExtractOutput[0]) (2/2)] INFO org.apache.flink.runtime.taskmanager.Task - Registering task at network: CHAIN MapPartition (MapPartition at [6]{Map(<lambda at external_test.py:212>), Map(<lambda at external_test.py:213>), assert_that}) -> FlatMap (FlatMap at ExtractOutput[0]) (2/2) (2dcaadfcc5587b4657c00a40fb98abd9) [DEPLOYING].
[jobmanager-future-thread-5] INFO org.apache.flink.runtime.executiongraph.ExecutionGraph - CHAIN MapPartition (MapPartition at [6]{Map(<lambda at external_test.py:212>), Map(<lambda at external_test.py:213>), assert_that}) -> FlatMap (FlatMap at ExtractOutput[0]) (1/2) (8673d1419c6c5928e585eb41b5dbd6bc) switched from CREATED to SCHEDULED.
[CHAIN MapPartition (MapPartition at [6]{Map(<lambda at external_test.py:212>), Map(<lambda at external_test.py:213>), assert_that}) -> FlatMap (FlatMap at ExtractOutput[0]) (2/2)] INFO org.apache.flink.runtime.taskmanager.Task - CHAIN MapPartition (MapPartition at [6]{Map(<lambda at external_test.py:212>), Map(<lambda at external_test.py:213>), assert_that}) -> FlatMap (FlatMap at ExtractOutput[0]) (2/2) (2dcaadfcc5587b4657c00a40fb98abd9) switched from DEPLOYING to RUNNING.
[flink-akka.actor.default-dispatcher-5] INFO org.apache.flink.runtime.executiongraph.ExecutionGraph - CHAIN MapPartition (MapPartition at [6]{Map(<lambda at external_test.py:212>), Map(<lambda at external_test.py:213>), assert_that}) -> FlatMap (FlatMap at ExtractOutput[0]) (2/2) (2dcaadfcc5587b4657c00a40fb98abd9) switched from DEPLOYING to RUNNING.
[flink-akka.actor.default-dispatcher-9] INFO org.apache.flink.runtime.executiongraph.ExecutionGraph - CHAIN MapPartition (MapPartition at [6]{Map(<lambda at external_test.py:212>), Map(<lambda at external_test.py:213>), assert_that}) -> FlatMap (FlatMap at ExtractOutput[0]) (1/2) (8673d1419c6c5928e585eb41b5dbd6bc) switched from SCHEDULED to DEPLOYING.
[CHAIN MapPartition (MapPartition at [6]{Map(<lambda at external_test.py:212>), Map(<lambda at external_test.py:213>), assert_that}) -> FlatMap (FlatMap at ExtractOutput[0]) (2/2)] WARN org.apache.flink.metrics.MetricGroup - The operator name MapPartition (MapPartition at [6]{Map(<lambda at external_test.py:212>), Map(<lambda at external_test.py:213>), assert_that}) exceeded the 80 characters length limit and was truncated.
[flink-akka.actor.default-dispatcher-9] INFO org.apache.flink.runtime.executiongraph.ExecutionGraph - Deploying CHAIN MapPartition (MapPartition at [6]{Map(<lambda at external_test.py:212>), Map(<lambda at external_test.py:213>), assert_that}) -> FlatMap (FlatMap at ExtractOutput[0]) (1/2) (attempt #0) to localhost
[flink-akka.actor.default-dispatcher-5] INFO org.apache.flink.runtime.taskexecutor.TaskExecutor - Received task CHAIN MapPartition (MapPartition at [6]{Map(<lambda at external_test.py:212>), Map(<lambda at external_test.py:213>), assert_that}) -> FlatMap (FlatMap at ExtractOutput[0]) (1/2).
[CHAIN MapPartition (MapPartition at [2]ExternalTransform(pytest:beam:transforms:count)/Combine.perKey(Count)/{Merge, ExtractOutputs}) -> FlatMap (FlatMap at ExtractOutput[0]) (2/2)] INFO org.apache.flink.runtime.taskmanager.Task - CHAIN MapPartition (MapPartition at [2]ExternalTransform(pytest:beam:transforms:count)/Combine.perKey(Count)/{Merge, ExtractOutputs}) -> FlatMap (FlatMap at ExtractOutput[0]) (2/2) (da3efb61e9d4472cb0e4060feee05c64) switched from RUNNING to FINISHED.
[CHAIN MapPartition (MapPartition at [2]ExternalTransform(pytest:beam:transforms:count)/Combine.perKey(Count)/{Merge, ExtractOutputs}) -> FlatMap (FlatMap at ExtractOutput[0]) (2/2)] INFO org.apache.flink.runtime.taskmanager.Task - Freeing task resources for CHAIN MapPartition (MapPartition at [2]ExternalTransform(pytest:beam:transforms:count)/Combine.perKey(Count)/{Merge, ExtractOutputs}) -> FlatMap (FlatMap at ExtractOutput[0]) (2/2) (da3efb61e9d4472cb0e4060feee05c64).
[CHAIN MapPartition (MapPartition at [2]ExternalTransform(pytest:beam:transforms:count)/Combine.perKey(Count)/{Merge, ExtractOutputs}) -> FlatMap (FlatMap at ExtractOutput[0]) (2/2)] INFO org.apache.flink.runtime.taskmanager.Task - Ensuring all FileSystem streams are closed for task CHAIN MapPartition (MapPartition at [2]ExternalTransform(pytest:beam:transforms:count)/Combine.perKey(Count)/{Merge, ExtractOutputs}) -> FlatMap (FlatMap at ExtractOutput[0]) (2/2) (da3efb61e9d4472cb0e4060feee05c64) [FINISHED]
[CHAIN MapPartition (MapPartition at [6]{Map(<lambda at external_test.py:212>), Map(<lambda at external_test.py:213>), assert_that}) -> FlatMap (FlatMap at ExtractOutput[0]) (1/2)] INFO org.apache.flink.runtime.taskmanager.Task - CHAIN MapPartition (MapPartition at [6]{Map(<lambda at external_test.py:212>), Map(<lambda at external_test.py:213>), assert_that}) -> FlatMap (FlatMap at ExtractOutput[0]) (1/2) (8673d1419c6c5928e585eb41b5dbd6bc) switched from CREATED to DEPLOYING.
[CHAIN MapPartition (MapPartition at [6]{Map(<lambda at external_test.py:212>), Map(<lambda at external_test.py:213>), assert_that}) -> FlatMap (FlatMap at ExtractOutput[0]) (1/2)] INFO org.apache.flink.runtime.taskmanager.Task - Creating FileSystem stream leak safety net for task CHAIN MapPartition (MapPartition at [6]{Map(<lambda at external_test.py:212>), Map(<lambda at external_test.py:213>), assert_that}) -> FlatMap (FlatMap at ExtractOutput[0]) (1/2) (8673d1419c6c5928e585eb41b5dbd6bc) [DEPLOYING]
[CHAIN MapPartition (MapPartition at [6]{Map(<lambda at external_test.py:212>), Map(<lambda at external_test.py:213>), assert_that}) -> FlatMap (FlatMap at ExtractOutput[0]) (1/2)] INFO org.apache.flink.runtime.taskmanager.Task - Loading JAR files for task CHAIN MapPartition (MapPartition at [6]{Map(<lambda at external_test.py:212>), Map(<lambda at external_test.py:213>), assert_that}) -> FlatMap (FlatMap at ExtractOutput[0]) (1/2) (8673d1419c6c5928e585eb41b5dbd6bc) [DEPLOYING].
[flink-akka.actor.default-dispatcher-5] INFO org.apache.flink.runtime.taskexecutor.TaskExecutor - Un-registering task and sending final execution state FINISHED to JobManager for task CHAIN MapPartition (MapPartition at [2]ExternalTransform(pytest:beam:transforms:count)/Combine.perKey(Count)/{Merge, ExtractOutputs}) -> FlatMap (FlatMap at ExtractOutput[0]) da3efb61e9d4472cb0e4060feee05c64.
[CHAIN MapPartition (MapPartition at [6]{Map(<lambda at external_test.py:212>), Map(<lambda at external_test.py:213>), assert_that}) -> FlatMap (FlatMap at ExtractOutput[0]) (1/2)] INFO org.apache.flink.runtime.taskmanager.Task - Registering task at network: CHAIN MapPartition (MapPartition at [6]{Map(<lambda at external_test.py:212>), Map(<lambda at external_test.py:213>), assert_that}) -> FlatMap (FlatMap at ExtractOutput[0]) (1/2) (8673d1419c6c5928e585eb41b5dbd6bc) [DEPLOYING].
[CHAIN MapPartition (MapPartition at [6]{Map(<lambda at external_test.py:212>), Map(<lambda at external_test.py:213>), assert_that}) -> FlatMap (FlatMap at ExtractOutput[0]) (1/2)] INFO org.apache.flink.runtime.taskmanager.Task - CHAIN MapPartition (MapPartition at [6]{Map(<lambda at external_test.py:212>), Map(<lambda at external_test.py:213>), assert_that}) -> FlatMap (FlatMap at ExtractOutput[0]) (1/2) (8673d1419c6c5928e585eb41b5dbd6bc) switched from DEPLOYING to RUNNING.
[flink-akka.actor.default-dispatcher-4] INFO org.apache.flink.runtime.executiongraph.ExecutionGraph - CHAIN MapPartition (MapPartition at [2]ExternalTransform(pytest:beam:transforms:count)/Combine.perKey(Count)/{Merge, ExtractOutputs}) -> FlatMap (FlatMap at ExtractOutput[0]) (2/2) (da3efb61e9d4472cb0e4060feee05c64) switched from RUNNING to FINISHED.
[CHAIN MapPartition (MapPartition at [6]{Map(<lambda at external_test.py:212>), Map(<lambda at external_test.py:213>), assert_that}) -> FlatMap (FlatMap at ExtractOutput[0]) (1/2)] WARN org.apache.flink.metrics.MetricGroup - The operator name MapPartition (MapPartition at [6]{Map(<lambda at external_test.py:212>), Map(<lambda at external_test.py:213>), assert_that}) exceeded the 80 characters length limit and was truncated.
[flink-akka.actor.default-dispatcher-4] INFO org.apache.flink.runtime.executiongraph.ExecutionGraph - CHAIN MapPartition (MapPartition at [6]{Map(<lambda at external_test.py:212>), Map(<lambda at external_test.py:213>), assert_that}) -> FlatMap (FlatMap at ExtractOutput[0]) (1/2) (8673d1419c6c5928e585eb41b5dbd6bc) switched from DEPLOYING to RUNNING.
[CHAIN MapPartition (MapPartition at [2]ExternalTransform(pytest:beam:transforms:count)/Combine.perKey(Count)/{Merge, ExtractOutputs}) -> FlatMap (FlatMap at ExtractOutput[0]) (1/2)] INFO org.apache.flink.runtime.taskmanager.Task - CHAIN MapPartition (MapPartition at [2]ExternalTransform(pytest:beam:transforms:count)/Combine.perKey(Count)/{Merge, ExtractOutputs}) -> FlatMap (FlatMap at ExtractOutput[0]) (1/2) (29d43e3b468144d5ea005435edae1bd6) switched from RUNNING to FINISHED.
[CHAIN MapPartition (MapPartition at [2]ExternalTransform(pytest:beam:transforms:count)/Combine.perKey(Count)/{Merge, ExtractOutputs}) -> FlatMap (FlatMap at ExtractOutput[0]) (1/2)] INFO org.apache.flink.runtime.taskmanager.Task - Freeing task resources for CHAIN MapPartition (MapPartition at [2]ExternalTransform(pytest:beam:transforms:count)/Combine.perKey(Count)/{Merge, ExtractOutputs}) -> FlatMap (FlatMap at ExtractOutput[0]) (1/2) (29d43e3b468144d5ea005435edae1bd6).
[CHAIN MapPartition (MapPartition at [2]ExternalTransform(pytest:beam:transforms:count)/Combine.perKey(Count)/{Merge, ExtractOutputs}) -> FlatMap (FlatMap at ExtractOutput[0]) (1/2)] INFO org.apache.flink.runtime.taskmanager.Task - Ensuring all FileSystem streams are closed for task CHAIN MapPartition (MapPartition at [2]ExternalTransform(pytest:beam:transforms:count)/Combine.perKey(Count)/{Merge, ExtractOutputs}) -> FlatMap (FlatMap at ExtractOutput[0]) (1/2) (29d43e3b468144d5ea005435edae1bd6) [FINISHED]
[flink-akka.actor.default-dispatcher-8] INFO org.apache.flink.runtime.taskexecutor.TaskExecutor - Un-registering task and sending final execution state FINISHED to JobManager for task CHAIN MapPartition (MapPartition at [2]ExternalTransform(pytest:beam:transforms:count)/Combine.perKey(Count)/{Merge, ExtractOutputs}) -> FlatMap (FlatMap at ExtractOutput[0]) 29d43e3b468144d5ea005435edae1bd6.
[flink-akka.actor.default-dispatcher-5] INFO org.apache.flink.runtime.executiongraph.ExecutionGraph - CHAIN MapPartition (MapPartition at [2]ExternalTransform(pytest:beam:transforms:count)/Combine.perKey(Count)/{Merge, ExtractOutputs}) -> FlatMap (FlatMap at ExtractOutput[0]) (1/2) (29d43e3b468144d5ea005435edae1bd6) switched from RUNNING to FINISHED.
[grpc-default-executor-1] WARN bundle_processor.create_operation - No unique name set for transform fn/write/ref_PCollection_PCollection_24:1:0
[grpc-default-executor-1] WARN bundle_processor.create_operation - No unique name set for transform fn/write/ref_PCollection_PCollection_24:1:0
[grpc-default-executor-1] WARN bundle_processor.create_operation - No unique name set for transform fn/read/ref_PCollection_PCollection_14:0
[grpc-default-executor-1] WARN bundle_processor.create_operation - No unique name set for transform fn/read/ref_PCollection_PCollection_14:0
[CHAIN MapPartition (MapPartition at [6]{Map(<lambda at external_test.py:212>), Map(<lambda at external_test.py:213>), assert_that}) -> FlatMap (FlatMap at ExtractOutput[0]) (2/2)] INFO org.apache.flink.runtime.taskmanager.Task - CHAIN MapPartition (MapPartition at [6]{Map(<lambda at external_test.py:212>), Map(<lambda at external_test.py:213>), assert_that}) -> FlatMap (FlatMap at ExtractOutput[0]) (2/2) (2dcaadfcc5587b4657c00a40fb98abd9) switched from RUNNING to FINISHED.
[CHAIN MapPartition (MapPartition at [6]{Map(<lambda at external_test.py:212>), Map(<lambda at external_test.py:213>), assert_that}) -> FlatMap (FlatMap at ExtractOutput[0]) (2/2)] INFO org.apache.flink.runtime.taskmanager.Task - Freeing task resources for CHAIN MapPartition (MapPartition at [6]{Map(<lambda at external_test.py:212>), Map(<lambda at external_test.py:213>), assert_that}) -> FlatMap (FlatMap at ExtractOutput[0]) (2/2) (2dcaadfcc5587b4657c00a40fb98abd9).
[CHAIN MapPartition (MapPartition at [6]{Map(<lambda at external_test.py:212>), Map(<lambda at external_test.py:213>), assert_that}) -> FlatMap (FlatMap at ExtractOutput[0]) (2/2)] INFO org.apache.flink.runtime.taskmanager.Task - Ensuring all FileSystem streams are closed for task CHAIN MapPartition (MapPartition at [6]{Map(<lambda at external_test.py:212>), Map(<lambda at external_test.py:213>), assert_that}) -> FlatMap (FlatMap at ExtractOutput[0]) (2/2) (2dcaadfcc5587b4657c00a40fb98abd9) [FINISHED]
[flink-akka.actor.default-dispatcher-9] INFO org.apache.flink.runtime.taskexecutor.TaskExecutor - Un-registering task and sending final execution state FINISHED to JobManager for task CHAIN MapPartition (MapPartition at [6]{Map(<lambda at external_test.py:212>), Map(<lambda at external_test.py:213>), assert_that}) -> FlatMap (FlatMap at ExtractOutput[0]) 2dcaadfcc5587b4657c00a40fb98abd9.
[jobmanager-future-thread-4] INFO org.apache.flink.runtime.executiongraph.ExecutionGraph - GroupReduce (GroupReduce at assert_that/Group/GroupByKey) (1/2) (ff180e62be5a10011fa743fd6f66c7e3) switched from CREATED to SCHEDULED.
[jobmanager-future-thread-10] INFO org.apache.flink.runtime.executiongraph.ExecutionGraph - GroupReduce (GroupReduce at assert_that/Group/GroupByKey) (2/2) (0ebb0b74d167dc2a3bc34aa26532fc18) switched from CREATED to SCHEDULED.
[flink-akka.actor.default-dispatcher-9] INFO org.apache.flink.runtime.executiongraph.ExecutionGraph - GroupReduce (GroupReduce at assert_that/Group/GroupByKey) (1/2) (ff180e62be5a10011fa743fd6f66c7e3) switched from SCHEDULED to DEPLOYING.
[flink-akka.actor.default-dispatcher-4] INFO org.apache.flink.runtime.executiongraph.ExecutionGraph - GroupReduce (GroupReduce at assert_that/Group/GroupByKey) (2/2) (0ebb0b74d167dc2a3bc34aa26532fc18) switched from SCHEDULED to DEPLOYING.
[flink-akka.actor.default-dispatcher-4] INFO org.apache.flink.runtime.executiongraph.ExecutionGraph - Deploying GroupReduce (GroupReduce at assert_that/Group/GroupByKey) (2/2) (attempt #0) to localhost
[flink-akka.actor.default-dispatcher-9] INFO org.apache.flink.runtime.executiongraph.ExecutionGraph - Deploying GroupReduce (GroupReduce at assert_that/Group/GroupByKey) (1/2) (attempt #0) to localhost
[flink-akka.actor.default-dispatcher-8] INFO org.apache.flink.runtime.executiongraph.ExecutionGraph - CHAIN MapPartition (MapPartition at [6]{Map(<lambda at external_test.py:212>), Map(<lambda at external_test.py:213>), assert_that}) -> FlatMap (FlatMap at ExtractOutput[0]) (2/2) (2dcaadfcc5587b4657c00a40fb98abd9) switched from RUNNING to FINISHED.
[flink-akka.actor.default-dispatcher-5] INFO org.apache.flink.runtime.taskexecutor.TaskExecutor - Received task GroupReduce (GroupReduce at assert_that/Group/GroupByKey) (2/2).
[GroupReduce (GroupReduce at assert_that/Group/GroupByKey) (2/2)] INFO org.apache.flink.runtime.taskmanager.Task - GroupReduce (GroupReduce at assert_that/Group/GroupByKey) (2/2) (0ebb0b74d167dc2a3bc34aa26532fc18) switched from CREATED to DEPLOYING.
[GroupReduce (GroupReduce at assert_that/Group/GroupByKey) (2/2)] INFO org.apache.flink.runtime.taskmanager.Task - Creating FileSystem stream leak safety net for task GroupReduce (GroupReduce at assert_that/Group/GroupByKey) (2/2) (0ebb0b74d167dc2a3bc34aa26532fc18) [DEPLOYING]
[GroupReduce (GroupReduce at assert_that/Group/GroupByKey) (2/2)] INFO org.apache.flink.runtime.taskmanager.Task - Loading JAR files for task GroupReduce (GroupReduce at assert_that/Group/GroupByKey) (2/2) (0ebb0b74d167dc2a3bc34aa26532fc18) [DEPLOYING].
[GroupReduce (GroupReduce at assert_that/Group/GroupByKey) (2/2)] INFO org.apache.flink.runtime.taskmanager.Task - Registering task at network: GroupReduce (GroupReduce at assert_that/Group/GroupByKey) (2/2) (0ebb0b74d167dc2a3bc34aa26532fc18) [DEPLOYING].
[flink-akka.actor.default-dispatcher-5] INFO org.apache.flink.runtime.taskexecutor.TaskExecutor - Received task GroupReduce (GroupReduce at assert_that/Group/GroupByKey) (1/2).
[GroupReduce (GroupReduce at assert_that/Group/GroupByKey) (2/2)] INFO org.apache.flink.runtime.taskmanager.Task - GroupReduce (GroupReduce at assert_that/Group/GroupByKey) (2/2) (0ebb0b74d167dc2a3bc34aa26532fc18) switched from DEPLOYING to RUNNING.
[flink-akka.actor.default-dispatcher-9] INFO org.apache.flink.runtime.executiongraph.ExecutionGraph - GroupReduce (GroupReduce at assert_that/Group/GroupByKey) (2/2) (0ebb0b74d167dc2a3bc34aa26532fc18) switched from DEPLOYING to RUNNING.
[GroupReduce (GroupReduce at assert_that/Group/GroupByKey) (1/2)] INFO org.apache.flink.runtime.taskmanager.Task - GroupReduce (GroupReduce at assert_that/Group/GroupByKey) (1/2) (ff180e62be5a10011fa743fd6f66c7e3) switched from CREATED to DEPLOYING.
[GroupReduce (GroupReduce at assert_that/Group/GroupByKey) (1/2)] INFO org.apache.flink.runtime.taskmanager.Task - Creating FileSystem stream leak safety net for task GroupReduce (GroupReduce at assert_that/Group/GroupByKey) (1/2) (ff180e62be5a10011fa743fd6f66c7e3) [DEPLOYING]
[GroupReduce (GroupReduce at assert_that/Group/GroupByKey) (1/2)] INFO org.apache.flink.runtime.taskmanager.Task - Loading JAR files for task GroupReduce (GroupReduce at assert_that/Group/GroupByKey) (1/2) (ff180e62be5a10011fa743fd6f66c7e3) [DEPLOYING].
[GroupReduce (GroupReduce at assert_that/Group/GroupByKey) (1/2)] INFO org.apache.flink.runtime.taskmanager.Task - Registering task at network: GroupReduce (GroupReduce at assert_that/Group/GroupByKey) (1/2) (ff180e62be5a10011fa743fd6f66c7e3) [DEPLOYING].
[GroupReduce (GroupReduce at assert_that/Group/GroupByKey) (1/2)] INFO org.apache.flink.runtime.taskmanager.Task - GroupReduce (GroupReduce at assert_that/Group/GroupByKey) (1/2) (ff180e62be5a10011fa743fd6f66c7e3) switched from DEPLOYING to RUNNING.
[flink-akka.actor.default-dispatcher-5] INFO org.apache.flink.runtime.executiongraph.ExecutionGraph - GroupReduce (GroupReduce at assert_that/Group/GroupByKey) (1/2) (ff180e62be5a10011fa743fd6f66c7e3) switched from DEPLOYING to RUNNING.
[CHAIN MapPartition (MapPartition at [6]{Map(<lambda at external_test.py:212>), Map(<lambda at external_test.py:213>), assert_that}) -> FlatMap (FlatMap at ExtractOutput[0]) (1/2)] INFO org.apache.flink.runtime.taskmanager.Task - CHAIN MapPartition (MapPartition at [6]{Map(<lambda at external_test.py:212>), Map(<lambda at external_test.py:213>), assert_that}) -> FlatMap (FlatMap at ExtractOutput[0]) (1/2) (8673d1419c6c5928e585eb41b5dbd6bc) switched from RUNNING to FINISHED.
[CHAIN MapPartition (MapPartition at [6]{Map(<lambda at external_test.py:212>), Map(<lambda at external_test.py:213>), assert_that}) -> FlatMap (FlatMap at ExtractOutput[0]) (1/2)] INFO org.apache.flink.runtime.taskmanager.Task - Freeing task resources for CHAIN MapPartition (MapPartition at [6]{Map(<lambda at external_test.py:212>), Map(<lambda at external_test.py:213>), assert_that}) -> FlatMap (FlatMap at ExtractOutput[0]) (1/2) (8673d1419c6c5928e585eb41b5dbd6bc).
[CHAIN Filter (UnionFixFilter) -> Map (Key Extractor) -> GroupCombine (GroupCombine at GroupCombine: assert_that/Group/GroupByKey) -> Map (Key Extractor) (2/2)] INFO org.apache.flink.runtime.taskmanager.Task - CHAIN Filter (UnionFixFilter) -> Map (Key Extractor) -> GroupCombine (GroupCombine at GroupCombine: assert_that/Group/GroupByKey) -> Map (Key Extractor) (2/2) (19754c409bbb3ee492b798bcd8db5f6a) switched from RUNNING to FINISHED.
[CHAIN Filter (UnionFixFilter) -> Map (Key Extractor) -> GroupCombine (GroupCombine at GroupCombine: assert_that/Group/GroupByKey) -> Map (Key Extractor) (2/2)] INFO org.apache.flink.runtime.taskmanager.Task - Freeing task resources for CHAIN Filter (UnionFixFilter) -> Map (Key Extractor) -> GroupCombine (GroupCombine at GroupCombine: assert_that/Group/GroupByKey) -> Map (Key Extractor) (2/2) (19754c409bbb3ee492b798bcd8db5f6a).
[CHAIN Filter (UnionFixFilter) -> Map (Key Extractor) -> GroupCombine (GroupCombine at GroupCombine: assert_that/Group/GroupByKey) -> Map (Key Extractor) (1/2)] INFO org.apache.flink.runtime.taskmanager.Task - CHAIN Filter (UnionFixFilter) -> Map (Key Extractor) -> GroupCombine (GroupCombine at GroupCombine: assert_that/Group/GroupByKey) -> Map (Key Extractor) (1/2) (080d8f3259e58efdc87aa7f97d3c0c9a) switched from RUNNING to FINISHED.
[CHAIN Filter (UnionFixFilter) -> Map (Key Extractor) -> GroupCombine (GroupCombine at GroupCombine: assert_that/Group/GroupByKey) -> Map (Key Extractor) (1/2)] INFO org.apache.flink.runtime.taskmanager.Task - Freeing task resources for CHAIN Filter (UnionFixFilter) -> Map (Key Extractor) -> GroupCombine (GroupCombine at GroupCombine: assert_that/Group/GroupByKey) -> Map (Key Extractor) (1/2) (080d8f3259e58efdc87aa7f97d3c0c9a).
[CHAIN MapPartition (MapPartition at [6]{Map(<lambda at external_test.py:212>), Map(<lambda at external_test.py:213>), assert_that}) -> FlatMap (FlatMap at ExtractOutput[0]) (1/2)] INFO org.apache.flink.runtime.taskmanager.Task - Ensuring all FileSystem streams are closed for task CHAIN MapPartition (MapPartition at [6]{Map(<lambda at external_test.py:212>), Map(<lambda at external_test.py:213>), assert_that}) -> FlatMap (FlatMap at ExtractOutput[0]) (1/2) (8673d1419c6c5928e585eb41b5dbd6bc) [FINISHED]
[flink-akka.actor.default-dispatcher-8] INFO org.apache.flink.runtime.taskexecutor.TaskExecutor - Un-registering task and sending final execution state FINISHED to JobManager for task CHAIN MapPartition (MapPartition at [6]{Map(<lambda at external_test.py:212>), Map(<lambda at external_test.py:213>), assert_that}) -> FlatMap (FlatMap at ExtractOutput[0]) 8673d1419c6c5928e585eb41b5dbd6bc.
[flink-akka.actor.default-dispatcher-8] INFO org.apache.flink.runtime.executiongraph.ExecutionGraph - CHAIN MapPartition (MapPartition at [6]{Map(<lambda at external_test.py:212>), Map(<lambda at external_test.py:213>), assert_that}) -> FlatMap (FlatMap at ExtractOutput[0]) (1/2) (8673d1419c6c5928e585eb41b5dbd6bc) switched from RUNNING to FINISHED.
[CHAIN Filter (UnionFixFilter) -> Map (Key Extractor) -> GroupCombine (GroupCombine at GroupCombine: assert_that/Group/GroupByKey) -> Map (Key Extractor) (1/2)] INFO org.apache.flink.runtime.taskmanager.Task - Ensuring all FileSystem streams are closed for task CHAIN Filter (UnionFixFilter) -> Map (Key Extractor) -> GroupCombine (GroupCombine at GroupCombine: assert_that/Group/GroupByKey) -> Map (Key Extractor) (1/2) (080d8f3259e58efdc87aa7f97d3c0c9a) [FINISHED]
[flink-akka.actor.default-dispatcher-9] INFO org.apache.flink.runtime.taskexecutor.TaskExecutor - Un-registering task and sending final execution state FINISHED to JobManager for task CHAIN Filter (UnionFixFilter) -> Map (Key Extractor) -> GroupCombine (GroupCombine at GroupCombine: assert_that/Group/GroupByKey) -> Map (Key Extractor) 080d8f3259e58efdc87aa7f97d3c0c9a.
[flink-akka.actor.default-dispatcher-9] INFO org.apache.flink.runtime.executiongraph.ExecutionGraph - CHAIN Filter (UnionFixFilter) -> Map (Key Extractor) -> GroupCombine (GroupCombine at GroupCombine: assert_that/Group/GroupByKey) -> Map (Key Extractor) (1/2) (080d8f3259e58efdc87aa7f97d3c0c9a) switched from RUNNING to FINISHED.
[CHAIN Filter (UnionFixFilter) -> Map (Key Extractor) -> GroupCombine (GroupCombine at GroupCombine: assert_that/Group/GroupByKey) -> Map (Key Extractor) (2/2)] INFO org.apache.flink.runtime.taskmanager.Task - Ensuring all FileSystem streams are closed for task CHAIN Filter (UnionFixFilter) -> Map (Key Extractor) -> GroupCombine (GroupCombine at GroupCombine: assert_that/Group/GroupByKey) -> Map (Key Extractor) (2/2) (19754c409bbb3ee492b798bcd8db5f6a) [FINISHED]
[flink-akka.actor.default-dispatcher-9] INFO org.apache.flink.runtime.taskexecutor.TaskExecutor - Un-registering task and sending final execution state FINISHED to JobManager for task CHAIN Filter (UnionFixFilter) -> Map (Key Extractor) -> GroupCombine (GroupCombine at GroupCombine: assert_that/Group/GroupByKey) -> Map (Key Extractor) 19754c409bbb3ee492b798bcd8db5f6a.
[flink-akka.actor.default-dispatcher-9] INFO org.apache.flink.runtime.executiongraph.ExecutionGraph - CHAIN Filter (UnionFixFilter) -> Map (Key Extractor) -> GroupCombine (GroupCombine at GroupCombine: assert_that/Group/GroupByKey) -> Map (Key Extractor) (2/2) (19754c409bbb3ee492b798bcd8db5f6a) switched from RUNNING to FINISHED.
[jobmanager-future-thread-6] INFO org.apache.flink.runtime.executiongraph.ExecutionGraph - MapPartition (MapPartition at [3]assert_that/{Group, Unkey, Match}) (2/2) (f71827cfd025f8aa09934171b71594d5) switched from CREATED to SCHEDULED.
[flink-akka.actor.default-dispatcher-5] INFO org.apache.flink.runtime.executiongraph.ExecutionGraph - MapPartition (MapPartition at [3]assert_that/{Group, Unkey, Match}) (2/2) (f71827cfd025f8aa09934171b71594d5) switched from SCHEDULED to DEPLOYING.
[flink-akka.actor.default-dispatcher-5] INFO org.apache.flink.runtime.executiongraph.ExecutionGraph - Deploying MapPartition (MapPartition at [3]assert_that/{Group, Unkey, Match}) (2/2) (attempt #0) to localhost
[GroupReduce (GroupReduce at assert_that/Group/GroupByKey) (1/2)] INFO org.apache.flink.runtime.taskmanager.Task - GroupReduce (GroupReduce at assert_that/Group/GroupByKey) (1/2) (ff180e62be5a10011fa743fd6f66c7e3) switched from RUNNING to FINISHED.
[GroupReduce (GroupReduce at assert_that/Group/GroupByKey) (1/2)] INFO org.apache.flink.runtime.taskmanager.Task - Freeing task resources for GroupReduce (GroupReduce at assert_that/Group/GroupByKey) (1/2) (ff180e62be5a10011fa743fd6f66c7e3).
[jobmanager-future-thread-12] INFO org.apache.flink.runtime.executiongraph.ExecutionGraph - MapPartition (MapPartition at [3]assert_that/{Group, Unkey, Match}) (1/2) (65361e03556455d86819e36d37e4f55f) switched from CREATED to SCHEDULED.
[flink-akka.actor.default-dispatcher-8] INFO org.apache.flink.runtime.executiongraph.ExecutionGraph - MapPartition (MapPartition at [3]assert_that/{Group, Unkey, Match}) (1/2) (65361e03556455d86819e36d37e4f55f) switched from SCHEDULED to DEPLOYING.
[flink-akka.actor.default-dispatcher-8] INFO org.apache.flink.runtime.executiongraph.ExecutionGraph - Deploying MapPartition (MapPartition at [3]assert_that/{Group, Unkey, Match}) (1/2) (attempt #0) to localhost
[flink-akka.actor.default-dispatcher-4] INFO org.apache.flink.runtime.taskexecutor.TaskExecutor - Received task MapPartition (MapPartition at [3]assert_that/{Group, Unkey, Match}) (2/2).
[MapPartition (MapPartition at [3]assert_that/{Group, Unkey, Match}) (2/2)] INFO org.apache.flink.runtime.taskmanager.Task - MapPartition (MapPartition at [3]assert_that/{Group, Unkey, Match}) (2/2) (f71827cfd025f8aa09934171b71594d5) switched from CREATED to DEPLOYING.
[MapPartition (MapPartition at [3]assert_that/{Group, Unkey, Match}) (2/2)] INFO org.apache.flink.runtime.taskmanager.Task - Creating FileSystem stream leak safety net for task MapPartition (MapPartition at [3]assert_that/{Group, Unkey, Match}) (2/2) (f71827cfd025f8aa09934171b71594d5) [DEPLOYING]
[MapPartition (MapPartition at [3]assert_that/{Group, Unkey, Match}) (2/2)] INFO org.apache.flink.runtime.taskmanager.Task - Loading JAR files for task MapPartition (MapPartition at [3]assert_that/{Group, Unkey, Match}) (2/2) (f71827cfd025f8aa09934171b71594d5) [DEPLOYING].
[MapPartition (MapPartition at [3]assert_that/{Group, Unkey, Match}) (2/2)] INFO org.apache.flink.runtime.taskmanager.Task - Registering task at network: MapPartition (MapPartition at [3]assert_that/{Group, Unkey, Match}) (2/2) (f71827cfd025f8aa09934171b71594d5) [DEPLOYING].
[flink-akka.actor.default-dispatcher-4] INFO org.apache.flink.runtime.taskexecutor.TaskExecutor - Received task MapPartition (MapPartition at [3]assert_that/{Group, Unkey, Match}) (1/2).
[MapPartition (MapPartition at [3]assert_that/{Group, Unkey, Match}) (2/2)] INFO org.apache.flink.runtime.taskmanager.Task - MapPartition (MapPartition at [3]assert_that/{Group, Unkey, Match}) (2/2) (f71827cfd025f8aa09934171b71594d5) switched from DEPLOYING to RUNNING.
[flink-akka.actor.default-dispatcher-9] INFO org.apache.flink.runtime.executiongraph.ExecutionGraph - MapPartition (MapPartition at [3]assert_that/{Group, Unkey, Match}) (2/2) (f71827cfd025f8aa09934171b71594d5) switched from DEPLOYING to RUNNING.
[MapPartition (MapPartition at [3]assert_that/{Group, Unkey, Match}) (1/2)] INFO org.apache.flink.runtime.taskmanager.Task - MapPartition (MapPartition at [3]assert_that/{Group, Unkey, Match}) (1/2) (65361e03556455d86819e36d37e4f55f) switched from CREATED to DEPLOYING.
[MapPartition (MapPartition at [3]assert_that/{Group, Unkey, Match}) (1/2)] INFO org.apache.flink.runtime.taskmanager.Task - Creating FileSystem stream leak safety net for task MapPartition (MapPartition at [3]assert_that/{Group, Unkey, Match}) (1/2) (65361e03556455d86819e36d37e4f55f) [DEPLOYING]
[MapPartition (MapPartition at [3]assert_that/{Group, Unkey, Match}) (1/2)] INFO org.apache.flink.runtime.taskmanager.Task - Loading JAR files for task MapPartition (MapPartition at [3]assert_that/{Group, Unkey, Match}) (1/2) (65361e03556455d86819e36d37e4f55f) [DEPLOYING].
[MapPartition (MapPartition at [3]assert_that/{Group, Unkey, Match}) (1/2)] INFO org.apache.flink.runtime.taskmanager.Task - Registering task at network: MapPartition (MapPartition at [3]assert_that/{Group, Unkey, Match}) (1/2) (65361e03556455d86819e36d37e4f55f) [DEPLOYING].
[MapPartition (MapPartition at [3]assert_that/{Group, Unkey, Match}) (1/2)] INFO org.apache.flink.runtime.taskmanager.Task - MapPartition (MapPartition at [3]assert_that/{Group, Unkey, Match}) (1/2) (65361e03556455d86819e36d37e4f55f) switched from DEPLOYING to RUNNING.
[flink-akka.actor.default-dispatcher-9] INFO org.apache.flink.runtime.executiongraph.ExecutionGraph - MapPartition (MapPartition at [3]assert_that/{Group, Unkey, Match}) (1/2) (65361e03556455d86819e36d37e4f55f) switched from DEPLOYING to RUNNING.
[GroupReduce (GroupReduce at assert_that/Group/GroupByKey) (2/2)] INFO org.apache.flink.runtime.taskmanager.Task - GroupReduce (GroupReduce at assert_that/Group/GroupByKey) (2/2) (0ebb0b74d167dc2a3bc34aa26532fc18) switched from RUNNING to FINISHED.
[GroupReduce (GroupReduce at assert_that/Group/GroupByKey) (2/2)] INFO org.apache.flink.runtime.taskmanager.Task - Freeing task resources for GroupReduce (GroupReduce at assert_that/Group/GroupByKey) (2/2) (0ebb0b74d167dc2a3bc34aa26532fc18).
[GroupReduce (GroupReduce at assert_that/Group/GroupByKey) (1/2)] INFO org.apache.flink.runtime.taskmanager.Task - Ensuring all FileSystem streams are closed for task GroupReduce (GroupReduce at assert_that/Group/GroupByKey) (1/2) (ff180e62be5a10011fa743fd6f66c7e3) [FINISHED]
[GroupReduce (GroupReduce at assert_that/Group/GroupByKey) (2/2)] INFO org.apache.flink.runtime.taskmanager.Task - Ensuring all FileSystem streams are closed for task GroupReduce (GroupReduce at assert_that/Group/GroupByKey) (2/2) (0ebb0b74d167dc2a3bc34aa26532fc18) [FINISHED]
[flink-akka.actor.default-dispatcher-5] INFO org.apache.flink.runtime.taskexecutor.TaskExecutor - Un-registering task and sending final execution state FINISHED to JobManager for task GroupReduce (GroupReduce at assert_that/Group/GroupByKey) ff180e62be5a10011fa743fd6f66c7e3.
[flink-akka.actor.default-dispatcher-5] INFO org.apache.flink.runtime.taskexecutor.TaskExecutor - Un-registering task and sending final execution state FINISHED to JobManager for task GroupReduce (GroupReduce at assert_that/Group/GroupByKey) 0ebb0b74d167dc2a3bc34aa26532fc18.
[flink-akka.actor.default-dispatcher-4] INFO org.apache.flink.runtime.executiongraph.ExecutionGraph - GroupReduce (GroupReduce at assert_that/Group/GroupByKey) (1/2) (ff180e62be5a10011fa743fd6f66c7e3) switched from RUNNING to FINISHED.
[flink-akka.actor.default-dispatcher-4] INFO org.apache.flink.runtime.executiongraph.ExecutionGraph - GroupReduce (GroupReduce at assert_that/Group/GroupByKey) (2/2) (0ebb0b74d167dc2a3bc34aa26532fc18) switched from RUNNING to FINISHED.
[grpc-default-executor-1] WARN bundle_processor.create_operation - No unique name set for transform fn/read/ref_PCollection_PCollection_27:0
[grpc-default-executor-0] WARN bundle_processor.create_operation - No unique name set for transform fn/read/ref_PCollection_PCollection_27:0
[MapPartition (MapPartition at [3]assert_that/{Group, Unkey, Match}) (2/2)] INFO org.apache.flink.runtime.taskmanager.Task - MapPartition (MapPartition at [3]assert_that/{Group, Unkey, Match}) (2/2) (f71827cfd025f8aa09934171b71594d5) switched from RUNNING to FINISHED.
[MapPartition (MapPartition at [3]assert_that/{Group, Unkey, Match}) (2/2)] INFO org.apache.flink.runtime.taskmanager.Task - Freeing task resources for MapPartition (MapPartition at [3]assert_that/{Group, Unkey, Match}) (2/2) (f71827cfd025f8aa09934171b71594d5).
[MapPartition (MapPartition at [3]assert_that/{Group, Unkey, Match}) (2/2)] INFO org.apache.flink.runtime.taskmanager.Task - Ensuring all FileSystem streams are closed for task MapPartition (MapPartition at [3]assert_that/{Group, Unkey, Match}) (2/2) (f71827cfd025f8aa09934171b71594d5) [FINISHED]
[jobmanager-future-thread-7] INFO org.apache.flink.runtime.executiongraph.ExecutionGraph - DataSink (DiscardingOutput) (2/2) (8b854453ccd489e2ec0d4a96fb1557d8) switched from CREATED to SCHEDULED.
[flink-akka.actor.default-dispatcher-5] INFO org.apache.flink.runtime.taskexecutor.TaskExecutor - Un-registering task and sending final execution state FINISHED to JobManager for task MapPartition (MapPartition at [3]assert_that/{Group, Unkey, Match}) f71827cfd025f8aa09934171b71594d5.
[flink-akka.actor.default-dispatcher-4] INFO org.apache.flink.runtime.executiongraph.ExecutionGraph - DataSink (DiscardingOutput) (2/2) (8b854453ccd489e2ec0d4a96fb1557d8) switched from SCHEDULED to DEPLOYING.
[flink-akka.actor.default-dispatcher-4] INFO org.apache.flink.runtime.executiongraph.ExecutionGraph - Deploying DataSink (DiscardingOutput) (2/2) (attempt #0) to localhost
[flink-akka.actor.default-dispatcher-5] INFO org.apache.flink.runtime.executiongraph.ExecutionGraph - MapPartition (MapPartition at [3]assert_that/{Group, Unkey, Match}) (2/2) (f71827cfd025f8aa09934171b71594d5) switched from RUNNING to FINISHED.
[flink-akka.actor.default-dispatcher-4] INFO org.apache.flink.runtime.taskexecutor.TaskExecutor - Received task DataSink (DiscardingOutput) (2/2).
[DataSink (DiscardingOutput) (2/2)] INFO org.apache.flink.runtime.taskmanager.Task - DataSink (DiscardingOutput) (2/2) (8b854453ccd489e2ec0d4a96fb1557d8) switched from CREATED to DEPLOYING.
[DataSink (DiscardingOutput) (2/2)] INFO org.apache.flink.runtime.taskmanager.Task - Creating FileSystem stream leak safety net for task DataSink (DiscardingOutput) (2/2) (8b854453ccd489e2ec0d4a96fb1557d8) [DEPLOYING]
[DataSink (DiscardingOutput) (2/2)] INFO org.apache.flink.runtime.taskmanager.Task - Loading JAR files for task DataSink (DiscardingOutput) (2/2) (8b854453ccd489e2ec0d4a96fb1557d8) [DEPLOYING].
[DataSink (DiscardingOutput) (2/2)] INFO org.apache.flink.runtime.taskmanager.Task - Registering task at network: DataSink (DiscardingOutput) (2/2) (8b854453ccd489e2ec0d4a96fb1557d8) [DEPLOYING].
[DataSink (DiscardingOutput) (2/2)] INFO org.apache.flink.runtime.taskmanager.Task - DataSink (DiscardingOutput) (2/2) (8b854453ccd489e2ec0d4a96fb1557d8) switched from DEPLOYING to RUNNING.
[flink-akka.actor.default-dispatcher-4] INFO org.apache.flink.runtime.executiongraph.ExecutionGraph - DataSink (DiscardingOutput) (2/2) (8b854453ccd489e2ec0d4a96fb1557d8) switched from DEPLOYING to RUNNING.
[DataSink (DiscardingOutput) (2/2)] INFO org.apache.flink.runtime.taskmanager.Task - DataSink (DiscardingOutput) (2/2) (8b854453ccd489e2ec0d4a96fb1557d8) switched from RUNNING to FINISHED.
[DataSink (DiscardingOutput) (2/2)] INFO org.apache.flink.runtime.taskmanager.Task - Freeing task resources for DataSink (DiscardingOutput) (2/2) (8b854453ccd489e2ec0d4a96fb1557d8).
[DataSink (DiscardingOutput) (2/2)] INFO org.apache.flink.runtime.taskmanager.Task - Ensuring all FileSystem streams are closed for task DataSink (DiscardingOutput) (2/2) (8b854453ccd489e2ec0d4a96fb1557d8) [FINISHED]
[flink-akka.actor.default-dispatcher-5] INFO org.apache.flink.runtime.taskexecutor.TaskExecutor - Un-registering task and sending final execution state FINISHED to JobManager for task DataSink (DiscardingOutput) 8b854453ccd489e2ec0d4a96fb1557d8.
[flink-akka.actor.default-dispatcher-5] INFO org.apache.flink.runtime.executiongraph.ExecutionGraph - DataSink (DiscardingOutput) (2/2) (8b854453ccd489e2ec0d4a96fb1557d8) switched from RUNNING to FINISHED.
[MapPartition (MapPartition at [3]assert_that/{Group, Unkey, Match}) (1/2)] INFO org.apache.flink.runtime.taskmanager.Task - MapPartition (MapPartition at [3]assert_that/{Group, Unkey, Match}) (1/2) (65361e03556455d86819e36d37e4f55f) switched from RUNNING to FINISHED.
[MapPartition (MapPartition at [3]assert_that/{Group, Unkey, Match}) (1/2)] INFO org.apache.flink.runtime.taskmanager.Task - Freeing task resources for MapPartition (MapPartition at [3]assert_that/{Group, Unkey, Match}) (1/2) (65361e03556455d86819e36d37e4f55f).
[MapPartition (MapPartition at [3]assert_that/{Group, Unkey, Match}) (1/2)] INFO org.apache.flink.runtime.taskmanager.Task - Ensuring all FileSystem streams are closed for task MapPartition (MapPartition at [3]assert_that/{Group, Unkey, Match}) (1/2) (65361e03556455d86819e36d37e4f55f) [FINISHED]
[flink-akka.actor.default-dispatcher-4] INFO org.apache.flink.runtime.taskexecutor.TaskExecutor - Un-registering task and sending final execution state FINISHED to JobManager for task MapPartition (MapPartition at [3]assert_that/{Group, Unkey, Match}) 65361e03556455d86819e36d37e4f55f.
[jobmanager-future-thread-12] INFO org.apache.flink.runtime.executiongraph.ExecutionGraph - DataSink (DiscardingOutput) (1/2) (1907911dd24ac6cdabe6726410e296f0) switched from CREATED to SCHEDULED.
[flink-akka.actor.default-dispatcher-5] INFO org.apache.flink.runtime.executiongraph.ExecutionGraph - DataSink (DiscardingOutput) (1/2) (1907911dd24ac6cdabe6726410e296f0) switched from SCHEDULED to DEPLOYING.
[flink-akka.actor.default-dispatcher-5] INFO org.apache.flink.runtime.executiongraph.ExecutionGraph - Deploying DataSink (DiscardingOutput) (1/2) (attempt #0) to localhost
[flink-akka.actor.default-dispatcher-4] INFO org.apache.flink.runtime.taskexecutor.TaskExecutor - Received task DataSink (DiscardingOutput) (1/2).
[flink-akka.actor.default-dispatcher-5] INFO org.apache.flink.runtime.executiongraph.ExecutionGraph - MapPartition (MapPartition at [3]assert_that/{Group, Unkey, Match}) (1/2) (65361e03556455d86819e36d37e4f55f) switched from RUNNING to FINISHED.
[DataSink (DiscardingOutput) (1/2)] INFO org.apache.flink.runtime.taskmanager.Task - DataSink (DiscardingOutput) (1/2) (1907911dd24ac6cdabe6726410e296f0) switched from CREATED to DEPLOYING.
[DataSink (DiscardingOutput) (1/2)] INFO org.apache.flink.runtime.taskmanager.Task - Creating FileSystem stream leak safety net for task DataSink (DiscardingOutput) (1/2) (1907911dd24ac6cdabe6726410e296f0) [DEPLOYING]
[DataSink (DiscardingOutput) (1/2)] INFO org.apache.flink.runtime.taskmanager.Task - Loading JAR files for task DataSink (DiscardingOutput) (1/2) (1907911dd24ac6cdabe6726410e296f0) [DEPLOYING].
[DataSink (DiscardingOutput) (1/2)] INFO org.apache.flink.runtime.taskmanager.Task - Registering task at network: DataSink (DiscardingOutput) (1/2) (1907911dd24ac6cdabe6726410e296f0) [DEPLOYING].
[DataSink (DiscardingOutput) (1/2)] INFO org.apache.flink.runtime.taskmanager.Task - DataSink (DiscardingOutput) (1/2) (1907911dd24ac6cdabe6726410e296f0) switched from DEPLOYING to RUNNING.
[flink-akka.actor.default-dispatcher-4] INFO org.apache.flink.runtime.executiongraph.ExecutionGraph - DataSink (DiscardingOutput) (1/2) (1907911dd24ac6cdabe6726410e296f0) switched from DEPLOYING to RUNNING.
[DataSink (DiscardingOutput) (1/2)] INFO org.apache.flink.runtime.taskmanager.Task - DataSink (DiscardingOutput) (1/2) (1907911dd24ac6cdabe6726410e296f0) switched from RUNNING to FINISHED.
[DataSink (DiscardingOutput) (1/2)] INFO org.apache.flink.runtime.taskmanager.Task - Freeing task resources for DataSink (DiscardingOutput) (1/2) (1907911dd24ac6cdabe6726410e296f0).
[DataSink (DiscardingOutput) (1/2)] INFO org.apache.flink.runtime.taskmanager.Task - Ensuring all FileSystem streams are closed for task DataSink (DiscardingOutput) (1/2) (1907911dd24ac6cdabe6726410e296f0) [FINISHED]
[flink-akka.actor.default-dispatcher-4] INFO org.apache.flink.runtime.taskexecutor.TaskExecutor - Un-registering task and sending final execution state FINISHED to JobManager for task DataSink (DiscardingOutput) 1907911dd24ac6cdabe6726410e296f0.
[flink-akka.actor.default-dispatcher-4] INFO org.apache.flink.runtime.executiongraph.ExecutionGraph - DataSink (DiscardingOutput) (1/2) (1907911dd24ac6cdabe6726410e296f0) switched from RUNNING to FINISHED.
[flink-akka.actor.default-dispatcher-4] INFO org.apache.flink.runtime.executiongraph.ExecutionGraph - Job BeamApp-root-0724235822-59981b2a (9afb668e3d6abfb7d323cda6fb4f8a72) switched from state RUNNING to FINISHED.
[flink-akka.actor.default-dispatcher-9] INFO org.apache.flink.runtime.dispatcher.StandaloneDispatcher - Job 9afb668e3d6abfb7d323cda6fb4f8a72 reached globally terminal state FINISHED.
[flink-runner-job-invoker] INFO org.apache.flink.runtime.minicluster.MiniCluster - Shutting down Flink Mini Cluster
[flink-runner-job-invoker] INFO org.apache.flink.runtime.dispatcher.DispatcherRestEndpoint - Shutting down rest endpoint.
[flink-akka.actor.default-dispatcher-4] INFO org.apache.flink.runtime.jobmaster.JobMaster - Stopping the JobMaster for job BeamApp-root-0724235822-59981b2a(9afb668e3d6abfb7d323cda6fb4f8a72).
[flink-akka.actor.default-dispatcher-5] INFO org.apache.flink.runtime.taskexecutor.TaskExecutor - Stopping TaskExecutor akka://flink/user/taskmanager_0.
[flink-akka.actor.default-dispatcher-9] INFO org.apache.flink.runtime.dispatcher.StandaloneDispatcher - Stopping dispatcher akka://flink/user/dispatcher87bfe008-3e9d-49c1-a68c-622b581fd726.
[flink-akka.actor.default-dispatcher-9] INFO org.apache.flink.runtime.dispatcher.StandaloneDispatcher - Stopping all currently running jobs of dispatcher akka://flink/user/dispatcher87bfe008-3e9d-49c1-a68c-622b581fd726.
[flink-akka.actor.default-dispatcher-5] INFO org.apache.flink.runtime.state.TaskExecutorLocalStateStoresManager - Shutting down TaskExecutorLocalStateStoresManager.
[flink-akka.actor.default-dispatcher-4] INFO org.apache.flink.runtime.jobmaster.JobMaster - Close ResourceManager connection 7d5a75660e67f3cc6e0dec7078954420: JobManager is shutting down..
[flink-akka.actor.default-dispatcher-8] INFO org.apache.flink.runtime.jobmaster.slotpool.SlotPool - Suspending SlotPool.
[flink-akka.actor.default-dispatcher-8] INFO org.apache.flink.runtime.jobmaster.slotpool.SlotPool - Stopping SlotPool.
[flink-akka.actor.default-dispatcher-4] INFO org.apache.flink.runtime.resourcemanager.StandaloneResourceManager - Disconnect job manager a22afe53867910eb48c77560cfa14b16@akka://flink/user/jobmanager_1 for job 9afb668e3d6abfb7d323cda6fb4f8a72 from the resource manager.
[flink-akka.actor.default-dispatcher-4] INFO org.apache.flink.runtime.taskexecutor.TaskExecutor - JobManager for job 9afb668e3d6abfb7d323cda6fb4f8a72 with leader id a22afe53867910eb48c77560cfa14b16 lost leadership.
[flink-akka.actor.default-dispatcher-5] INFO org.apache.flink.runtime.io.disk.iomanager.IOManager - I/O manager removed spill file directory /tmp/flink-io-a289079f-a781-4f96-a41f-25133842a02d
[flink-akka.actor.default-dispatcher-5] INFO org.apache.flink.runtime.io.network.NetworkEnvironment - Shutting down the network environment and its components.
[flink-akka.actor.default-dispatcher-4] INFO org.apache.flink.runtime.resourcemanager.slotmanager.SlotManager - Closing the SlotManager.
[flink-akka.actor.default-dispatcher-4] INFO org.apache.flink.runtime.resourcemanager.slotmanager.SlotManager - Suspending the SlotManager.
[flink-akka.actor.default-dispatcher-8] INFO org.apache.flink.runtime.rest.handler.legacy.backpressure.StackTraceSampleCoordinator - Shutting down stack trace sample coordinator.
[flink-akka.actor.default-dispatcher-5] INFO org.apache.flink.runtime.taskexecutor.JobLeaderService - Stop job leader service.
[flink-akka.actor.default-dispatcher-8] INFO org.apache.flink.runtime.dispatcher.StandaloneDispatcher - Stopped dispatcher akka://flink/user/dispatcher87bfe008-3e9d-49c1-a68c-622b581fd726.
[ForkJoinPool.commonPool-worker-2] INFO org.apache.flink.runtime.dispatcher.DispatcherRestEndpoint - Removing cache directory /tmp/flink-web-ui
[flink-akka.actor.default-dispatcher-5] INFO org.apache.flink.runtime.taskexecutor.TaskExecutor - Stopped TaskExecutor akka://flink/user/taskmanager_0.
[ForkJoinPool.commonPool-worker-2] INFO org.apache.flink.runtime.dispatcher.DispatcherRestEndpoint - Shut down complete.
[ForkJoinPool.commonPool-worker-2] INFO org.apache.flink.runtime.rpc.akka.AkkaRpcService - Stopping Akka RPC service.
[flink-akka.actor.default-dispatcher-4] INFO org.apache.flink.runtime.blob.PermanentBlobCache - Shutting down BLOB cache
[flink-akka.actor.default-dispatcher-4] INFO org.apache.flink.runtime.blob.TransientBlobCache - Shutting down BLOB cache
[flink-akka.actor.default-dispatcher-4] INFO org.apache.flink.runtime.blob.BlobServer - Stopped BLOB server at 0.0.0.0:34375
[flink-akka.actor.default-dispatcher-4] INFO org.apache.flink.runtime.rpc.akka.AkkaRpcService - Stopped Akka RPC service.
[flink-runner-job-invoker] INFO org.apache.beam.runners.flink.FlinkRunner - Execution finished in 18473 msecs
[flink-runner-job-invoker] INFO org.apache.beam.runners.flink.FlinkRunner - Final accumulator values:
[flink-runner-job-invoker] INFO org.apache.beam.runners.flink.FlinkRunner - __metricscontainers : MetricQueryResults(Counters(ref_PCollection_PCollection_14:beam:metric:pardo_execution_time:start_bundle_msecs:v1 {PTRANSFORM=ref_AppliedPTransform_assert_that/Group/Flatten_34}: 0, ref_PCollection_PCollection_27:beam:metric:pardo_execution_time:start_bundle_msecs:v1 {PTRANSFORM=fn/read/ref_PCollection_PCollection_27:0}: 0, ref_PCollection_PCollection_12:beam:metric:pardo_execution_time:finish_bundle_msecs:v1 {PTRANSFORM=ExternalTransform(pytest:beam:transforms:count)/Combine.perKey(Count)/Precombine}: 0, ref_PCollection_PCollection_9:beam:metric:pardo_execution_time:finish_bundle_msecs:v1 {PTRANSFORM=fn/read/ref_PCollection_PCollection_9:0}: 0, ref_PCollection_PCollection_9:beam:metric:pardo_execution_time:start_bundle_msecs:v1 {PTRANSFORM=fn/read/ref_PCollection_PCollection_9:0}: 0, ref_PCollection_PCollection_27:beam:metric:pardo_execution_time:finish_bundle_msecs:v1 {PTRANSFORM=fn/read/ref_PCollection_PCollection_27:0}: 0, ref_PCollection_PCollection_9:beam:metric:pardo_execution_time:process_bundle_msecs:v1 {PTRANSFORM=fn/read/ref_PCollection_PCollection_9:0}: 0, ref_PCollection_PCollection_14:beam:metric:pardo_execution_time:finish_bundle_msecs:v1 {PTRANSFORM=ref_AppliedPTransform_assert_that/ToVoidKey_30}: 0, ref_PCollection_PCollection_12:beam:metric:pardo_execution_time:process_bundle_msecs:v1 {PTRANSFORM=external_2root/Init/Map/ParMultiDo(Anonymous)}: 0, ref_PCollection_PCollection_9:beam:metric:pardo_execution_time:finish_bundle_msecs:v1 {PTRANSFORM=fn/write/ref_PCollection_PCollection_12:0}: 0, ref_PCollection_PCollection_12:beam:metric:element_count:v1 {PCOLLECTION=pcollection}: 5, ref_PCollection_PCollection_12:beam:metric:pardo_execution_time:process_bundle_msecs:v1 {PTRANSFORM=ExternalTransform(pytest:beam:transforms:count)/Combine.perKey(Count)/Precombine}: 0, ref_PCollection_PCollection_1:beam:metric:ptransform_execution_time:total_msecs:v1 {PTRANSFORM=fn/read/ref_PCollection_PCollection_1:0}: 0, ref_PCollection_PCollection_14:beam:metric:pardo_execution_time:process_bundle_msecs:v1 {PTRANSFORM=ref_AppliedPTransform_assert_that/ToVoidKey_30}: 0, ref_PCollection_PCollection_14:beam:metric:pardo_execution_time:finish_bundle_msecs:v1 {PTRANSFORM=fn/write/ref_PCollection_PCollection_24:1:0}: 0, ref_PCollection_PCollection_14:beam:metric:pardo_execution_time:start_bundle_msecs:v1 {PTRANSFORM=fn/read/ref_PCollection_PCollection_14:0}: 0, ref_PCollection_PCollection_14:beam:metric:pardo_execution_time:start_bundle_msecs:v1 {PTRANSFORM=fn/write/ref_PCollection_PCollection_24:1:0}: 0, ref_PCollection_PCollection_14:beam:metric:pardo_execution_time:finish_bundle_msecs:v1 {PTRANSFORM=fn/read/ref_PCollection_PCollection_14:0}: 0, ref_PCollection_PCollection_9:beam:metric:pardo_execution_time:start_bundle_msecs:v1 {PTRANSFORM=fn/write/ref_PCollection_PCollection_12:0}: 0, ref_PCollection_PCollection_14:beam:metric:pardo_execution_time:finish_bundle_msecs:v1 {PTRANSFORM=ref_AppliedPTransform_assert_that/Group/Flatten_34}: 0, ref_PCollection_PCollection_12:beam:metric:pardo_execution_time:start_bundle_msecs:v1 {PTRANSFORM=ExternalTransform(pytest:beam:transforms:count)/Combine.perKey(Count)/Precombine}: 0, ref_PCollection_PCollection_14:beam:metric:pardo_execution_time:start_bundle_msecs:v1 {PTRANSFORM=ref_AppliedPTransform_Map(<lambda at external_test.py:213>)_22}: 0, ref_PCollection_PCollection_9:beam:metric:ptransform_execution_time:total_msecs:v1 {PTRANSFORM=ref_AppliedPTransform_Create/Map(decode)_16}: 0, ref_PCollection_PCollection_17:beam:metric:element_count:v1 {PCOLLECTION=ref_PCollection_PCollection_18}: 1, ref_PCollection_PCollection_17:beam:metric:element_count:v1 {PCOLLECTION=ref_PCollection_PCollection_19}: 1, ref_PCollection_PCollection_17:beam:metric:ptransform_execution_time:total_msecs:v1 {PTRANSFORM=ref_AppliedPTransform_assert_that/Create/Map(decode)_28}: 0, ref_PCollection_PCollection_17:beam:metric:element_count:v1 {PCOLLECTION=ref_PCollection_PCollection_17}: 1, ref_PCollection_PCollection_12:beam:metric:pardo_execution_time:finish_bundle_msecs:v1 {PTRANSFORM=external_2root/Init/Map/ParMultiDo(Anonymous)}: 0, ref_PCollection_PCollection_17:beam:metric:pardo_execution_time:process_bundle_msecs:v1 {PTRANSFORM=ref_AppliedPTransform_assert_that/Create/FlatMap(<lambda at core.py:2257>)_26}: 0, pcollection_1:beam:metric:pardo_execution_time:start_bundle_msecs:v1 {PTRANSFORM=fn/write/ref_PCollection_PCollection_14:0}: 0, pcollection_1:beam:metric:pardo_execution_time:finish_bundle_msecs:v1 {PTRANSFORM=fn/write/ref_PCollection_PCollection_14:0}: 0, ref_PCollection_PCollection_27:beam:metric:pardo_execution_time:start_bundle_msecs:v1 {PTRANSFORM=ref_AppliedPTransform_assert_that/Match_41}: 0, pcollection_1:beam:metric:element_count:v1 {PCOLLECTION=pcollection_1}: 3, ref_PCollection_PCollection_17:beam:metric:element_count:v1 {PCOLLECTION=ref_PCollection_PCollection_24:0}: 1, ref_PCollection_PCollection_14:beam:metric:pardo_execution_time:process_bundle_msecs:v1 {PTRANSFORM=fn/read/ref_PCollection_PCollection_14:0}: 0, ref_PCollection_PCollection_1:beam:metric:pardo_execution_time:process_bundle_msecs:v1 {PTRANSFORM=fn/write/ref_PCollection_PCollection_2:0}: 0, ref_PCollection_PCollection_27:beam:metric:pardo_execution_time:finish_bundle_msecs:v1 {PTRANSFORM=ref_AppliedPTransform_assert_that/Match_41}: 0, ref_PCollection_PCollection_1:beam:metric:element_count:v1 {PCOLLECTION=ref_PCollection_PCollection_1}: 1, ref_PCollection_PCollection_14:beam:metric:ptransform_execution_time:total_msecs:v1 {PTRANSFORM=ref_AppliedPTransform_assert_that/Group/Flatten_34}: 0, ref_PCollection_PCollection_14:beam:metric:pardo_execution_time:start_bundle_msecs:v1 {PTRANSFORM=ref_AppliedPTransform_assert_that/WindowInto(WindowIntoFn)_29}: 0, ref_PCollection_PCollection_14:beam:metric:pardo_execution_time:start_bundle_msecs:v1 {PTRANSFORM=ref_AppliedPTransform_assert_that/ToVoidKey_30}: 0, ref_PCollection_PCollection_1:beam:metric:element_count:v1 {PCOLLECTION=ref_PCollection_PCollection_2}: 12, pcollection_1:beam:metric:element_count:v1 {PCOLLECTION=pcollection_2}: 3, ref_PCollection_PCollection_17:beam:metric:ptransform_execution_time:total_msecs:v1 {PTRANSFORM=ref_AppliedPTransform_assert_that/Create/FlatMap(<lambda at core.py:2257>)_26}: 0, ref_PCollection_PCollection_27:beam:metric:element_count:v1 {PCOLLECTION=ref_PCollection_PCollection_30}: 1, ref_PCollection_PCollection_14:beam:metric:pardo_execution_time:finish_bundle_msecs:v1 {PTRANSFORM=ref_AppliedPTransform_Map(<lambda at external_test.py:213>)_22}: 0, ref_PCollection_PCollection_14:beam:metric:pardo_execution_time:process_bundle_msecs:v1 {PTRANSFORM=ref_AppliedPTransform_Map(<lambda at external_test.py:213>)_22}: 0, ref_PCollection_PCollection_14:beam:metric:pardo_execution_time:process_bundle_msecs:v1 {PTRANSFORM=ref_AppliedPTransform_assert_that/Group/Flatten_34}: 0, ref_PCollection_PCollection_14:beam:metric:ptransform_execution_time:total_msecs:v1 {PTRANSFORM=fn/read/ref_PCollection_PCollection_14:0}: 0, ref_PCollection_PCollection_14:beam:metric:pardo_execution_time:process_bundle_msecs:v1 {PTRANSFORM=ref_AppliedPTransform_assert_that/WindowInto(WindowIntoFn)_29}: 0, pcollection_1:beam:metric:pardo_execution_time:finish_bundle_msecs:v1 {PTRANSFORM=fn/read/pcollection_1:0}: 0, ref_PCollection_PCollection_17:beam:metric:ptransform_execution_time:total_msecs:v1 {PTRANSFORM=ref_AppliedPTransform_assert_that/Group/pair_with_0_32}: 0, ref_PCollection_PCollection_9:beam:metric:pardo_execution_time:process_bundle_msecs:v1 {PTRANSFORM=ref_AppliedPTransform_Map(unicode)_17}: 0, ref_PCollection_PCollection_27:beam:metric:pardo_execution_time:finish_bundle_msecs:v1 {PTRANSFORM=ref_AppliedPTransform_assert_that/Unkey_40}: 0, ref_PCollection_PCollection_14:beam:metric:ptransform_execution_time:total_msecs:v1 {PTRANSFORM=ref_AppliedPTransform_Map(<lambda at external_test.py:213>)_22}: 0, pcollection_1:beam:metric:pardo_execution_time:process_bundle_msecs:v1 {PTRANSFORM=ExternalTransform(pytest:beam:transforms:count)/Combine.perKey(Count)/Merge}: 0, ref_PCollection_PCollection_12:beam:metric:pardo_execution_time:start_bundle_msecs:v1 {PTRANSFORM=external_2root/Init/Map/ParMultiDo(Anonymous)}: 0, ref_PCollection_PCollection_1:beam:metric:ptransform_execution_time:total_msecs:v1 {PTRANSFORM=ref_AppliedPTransform_Create/FlatMap(<lambda at core.py:2257>)_4}: 7, ref_PCollection_PCollection_27:beam:metric:pardo_execution_time:start_bundle_msecs:v1 {PTRANSFORM=ref_AppliedPTransform_assert_that/Group/Map(_merge_tagged_vals_under_key)_39}: 0, ref_PCollection_PCollection_9:beam:metric:ptransform_execution_time:total_msecs:v1 {PTRANSFORM=ref_AppliedPTransform_Map(unicode)_17}: 0, ref_PCollection_PCollection_14:beam:metric:pardo_execution_time:finish_bundle_msecs:v1 {PTRANSFORM=ref_AppliedPTransform_assert_that/WindowInto(WindowIntoFn)_29}: 0, ref_PCollection_PCollection_17:beam:metric:pardo_execution_time:start_bundle_msecs:v1 {PTRANSFORM=fn/write/ref_PCollection_PCollection_24:0:0}: 0, ref_PCollection_PCollection_27:beam:metric:ptransform_execution_time:total_msecs:v1 {PTRANSFORM=fn/read/ref_PCollection_PCollection_27:0}: 0, ref_PCollection_PCollection_14:beam:metric:ptransform_execution_time:total_msecs:v1 {PTRANSFORM=ref_AppliedPTransform_assert_that/ToVoidKey_30}: 0, ref_PCollection_PCollection_27:beam:metric:ptransform_execution_time:total_msecs:v1 {PTRANSFORM=ref_AppliedPTransform_assert_that/Unkey_40}: 0, pcollection_1:beam:metric:element_count:v1 {PCOLLECTION=ref_PCollection_PCollection_14}: 3, ref_PCollection_PCollection_27:beam:metric:pardo_execution_time:process_bundle_msecs:v1 {PTRANSFORM=fn/read/ref_PCollection_PCollection_27:0}: 0, ref_PCollection_PCollection_17:beam:metric:pardo_execution_time:finish_bundle_msecs:v1 {PTRANSFORM=ref_AppliedPTransform_assert_that/Create/FlatMap(<lambda at core.py:2257>)_26}: 0, ref_PCollection_PCollection_14:beam:metric:ptransform_execution_time:total_msecs:v1 {PTRANSFORM=ref_AppliedPTransform_assert_that/Group/pair_with_1_33}: 2, ref_PCollection_PCollection_17:beam:metric:element_count:v1 {PCOLLECTION=ref_PCollection_PCollection_22}: 1, ref_PCollection_PCollection_14:beam:metric:pardo_execution_time:start_bundle_msecs:v1 {PTRANSFORM=ref_AppliedPTransform_Map(<lambda at external_test.py:212>)_21}: 0, ref_PCollection_PCollection_27:beam:metric:element_count:v1 {PCOLLECTION=ref_PCollection_PCollection_28}: 1, ref_PCollection_PCollection_14:beam:metric:pardo_execution_time:process_bundle_msecs:v1 {PTRANSFORM=fn/write/ref_PCollection_PCollection_24:1:0}: 0, ref_PCollection_PCollection_17:beam:metric:ptransform_execution_time:total_msecs:v1 {PTRANSFORM=fn/read/ref_PCollection_PCollection_17:0}: 0, ref_PCollection_PCollection_27:beam:metric:element_count:v1 {PCOLLECTION=ref_PCollection_PCollection_29}: 1, ref_PCollection_PCollection_12:beam:metric:element_count:v1 {PCOLLECTION=external_2root/Init/Map/ParMultiDo(Anonymous).output}: 6, ref_PCollection_PCollection_27:beam:metric:element_count:v1 {PCOLLECTION=ref_PCollection_PCollection_27}: 1, pcollection_1:beam:metric:pardo_execution_time:start_bundle_msecs:v1 {PTRANSFORM=fn/read/pcollection_1:0}: 0, ref_PCollection_PCollection_17:beam:metric:pardo_execution_time:start_bundle_msecs:v1 {PTRANSFORM=ref_AppliedPTransform_assert_that/Create/FlatMap(<lambda at core.py:2257>)_26}: 0, pcollection_1:beam:metric:pardo_execution_time:process_bundle_msecs:v1 {PTRANSFORM=ExternalTransform(pytest:beam:transforms:count)/Combine.perKey(Count)/ExtractOutputs}: 0, ref_PCollection_PCollection_9:beam:metric:pardo_execution_time:finish_bundle_msecs:v1 {PTRANSFORM=ref_AppliedPTransform_Map(unicode)_17}: 0, ref_PCollection_PCollection_17:beam:metric:ptransform_execution_time:total_msecs:v1 {PTRANSFORM=fn/write/ref_PCollection_PCollection_24:0:0}: 0, ref_PCollection_PCollection_9:beam:metric:pardo_execution_time:finish_bundle_msecs:v1 {PTRANSFORM=ref_AppliedPTransform_Map(<lambda at external_test.py:208>)_18}: 0, ref_PCollection_PCollection_9:beam:metric:pardo_execution_time:finish_bundle_msecs:v1 {PTRANSFORM=ref_AppliedPTransform_Create/Map(decode)_16}: 0, ref_PCollection_PCollection_27:beam:metric:pardo_execution_time:process_bundle_msecs:v1 {PTRANSFORM=ref_AppliedPTransform_assert_that/Group/Map(_merge_tagged_vals_under_key)_39}: 0, ref_PCollection_PCollection_17:beam:metric:pardo_execution_time:start_bundle_msecs:v1 {PTRANSFORM=ref_AppliedPTransform_assert_that/Group/Flatten_34}: 0, ref_PCollection_PCollection_27:beam:metric:pardo_execution_time:finish_bundle_msecs:v1 {PTRANSFORM=ref_AppliedPTransform_assert_that/Group/Map(_merge_tagged_vals_under_key)_39}: 0, ref_PCollection_PCollection_17:beam:metric:pardo_execution_time:finish_bundle_msecs:v1 {PTRANSFORM=ref_AppliedPTransform_assert_that/Group/Flatten_34}: 0, ref_PCollection_PCollection_12:beam:metric:pardo_execution_time:finish_bundle_msecs:v1 {PTRANSFORM=fn/write/pcollection:0}: 0, ref_PCollection_PCollection_12:beam:metric:pardo_execution_time:finish_bundle_msecs:v1 {PTRANSFORM=fn/read/ref_PCollection_PCollection_12:0}: 0, ref_PCollection_PCollection_12:beam:metric:pardo_execution_time:start_bundle_msecs:v1 {PTRANSFORM=fn/write/pcollection:0}: 0, ref_PCollection_PCollection_12:beam:metric:element_count:v1 {PCOLLECTION=ref_PCollection_PCollection_13}: 6, ref_PCollection_PCollection_14:beam:metric:pardo_execution_time:process_bundle_msecs:v1 {PTRANSFORM=ref_AppliedPTransform_Map(<lambda at external_test.py:212>)_21}: 0, ref_PCollection_PCollection_9:beam:metric:pardo_execution_time:process_bundle_msecs:v1 {PTRANSFORM=ref_AppliedPTransform_Create/Map(decode)_16}: 0, ref_PCollection_PCollection_14:beam:metric:pardo_execution_time:finish_bundle_msecs:v1 {PTRANSFORM=ref_AppliedPTransform_Map(<lambda at external_test.py:212>)_21}: 0, ref_PCollection_PCollection_12:beam:metric:pardo_execution_time:process_bundle_msecs:v1 {PTRANSFORM=fn/write/pcollection:0}: 0, ref_PCollection_PCollection_9:beam:metric:pardo_execution_time:start_bundle_msecs:v1 {PTRANSFORM=ref_AppliedPTransform_Map(unicode)_17}: 0, ref_PCollection_PCollection_9:beam:metric:pardo_execution_time:start_bundle_msecs:v1 {PTRANSFORM=ref_AppliedPTransform_Map(<lambda at external_test.py:208>)_18}: 0, ref_PCollection_PCollection_27:beam:metric:pardo_execution_time:start_bundle_msecs:v1 {PTRANSFORM=ref_AppliedPTransform_assert_that/Unkey_40}: 0, ref_PCollection_PCollection_17:beam:metric:pardo_execution_time:finish_bundle_msecs:v1 {PTRANSFORM=ref_AppliedPTransform_assert_that/Group/pair_with_0_32}: 0, ref_PCollection_PCollection_1:beam:metric:pardo_execution_time:process_bundle_msecs:v1 {PTRANSFORM=fn/read/ref_PCollection_PCollection_1:0}: 0, ref_PCollection_PCollection_17:beam:metric:pardo_execution_time:process_bundle_msecs:v1 {PTRANSFORM=ref_AppliedPTransform_assert_that/Group/pair_with_0_32}: 0, ref_PCollection_PCollection_14:beam:metric:element_count:v1 {PCOLLECTION=ref_PCollection_PCollection_14}: 3, ref_PCollection_PCollection_12:beam:metric:pardo_execution_time:start_bundle_msecs:v1 {PTRANSFORM=fn/read/ref_PCollection_PCollection_12:0}: 0, ref_PCollection_PCollection_9:beam:metric:element_count:v1 {PCOLLECTION=ref_PCollection_PCollection_9}: 12, ref_PCollection_PCollection_17:beam:metric:pardo_execution_time:process_bundle_msecs:v1 {PTRANSFORM=fn/write/ref_PCollection_PCollection_24:0:0}: 0, ref_PCollection_PCollection_14:beam:metric:element_count:v1 {PCOLLECTION=ref_PCollection_PCollection_16}: 3, ref_PCollection_PCollection_17:beam:metric:pardo_execution_time:finish_bundle_msecs:v1 {PTRANSFORM=fn/write/ref_PCollection_PCollection_24:0:0}: 0, ref_PCollection_PCollection_1:beam:metric:pardo_execution_time:start_bundle_msecs:v1 {PTRANSFORM=fn/read/ref_PCollection_PCollection_1:0}: 0, ref_PCollection_PCollection_14:beam:metric:element_count:v1 {PCOLLECTION=ref_PCollection_PCollection_15}: 3, ref_PCollection_PCollection_17:beam:metric:pardo_execution_time:process_bundle_msecs:v1 {PTRANSFORM=ref_AppliedPTransform_assert_that/Group/Flatten_34}: 0, ref_PCollection_PCollection_1:beam:metric:ptransform_execution_time:total_msecs:v1 {PTRANSFORM=fn/write/ref_PCollection_PCollection_2:0}: 0, ref_PCollection_PCollection_17:beam:metric:ptransform_execution_time:total_msecs:v1 {PTRANSFORM=ref_AppliedPTransform_assert_that/Group/Flatten_34}: 0, ref_PCollection_PCollection_12:beam:metric:element_count:v1 {PCOLLECTION=ref_PCollection_PCollection_12}: 12, ref_PCollection_PCollection_14:beam:metric:ptransform_execution_time:total_msecs:v1 {PTRANSFORM=ref_AppliedPTransform_Map(<lambda at external_test.py:212>)_21}: 0, ref_PCollection_PCollection_1:beam:metric:pardo_execution_time:finish_bundle_msecs:v1 {PTRANSFORM=fn/read/ref_PCollection_PCollection_1:0}: 0, ref_PCollection_PCollection_9:beam:metric:ptransform_execution_time:total_msecs:v1 {PTRANSFORM=fn/read/ref_PCollection_PCollection_9:0}: 0, ref_PCollection_PCollection_1:beam:metric:pardo_execution_time:process_bundle_msecs:v1 {PTRANSFORM=ref_AppliedPTransform_Create/FlatMap(<lambda at core.py:2257>)_4}: 2, ref_PCollection_PCollection_14:beam:metric:element_count:v1 {PCOLLECTION=ref_PCollection_PCollection_24:1}: 3, ref_PCollection_PCollection_27:beam:metric:pardo_execution_time:process_bundle_msecs:v1 {PTRANSFORM=ref_AppliedPTransform_assert_that/Unkey_40}: 0, ref_PCollection_PCollection_9:beam:metric:pardo_execution_time:process_bundle_msecs:v1 {PTRANSFORM=ref_AppliedPTransform_Map(<lambda at external_test.py:208>)_18}: 0, ref_PCollection_PCollection_14:beam:metric:pardo_execution_time:finish_bundle_msecs:v1 {PTRANSFORM=ref_AppliedPTransform_assert_that/Group/pair_with_1_33}: 0, ref_PCollection_PCollection_14:beam:metric:ptransform_execution_time:total_msecs:v1 {PTRANSFORM=fn/write/ref_PCollection_PCollection_24:1:0}: 0, ref_PCollection_PCollection_14:beam:metric:pardo_execution_time:process_bundle_msecs:v1 {PTRANSFORM=ref_AppliedPTransform_assert_that/Group/pair_with_1_33}: 0, ref_PCollection_PCollection_17:beam:metric:pardo_execution_time:start_bundle_msecs:v1 {PTRANSFORM=ref_AppliedPTransform_assert_that/Create/Map(decode)_28}: 0, ref_PCollection_PCollection_17:beam:metric:pardo_execution_time:process_bundle_msecs:v1 {PTRANSFORM=ref_AppliedPTransform_assert_that/Create/Map(decode)_28}: 0, ref_PCollection_PCollection_9:beam:metric:pardo_execution_time:process_bundle_msecs:v1 {PTRANSFORM=fn/write/ref_PCollection_PCollection_12:0}: 0, ref_PCollection_PCollection_14:beam:metric:pardo_execution_time:start_bundle_msecs:v1 {PTRANSFORM=ref_AppliedPTransform_assert_that/Group/pair_with_1_33}: 2, ref_PCollection_PCollection_17:beam:metric:pardo_execution_time:start_bundle_msecs:v1 {PTRANSFORM=fn/read/ref_PCollection_PCollection_17:0}: 0, ref_PCollection_PCollection_27:beam:metric:pardo_execution_time:process_bundle_msecs:v1 {PTRANSFORM=ref_AppliedPTransform_assert_that/Match_41}: 0, ref_PCollection_PCollection_1:beam:metric:pardo_execution_time:start_bundle_msecs:v1 {PTRANSFORM=ref_AppliedPTransform_Create/FlatMap(<lambda at core.py:2257>)_4}: 5, ref_PCollection_PCollection_9:beam:metric:ptransform_execution_time:total_msecs:v1 {PTRANSFORM=ref_AppliedPTransform_Map(<lambda at external_test.py:208>)_18}: 0, ref_PCollection_PCollection_1:beam:metric:pardo_execution_time:finish_bundle_msecs:v1 {PTRANSFORM=ref_AppliedPTransform_Create/FlatMap(<lambda at core.py:2257>)_4}: 0, ref_PCollection_PCollection_1:beam:metric:pardo_execution_time:finish_bundle_msecs:v1 {PTRANSFORM=fn/write/ref_PCollection_PCollection_2:0}: 0, ref_PCollection_PCollection_9:beam:metric:ptransform_execution_time:total_msecs:v1 {PTRANSFORM=fn/write/ref_PCollection_PCollection_12:0}: 0, ref_PCollection_PCollection_17:beam:metric:pardo_execution_time:finish_bundle_msecs:v1 {PTRANSFORM=fn/read/ref_PCollection_PCollection_17:0}: 0, ref_PCollection_PCollection_17:beam:metric:pardo_execution_time:finish_bundle_msecs:v1 {PTRANSFORM=ref_AppliedPTransform_assert_that/Create/Map(decode)_28}: 0, ref_PCollection_PCollection_17:beam:metric:pardo_execution_time:start_bundle_msecs:v1 {PTRANSFORM=ref_AppliedPTransform_assert_that/Group/pair_with_0_32}: 0, ref_PCollection_PCollection_14:beam:metric:element_count:v1 {PCOLLECTION=ref_PCollection_PCollection_23}: 3, ref_PCollection_PCollection_27:beam:metric:ptransform_execution_time:total_msecs:v1 {PTRANSFORM=ref_AppliedPTransform_assert_that/Match_41}: 0, ref_PCollection_PCollection_14:beam:metric:element_count:v1 {PCOLLECTION=ref_PCollection_PCollection_20}: 3, pcollection_1:beam:metric:pardo_execution_time:process_bundle_msecs:v1 {PTRANSFORM=fn/write/ref_PCollection_PCollection_14:0}: 0, ref_PCollection_PCollection_14:beam:metric:element_count:v1 {PCOLLECTION=ref_PCollection_PCollection_21}: 3, ref_PCollection_PCollection_9:beam:metric:element_count:v1 {PCOLLECTION=ref_PCollection_PCollection_11}: 12, ref_PCollection_PCollection_9:beam:metric:element_count:v1 {PCOLLECTION=ref_PCollection_PCollection_12}: 12, ref_PCollection_PCollection_9:beam:metric:element_count:v1 {PCOLLECTION=ref_PCollection_PCollection_10}: 12, ref_PCollection_PCollection_27:beam:metric:ptransform_execution_time:total_msecs:v1 {PTRANSFORM=ref_AppliedPTransform_assert_that/Group/Map(_merge_tagged_vals_under_key)_39}: 0, ref_PCollection_PCollection_1:beam:metric:pardo_execution_time:start_bundle_msecs:v1 {PTRANSFORM=fn/write/ref_PCollection_PCollection_2:0}: 0, ref_PCollection_PCollection_14:beam:metric:ptransform_execution_time:total_msecs:v1 {PTRANSFORM=ref_AppliedPTransform_assert_that/WindowInto(WindowIntoFn)_29}: 0, ref_PCollection_PCollection_12:beam:metric:pardo_execution_time:finish_bundle_msecs:v1 {PTRANSFORM=external_1root/ParDo(Anonymous)/ParMultiDo(Anonymous)}: 0, ref_PCollection_PCollection_17:beam:metric:pardo_execution_time:process_bundle_msecs:v1 {PTRANSFORM=fn/read/ref_PCollection_PCollection_17:0}: 0, ref_PCollection_PCollection_12:beam:metric:pardo_execution_time:process_bundle_msecs:v1 {PTRANSFORM=external_1root/ParDo(Anonymous)/ParMultiDo(Anonymous)}: 0, ref_PCollection_PCollection_12:beam:metric:pardo_execution_time:start_bundle_msecs:v1 {PTRANSFORM=external_1root/ParDo(Anonymous)/ParMultiDo(Anonymous)}: 0, ref_PCollection_PCollection_9:beam:metric:pardo_execution_time:start_bundle_msecs:v1 {PTRANSFORM=ref_AppliedPTransform_Create/Map(decode)_16}: 0)Distributions(ref_PCollection_PCollection_14:beam:metric:sampled_byte_size:v1 {PCOLLECTION=ref_PCollection_PCollection_16}: DistributionResult{sum=54, count=3, min=18, max=18}, ref_PCollection_PCollection_14:beam:metric:sampled_byte_size:v1 {PCOLLECTION=ref_PCollection_PCollection_15}: DistributionResult{sum=51, count=3, min=17, max=17}, ref_PCollection_PCollection_14:beam:metric:sampled_byte_size:v1 {PCOLLECTION=ref_PCollection_PCollection_14}: DistributionResult{sum=45, count=3, min=15, max=15}, ref_PCollection_PCollection_27:beam:metric:sampled_byte_size:v1 {PCOLLECTION=ref_PCollection_PCollection_30}: DistributionResult{sum=14, count=1, min=14, max=14}, ref_PCollection_PCollection_17:beam:metric:sampled_byte_size:v1 {PCOLLECTION=ref_PCollection_PCollection_24:0}: DistributionResult{sum=19, count=1, min=19, max=19}, ref_PCollection_PCollection_17:beam:metric:sampled_byte_size:v1 {PCOLLECTION=ref_PCollection_PCollection_17}: DistributionResult{sum=13, count=1, min=13, max=13}, ref_PCollection_PCollection_14:beam:metric:sampled_byte_size:v1 {PCOLLECTION=ref_PCollection_PCollection_24:1}: DistributionResult{sum=72, count=3, min=24, max=24}, ref_PCollection_PCollection_17:beam:metric:sampled_byte_size:v1 {PCOLLECTION=ref_PCollection_PCollection_18}: DistributionResult{sum=16, count=1, min=16, max=16}, ref_PCollection_PCollection_17:beam:metric:sampled_byte_size:v1 {PCOLLECTION=ref_PCollection_PCollection_19}: DistributionResult{sum=15, count=1, min=15, max=15}, ref_PCollection_PCollection_9:beam:metric:sampled_byte_size:v1 {PCOLLECTION=ref_PCollection_PCollection_9}: DistributionResult{sum=192, count=12, min=16, max=16}, ref_PCollection_PCollection_17:beam:metric:sampled_byte_size:v1 {PCOLLECTION=ref_PCollection_PCollection_22}: DistributionResult{sum=17, count=1, min=17, max=17}, ref_PCollection_PCollection_9:beam:metric:sampled_byte_size:v1 {PCOLLECTION=ref_PCollection_PCollection_10}: DistributionResult{sum=168, count=12, min=14, max=14}, ref_PCollection_PCollection_9:beam:metric:sampled_byte_size:v1 {PCOLLECTION=ref_PCollection_PCollection_12}: DistributionResult{sum=168, count=12, min=14, max=14}, ref_PCollection_PCollection_9:beam:metric:sampled_byte_size:v1 {PCOLLECTION=ref_PCollection_PCollection_11}: DistributionResult{sum=168, count=12, min=14, max=14}, ref_PCollection_PCollection_1:beam:metric:sampled_byte_size:v1 {PCOLLECTION=ref_PCollection_PCollection_1}: DistributionResult{sum=13, count=1, min=13, max=13}, ref_PCollection_PCollection_27:beam:metric:sampled_byte_size:v1 {PCOLLECTION=ref_PCollection_PCollection_27}: DistributionResult{sum=58, count=1, min=58, max=58}, ref_PCollection_PCollection_27:beam:metric:sampled_byte_size:v1 {PCOLLECTION=ref_PCollection_PCollection_28}: DistributionResult{sum=41, count=1, min=41, max=41}, ref_PCollection_PCollection_14:beam:metric:sampled_byte_size:v1 {PCOLLECTION=ref_PCollection_PCollection_23}: DistributionResult{sum=63, count=3, min=21, max=21}, ref_PCollection_PCollection_27:beam:metric:sampled_byte_size:v1 {PCOLLECTION=ref_PCollection_PCollection_29}: DistributionResult{sum=33, count=1, min=33, max=33}, ref_PCollection_PCollection_1:beam:metric:sampled_byte_size:v1 {PCOLLECTION=ref_PCollection_PCollection_2}: DistributionResult{sum=180, count=12, min=15, max=15}, ref_PCollection_PCollection_14:beam:metric:sampled_byte_size:v1 {PCOLLECTION=ref_PCollection_PCollection_21}: DistributionResult{sum=57, count=3, min=19, max=19}, ref_PCollection_PCollection_14:beam:metric:sampled_byte_size:v1 {PCOLLECTION=ref_PCollection_PCollection_20}: DistributionResult{sum=54, count=3, min=18, max=18}))
[flink-runner-job-invoker] INFO org.apache.beam.runners.fnexecution.artifact.BeamFileSystemArtifactRetrievalService - Manifest at /tmp/beam-artifact-staging/job_7b4e2f7b-6bae-42a5-8e08-09cf9f4348e9/MANIFEST has 0 artifact locations
[flink-runner-job-invoker] INFO org.apache.beam.runners.fnexecution.artifact.BeamFileSystemArtifactStagingService - Removed dir /tmp/beam-artifact-staging/job_7b4e2f7b-6bae-42a5-8e08-09cf9f4348e9/
> Task :sdks:python:crossLanguageTests
FAILURE: Build failed with an exception.
* Where:
Build file '<https://builds.apache.org/job/beam_PostCommit_Python2/ws/src/sdks/python/build.gradle'> line: 184
* What went wrong:
Execution failed for task ':sdks:python:postCommitIT'.
> Process 'command 'sh'' finished with non-zero exit value 1
* Try:
Run with --stacktrace option to get the stack trace. Run with --info or --debug option to get more log output. Run with --scan to get full insights.
* Get more help at https://help.gradle.org
Deprecated Gradle features were used in this build, making it incompatible with Gradle 6.0.
Use '--warning-mode all' to show the individual deprecation warnings.
See https://docs.gradle.org/5.2.1/userguide/command_line_interface.html#sec:command_line_warnings
BUILD FAILED in 1h 10m 37s
105 actionable tasks: 89 executed, 13 from cache, 3 up-to-date
Publishing build scan...
https://gradle.com/s/2d62e2pvx2454
Build step 'Invoke Gradle script' changed build result to FAILURE
Build step 'Invoke Gradle script' marked build as failure
---------------------------------------------------------------------
To unsubscribe, e-mail: builds-unsubscribe@beam.apache.org
For additional commands, e-mail: builds-help@beam.apache.org
Jenkins build is back to normal : beam_PostCommit_Python2 #46
Posted by Apache Jenkins Server <je...@builds.apache.org>.
See <https://builds.apache.org/job/beam_PostCommit_Python2/46/display/redirect?page=changes>
---------------------------------------------------------------------
To unsubscribe, e-mail: builds-unsubscribe@beam.apache.org
For additional commands, e-mail: builds-help@beam.apache.org