You are viewing a plain text version of this content. The canonical link for it is here.
Posted to dev@lucene.apache.org by Apache Jenkins Server <je...@builds.apache.org> on 2011/10/25 22:21:45 UTC
[JENKINS] Lucene-Solr-tests-only-trunk - Build # 10997 - Failure
Build: https://builds.apache.org/job/Lucene-Solr-tests-only-trunk/10997/
1 tests failed.
FAILED: junit.framework.TestSuite.org.apache.solr.update.AutoCommitTest
Error Message:
java.lang.AssertionError: directory of test was not closed, opened from: org.apache.solr.core.MockDirectoryFactory.create(MockDirectoryFactory.java:33)
Stack Trace:
java.lang.RuntimeException: java.lang.AssertionError: directory of test was not closed, opened from: org.apache.solr.core.MockDirectoryFactory.create(MockDirectoryFactory.java:33)
at org.apache.lucene.util.LuceneTestCase.afterClassLuceneTestCaseJ4(LuceneTestCase.java:472)
at org.apache.lucene.util.LuceneTestCase.checkResourcesAfterClass(LuceneTestCase.java:530)
at org.apache.lucene.util.LuceneTestCase.afterClassLuceneTestCaseJ4(LuceneTestCase.java:440)
Build Log (for compile errors):
[...truncated 7819 lines...]
---------------------------------------------------------------------
To unsubscribe, e-mail: dev-unsubscribe@lucene.apache.org
For additional commands, e-mail: dev-help@lucene.apache.org