You are viewing a plain text version of this content. The canonical link for it is here.
Posted to dev@lucene.apache.org by Policeman Jenkins Server <je...@thetaphi.de> on 2016/08/07 11:27:29 UTC
[JENKINS-EA] Lucene-Solr-master-Linux (64bit/jdk-9-ea+129) - Build
# 17490 - Unstable!
Build: http://jenkins.thetaphi.de/job/Lucene-Solr-master-Linux/17490/
Java: 64bit/jdk-9-ea+129 -XX:-UseCompressedOops -XX:+UseParallelGC
1 tests failed.
FAILED: org.apache.solr.cloud.ForceLeaderTest.testReplicasInLIRNoLeader
Error Message:
No live SolrServers available to handle this request:[http://127.0.0.1:43713/forceleader_test_collection_shard1_replica3]
Stack Trace:
org.apache.solr.client.solrj.impl.CloudSolrClient$RouteException: No live SolrServers available to handle this request:[http://127.0.0.1:43713/forceleader_test_collection_shard1_replica3]
at __randomizedtesting.SeedInfo.seed([5F181DCCB6CE386B:B98F290C8F4CC10A]:0)
at org.apache.solr.client.solrj.impl.CloudSolrClient.directUpdate(CloudSolrClient.java:760)
at org.apache.solr.client.solrj.impl.CloudSolrClient.sendRequest(CloudSolrClient.java:1172)
at org.apache.solr.client.solrj.impl.CloudSolrClient.requestWithRetryOnStaleState(CloudSolrClient.java:1061)
at org.apache.solr.client.solrj.impl.CloudSolrClient.request(CloudSolrClient.java:997)
at org.apache.solr.cloud.AbstractFullDistribZkTestBase.sendDocsWithRetry(AbstractFullDistribZkTestBase.java:753)
at org.apache.solr.cloud.AbstractFullDistribZkTestBase.sendDocsWithRetry(AbstractFullDistribZkTestBase.java:741)
at org.apache.solr.cloud.ForceLeaderTest.sendDoc(ForceLeaderTest.java:424)
at org.apache.solr.cloud.ForceLeaderTest.testReplicasInLIRNoLeader(ForceLeaderTest.java:131)
at jdk.internal.reflect.NativeMethodAccessorImpl.invoke0(java.base@9-ea/Native Method)
at jdk.internal.reflect.NativeMethodAccessorImpl.invoke(java.base@9-ea/NativeMethodAccessorImpl.java:62)
at jdk.internal.reflect.DelegatingMethodAccessorImpl.invoke(java.base@9-ea/DelegatingMethodAccessorImpl.java:43)
at java.lang.reflect.Method.invoke(java.base@9-ea/Method.java:533)
at com.carrotsearch.randomizedtesting.RandomizedRunner.invoke(RandomizedRunner.java:1764)
at com.carrotsearch.randomizedtesting.RandomizedRunner$8.evaluate(RandomizedRunner.java:871)
at com.carrotsearch.randomizedtesting.RandomizedRunner$9.evaluate(RandomizedRunner.java:907)
at com.carrotsearch.randomizedtesting.RandomizedRunner$10.evaluate(RandomizedRunner.java:921)
at org.apache.solr.BaseDistributedSearchTestCase$ShardsRepeatRule$ShardsFixedStatement.callStatement(BaseDistributedSearchTestCase.java:985)
at org.apache.solr.BaseDistributedSearchTestCase$ShardsRepeatRule$ShardsStatement.evaluate(BaseDistributedSearchTestCase.java:960)
at com.carrotsearch.randomizedtesting.rules.SystemPropertiesRestoreRule$1.evaluate(SystemPropertiesRestoreRule.java:57)
at org.apache.lucene.util.TestRuleSetupTeardownChained$1.evaluate(TestRuleSetupTeardownChained.java:49)
at org.apache.lucene.util.AbstractBeforeAfterRule$1.evaluate(AbstractBeforeAfterRule.java:45)
at org.apache.lucene.util.TestRuleThreadAndTestName$1.evaluate(TestRuleThreadAndTestName.java:48)
at org.apache.lucene.util.TestRuleIgnoreAfterMaxFailures$1.evaluate(TestRuleIgnoreAfterMaxFailures.java:64)
at org.apache.lucene.util.TestRuleMarkFailure$1.evaluate(TestRuleMarkFailure.java:47)
at com.carrotsearch.randomizedtesting.rules.StatementAdapter.evaluate(StatementAdapter.java:36)
at com.carrotsearch.randomizedtesting.ThreadLeakControl$StatementRunner.run(ThreadLeakControl.java:367)
at com.carrotsearch.randomizedtesting.ThreadLeakControl.forkTimeoutingTask(ThreadLeakControl.java:809)
at com.carrotsearch.randomizedtesting.ThreadLeakControl$3.evaluate(ThreadLeakControl.java:460)
at com.carrotsearch.randomizedtesting.RandomizedRunner.runSingleTest(RandomizedRunner.java:880)
at com.carrotsearch.randomizedtesting.RandomizedRunner$5.evaluate(RandomizedRunner.java:781)
at com.carrotsearch.randomizedtesting.RandomizedRunner$6.evaluate(RandomizedRunner.java:816)
at com.carrotsearch.randomizedtesting.RandomizedRunner$7.evaluate(RandomizedRunner.java:827)
at com.carrotsearch.randomizedtesting.rules.StatementAdapter.evaluate(StatementAdapter.java:36)
at com.carrotsearch.randomizedtesting.rules.SystemPropertiesRestoreRule$1.evaluate(SystemPropertiesRestoreRule.java:57)
at org.apache.lucene.util.AbstractBeforeAfterRule$1.evaluate(AbstractBeforeAfterRule.java:45)
at com.carrotsearch.randomizedtesting.rules.StatementAdapter.evaluate(StatementAdapter.java:36)
at org.apache.lucene.util.TestRuleStoreClassName$1.evaluate(TestRuleStoreClassName.java:41)
at com.carrotsearch.randomizedtesting.rules.NoShadowingOrOverridesOnMethodsRule$1.evaluate(NoShadowingOrOverridesOnMethodsRule.java:40)
at com.carrotsearch.randomizedtesting.rules.NoShadowingOrOverridesOnMethodsRule$1.evaluate(NoShadowingOrOverridesOnMethodsRule.java:40)
at com.carrotsearch.randomizedtesting.rules.StatementAdapter.evaluate(StatementAdapter.java:36)
at com.carrotsearch.randomizedtesting.rules.StatementAdapter.evaluate(StatementAdapter.java:36)
at com.carrotsearch.randomizedtesting.rules.StatementAdapter.evaluate(StatementAdapter.java:36)
at org.apache.lucene.util.TestRuleAssertionsRequired$1.evaluate(TestRuleAssertionsRequired.java:53)
at org.apache.lucene.util.TestRuleMarkFailure$1.evaluate(TestRuleMarkFailure.java:47)
at org.apache.lucene.util.TestRuleIgnoreAfterMaxFailures$1.evaluate(TestRuleIgnoreAfterMaxFailures.java:64)
at org.apache.lucene.util.TestRuleIgnoreTestSuites$1.evaluate(TestRuleIgnoreTestSuites.java:54)
at com.carrotsearch.randomizedtesting.rules.StatementAdapter.evaluate(StatementAdapter.java:36)
at com.carrotsearch.randomizedtesting.ThreadLeakControl$StatementRunner.run(ThreadLeakControl.java:367)
at java.lang.Thread.run(java.base@9-ea/Thread.java:843)
Caused by: org.apache.solr.client.solrj.SolrServerException: No live SolrServers available to handle this request:[http://127.0.0.1:43713/forceleader_test_collection_shard1_replica3]
at org.apache.solr.client.solrj.impl.LBHttpSolrClient.request(LBHttpSolrClient.java:393)
at org.apache.solr.client.solrj.impl.CloudSolrClient.lambda$directUpdate$0(CloudSolrClient.java:735)
at java.util.concurrent.FutureTask.run(java.base@9-ea/FutureTask.java:264)
at org.apache.solr.common.util.ExecutorUtil$MDCAwareThreadPoolExecutor.lambda$execute$0(ExecutorUtil.java:229)
at java.util.concurrent.ThreadPoolExecutor.runWorker(java.base@9-ea/ThreadPoolExecutor.java:1158)
at java.util.concurrent.ThreadPoolExecutor$Worker.run(java.base@9-ea/ThreadPoolExecutor.java:632)
... 1 more
Caused by: org.apache.solr.client.solrj.SolrServerException: Server refused connection at: http://127.0.0.1:43713/forceleader_test_collection_shard1_replica3
at org.apache.solr.client.solrj.impl.HttpSolrClient.executeMethod(HttpSolrClient.java:615)
at org.apache.solr.client.solrj.impl.HttpSolrClient.request(HttpSolrClient.java:261)
at org.apache.solr.client.solrj.impl.HttpSolrClient.request(HttpSolrClient.java:250)
at org.apache.solr.client.solrj.impl.LBHttpSolrClient.doRequest(LBHttpSolrClient.java:413)
at org.apache.solr.client.solrj.impl.LBHttpSolrClient.request(LBHttpSolrClient.java:382)
... 6 more
Caused by: org.apache.http.conn.HttpHostConnectException: Connect to 127.0.0.1:43713 [/127.0.0.1] failed: Connection refused
at org.apache.http.impl.conn.DefaultHttpClientConnectionOperator.connect(DefaultHttpClientConnectionOperator.java:151)
at org.apache.http.impl.conn.PoolingHttpClientConnectionManager.connect(PoolingHttpClientConnectionManager.java:353)
at org.apache.http.impl.execchain.MainClientExec.establishRoute(MainClientExec.java:380)
at org.apache.http.impl.execchain.MainClientExec.execute(MainClientExec.java:236)
at org.apache.http.impl.execchain.ProtocolExec.execute(ProtocolExec.java:184)
at org.apache.http.impl.execchain.RetryExec.execute(RetryExec.java:88)
at org.apache.http.impl.execchain.RedirectExec.execute(RedirectExec.java:110)
at org.apache.http.impl.client.InternalHttpClient.doExecute(InternalHttpClient.java:184)
at org.apache.http.impl.client.CloseableHttpClient.execute(CloseableHttpClient.java:82)
at org.apache.http.impl.client.CloseableHttpClient.execute(CloseableHttpClient.java:55)
at org.apache.solr.client.solrj.impl.HttpSolrClient.executeMethod(HttpSolrClient.java:513)
... 10 more
Caused by: java.net.ConnectException: Connection refused
at java.net.PlainSocketImpl.socketConnect(java.base@9-ea/Native Method)
at java.net.AbstractPlainSocketImpl.doConnect(java.base@9-ea/AbstractPlainSocketImpl.java:400)
at java.net.AbstractPlainSocketImpl.connectToAddress(java.base@9-ea/AbstractPlainSocketImpl.java:243)
at java.net.AbstractPlainSocketImpl.connect(java.base@9-ea/AbstractPlainSocketImpl.java:225)
at java.net.SocksSocketImpl.connect(java.base@9-ea/SocksSocketImpl.java:402)
at java.net.Socket.connect(java.base@9-ea/Socket.java:591)
at org.apache.http.conn.socket.PlainConnectionSocketFactory.connectSocket(PlainConnectionSocketFactory.java:74)
at org.apache.http.impl.conn.DefaultHttpClientConnectionOperator.connect(DefaultHttpClientConnectionOperator.java:134)
... 20 more
Build Log:
[...truncated 11116 lines...]
[junit4] Suite: org.apache.solr.cloud.ForceLeaderTest
[junit4] 2> Creating dataDir: /home/jenkins/workspace/Lucene-Solr-master-Linux/solr/build/solr-core/test/J0/temp/solr.cloud.ForceLeaderTest_5F181DCCB6CE386B-001/init-core-data-001
[junit4] 2> 570166 INFO (SUITE-ForceLeaderTest-seed#[5F181DCCB6CE386B]-worker) [ ] o.a.s.SolrTestCaseJ4 Randomized ssl (false) and clientAuth (false) via: @org.apache.solr.SolrTestCaseJ4$SuppressSSL(bugUrl=https://issues.apache.org/jira/browse/SOLR-5776)
[junit4] 2> 570166 INFO (SUITE-ForceLeaderTest-seed#[5F181DCCB6CE386B]-worker) [ ] o.a.s.BaseDistributedSearchTestCase Setting hostContext system property: /
[junit4] 2> 570167 INFO (TEST-ForceLeaderTest.testLastPublishedStateIsActive-seed#[5F181DCCB6CE386B]) [ ] o.a.s.c.ZkTestServer STARTING ZK TEST SERVER
[junit4] 2> 570168 INFO (Thread-1442) [ ] o.a.s.c.ZkTestServer client port:0.0.0.0/0.0.0.0:0
[junit4] 2> 570168 INFO (Thread-1442) [ ] o.a.s.c.ZkTestServer Starting server
[junit4] 2> 570268 INFO (TEST-ForceLeaderTest.testLastPublishedStateIsActive-seed#[5F181DCCB6CE386B]) [ ] o.a.s.c.ZkTestServer start zk server on port:38810
[junit4] 2> 570268 INFO (TEST-ForceLeaderTest.testLastPublishedStateIsActive-seed#[5F181DCCB6CE386B]) [ ] o.a.s.c.c.SolrZkClient Using default ZkCredentialsProvider
[junit4] 2> 570269 INFO (TEST-ForceLeaderTest.testLastPublishedStateIsActive-seed#[5F181DCCB6CE386B]) [ ] o.a.s.c.c.ConnectionManager Waiting for client to connect to ZooKeeper
[junit4] 2> 570270 INFO (zkCallback-1285-thread-1) [ ] o.a.s.c.c.ConnectionManager Watcher org.apache.solr.common.cloud.ConnectionManager@3d4ab2a8 name:ZooKeeperConnection Watcher:127.0.0.1:38810 got event WatchedEvent state:SyncConnected type:None path:null path:null type:None
[junit4] 2> 570270 INFO (TEST-ForceLeaderTest.testLastPublishedStateIsActive-seed#[5F181DCCB6CE386B]) [ ] o.a.s.c.c.ConnectionManager Client is connected to ZooKeeper
[junit4] 2> 570270 INFO (TEST-ForceLeaderTest.testLastPublishedStateIsActive-seed#[5F181DCCB6CE386B]) [ ] o.a.s.c.c.SolrZkClient Using default ZkACLProvider
[junit4] 2> 570270 INFO (TEST-ForceLeaderTest.testLastPublishedStateIsActive-seed#[5F181DCCB6CE386B]) [ ] o.a.s.c.c.SolrZkClient makePath: /solr
[junit4] 2> 570271 INFO (TEST-ForceLeaderTest.testLastPublishedStateIsActive-seed#[5F181DCCB6CE386B]) [ ] o.a.s.c.c.SolrZkClient Using default ZkCredentialsProvider
[junit4] 2> 570271 INFO (TEST-ForceLeaderTest.testLastPublishedStateIsActive-seed#[5F181DCCB6CE386B]) [ ] o.a.s.c.c.ConnectionManager Waiting for client to connect to ZooKeeper
[junit4] 2> 570272 INFO (zkCallback-1286-thread-1) [ ] o.a.s.c.c.ConnectionManager Watcher org.apache.solr.common.cloud.ConnectionManager@282364bd name:ZooKeeperConnection Watcher:127.0.0.1:38810/solr got event WatchedEvent state:SyncConnected type:None path:null path:null type:None
[junit4] 2> 570272 INFO (TEST-ForceLeaderTest.testLastPublishedStateIsActive-seed#[5F181DCCB6CE386B]) [ ] o.a.s.c.c.ConnectionManager Client is connected to ZooKeeper
[junit4] 2> 570272 INFO (TEST-ForceLeaderTest.testLastPublishedStateIsActive-seed#[5F181DCCB6CE386B]) [ ] o.a.s.c.c.SolrZkClient Using default ZkACLProvider
[junit4] 2> 570272 INFO (TEST-ForceLeaderTest.testLastPublishedStateIsActive-seed#[5F181DCCB6CE386B]) [ ] o.a.s.c.c.SolrZkClient makePath: /collections/collection1
[junit4] 2> 570273 INFO (TEST-ForceLeaderTest.testLastPublishedStateIsActive-seed#[5F181DCCB6CE386B]) [ ] o.a.s.c.c.SolrZkClient makePath: /collections/collection1/shards
[junit4] 2> 570273 INFO (TEST-ForceLeaderTest.testLastPublishedStateIsActive-seed#[5F181DCCB6CE386B]) [ ] o.a.s.c.c.SolrZkClient makePath: /collections/control_collection
[junit4] 2> 570274 INFO (TEST-ForceLeaderTest.testLastPublishedStateIsActive-seed#[5F181DCCB6CE386B]) [ ] o.a.s.c.c.SolrZkClient makePath: /collections/control_collection/shards
[junit4] 2> 570274 INFO (TEST-ForceLeaderTest.testLastPublishedStateIsActive-seed#[5F181DCCB6CE386B]) [ ] o.a.s.c.AbstractZkTestCase put /home/jenkins/workspace/Lucene-Solr-master-Linux/solr/core/src/test-files/solr/collection1/conf/solrconfig-tlog.xml to /configs/conf1/solrconfig.xml
[junit4] 2> 570274 INFO (TEST-ForceLeaderTest.testLastPublishedStateIsActive-seed#[5F181DCCB6CE386B]) [ ] o.a.s.c.c.SolrZkClient makePath: /configs/conf1/solrconfig.xml
[junit4] 2> 570275 INFO (TEST-ForceLeaderTest.testLastPublishedStateIsActive-seed#[5F181DCCB6CE386B]) [ ] o.a.s.c.AbstractZkTestCase put /home/jenkins/workspace/Lucene-Solr-master-Linux/solr/core/src/test-files/solr/collection1/conf/schema.xml to /configs/conf1/schema.xml
[junit4] 2> 570275 INFO (TEST-ForceLeaderTest.testLastPublishedStateIsActive-seed#[5F181DCCB6CE386B]) [ ] o.a.s.c.c.SolrZkClient makePath: /configs/conf1/schema.xml
[junit4] 2> 570275 INFO (TEST-ForceLeaderTest.testLastPublishedStateIsActive-seed#[5F181DCCB6CE386B]) [ ] o.a.s.c.AbstractZkTestCase put /home/jenkins/workspace/Lucene-Solr-master-Linux/solr/core/src/test-files/solr/collection1/conf/solrconfig.snippet.randomindexconfig.xml to /configs/conf1/solrconfig.snippet.randomindexconfig.xml
[junit4] 2> 570276 INFO (TEST-ForceLeaderTest.testLastPublishedStateIsActive-seed#[5F181DCCB6CE386B]) [ ] o.a.s.c.c.SolrZkClient makePath: /configs/conf1/solrconfig.snippet.randomindexconfig.xml
[junit4] 2> 570276 INFO (TEST-ForceLeaderTest.testLastPublishedStateIsActive-seed#[5F181DCCB6CE386B]) [ ] o.a.s.c.AbstractZkTestCase put /home/jenkins/workspace/Lucene-Solr-master-Linux/solr/core/src/test-files/solr/collection1/conf/stopwords.txt to /configs/conf1/stopwords.txt
[junit4] 2> 570276 INFO (TEST-ForceLeaderTest.testLastPublishedStateIsActive-seed#[5F181DCCB6CE386B]) [ ] o.a.s.c.c.SolrZkClient makePath: /configs/conf1/stopwords.txt
[junit4] 2> 570277 INFO (TEST-ForceLeaderTest.testLastPublishedStateIsActive-seed#[5F181DCCB6CE386B]) [ ] o.a.s.c.AbstractZkTestCase put /home/jenkins/workspace/Lucene-Solr-master-Linux/solr/core/src/test-files/solr/collection1/conf/protwords.txt to /configs/conf1/protwords.txt
[junit4] 2> 570277 INFO (TEST-ForceLeaderTest.testLastPublishedStateIsActive-seed#[5F181DCCB6CE386B]) [ ] o.a.s.c.c.SolrZkClient makePath: /configs/conf1/protwords.txt
[junit4] 2> 570277 INFO (TEST-ForceLeaderTest.testLastPublishedStateIsActive-seed#[5F181DCCB6CE386B]) [ ] o.a.s.c.AbstractZkTestCase put /home/jenkins/workspace/Lucene-Solr-master-Linux/solr/core/src/test-files/solr/collection1/conf/currency.xml to /configs/conf1/currency.xml
[junit4] 2> 570277 INFO (TEST-ForceLeaderTest.testLastPublishedStateIsActive-seed#[5F181DCCB6CE386B]) [ ] o.a.s.c.c.SolrZkClient makePath: /configs/conf1/currency.xml
[junit4] 2> 570278 INFO (TEST-ForceLeaderTest.testLastPublishedStateIsActive-seed#[5F181DCCB6CE386B]) [ ] o.a.s.c.AbstractZkTestCase put /home/jenkins/workspace/Lucene-Solr-master-Linux/solr/core/src/test-files/solr/collection1/conf/enumsConfig.xml to /configs/conf1/enumsConfig.xml
[junit4] 2> 570278 INFO (TEST-ForceLeaderTest.testLastPublishedStateIsActive-seed#[5F181DCCB6CE386B]) [ ] o.a.s.c.c.SolrZkClient makePath: /configs/conf1/enumsConfig.xml
[junit4] 2> 570278 INFO (TEST-ForceLeaderTest.testLastPublishedStateIsActive-seed#[5F181DCCB6CE386B]) [ ] o.a.s.c.AbstractZkTestCase put /home/jenkins/workspace/Lucene-Solr-master-Linux/solr/core/src/test-files/solr/collection1/conf/open-exchange-rates.json to /configs/conf1/open-exchange-rates.json
[junit4] 2> 570278 INFO (TEST-ForceLeaderTest.testLastPublishedStateIsActive-seed#[5F181DCCB6CE386B]) [ ] o.a.s.c.c.SolrZkClient makePath: /configs/conf1/open-exchange-rates.json
[junit4] 2> 570279 INFO (TEST-ForceLeaderTest.testLastPublishedStateIsActive-seed#[5F181DCCB6CE386B]) [ ] o.a.s.c.AbstractZkTestCase put /home/jenkins/workspace/Lucene-Solr-master-Linux/solr/core/src/test-files/solr/collection1/conf/mapping-ISOLatin1Accent.txt to /configs/conf1/mapping-ISOLatin1Accent.txt
[junit4] 2> 570279 INFO (TEST-ForceLeaderTest.testLastPublishedStateIsActive-seed#[5F181DCCB6CE386B]) [ ] o.a.s.c.c.SolrZkClient makePath: /configs/conf1/mapping-ISOLatin1Accent.txt
[junit4] 2> 570279 INFO (TEST-ForceLeaderTest.testLastPublishedStateIsActive-seed#[5F181DCCB6CE386B]) [ ] o.a.s.c.AbstractZkTestCase put /home/jenkins/workspace/Lucene-Solr-master-Linux/solr/core/src/test-files/solr/collection1/conf/old_synonyms.txt to /configs/conf1/old_synonyms.txt
[junit4] 2> 570279 INFO (TEST-ForceLeaderTest.testLastPublishedStateIsActive-seed#[5F181DCCB6CE386B]) [ ] o.a.s.c.c.SolrZkClient makePath: /configs/conf1/old_synonyms.txt
[junit4] 2> 570281 INFO (TEST-ForceLeaderTest.testLastPublishedStateIsActive-seed#[5F181DCCB6CE386B]) [ ] o.a.s.c.AbstractZkTestCase put /home/jenkins/workspace/Lucene-Solr-master-Linux/solr/core/src/test-files/solr/collection1/conf/synonyms.txt to /configs/conf1/synonyms.txt
[junit4] 2> 570281 INFO (TEST-ForceLeaderTest.testLastPublishedStateIsActive-seed#[5F181DCCB6CE386B]) [ ] o.a.s.c.c.SolrZkClient makePath: /configs/conf1/synonyms.txt
[junit4] 2> 570337 INFO (TEST-ForceLeaderTest.testLastPublishedStateIsActive-seed#[5F181DCCB6CE386B]) [ ] o.a.s.SolrTestCaseJ4 Writing core.properties file to /home/jenkins/workspace/Lucene-Solr-master-Linux/solr/build/solr-core/test/J0/temp/solr.cloud.ForceLeaderTest_5F181DCCB6CE386B-001/control-001/cores/collection1
[junit4] 2> 570339 INFO (TEST-ForceLeaderTest.testLastPublishedStateIsActive-seed#[5F181DCCB6CE386B]) [ ] o.e.j.s.Server jetty-9.3.8.v20160314
[junit4] 2> 570340 INFO (TEST-ForceLeaderTest.testLastPublishedStateIsActive-seed#[5F181DCCB6CE386B]) [ ] o.e.j.s.h.ContextHandler Started o.e.j.s.ServletContextHandler@1fae2833{/,null,AVAILABLE}
[junit4] 2> 570342 INFO (TEST-ForceLeaderTest.testLastPublishedStateIsActive-seed#[5F181DCCB6CE386B]) [ ] o.e.j.s.ServerConnector Started ServerConnector@5d7c63fb{HTTP/1.1,[http/1.1]}{127.0.0.1:36692}
[junit4] 2> 570342 INFO (TEST-ForceLeaderTest.testLastPublishedStateIsActive-seed#[5F181DCCB6CE386B]) [ ] o.e.j.s.Server Started @572425ms
[junit4] 2> 570342 INFO (TEST-ForceLeaderTest.testLastPublishedStateIsActive-seed#[5F181DCCB6CE386B]) [ ] o.a.s.c.s.e.JettySolrRunner Jetty properties: {hostContext=/, solr.data.dir=/home/jenkins/workspace/Lucene-Solr-master-Linux/solr/build/solr-core/test/J0/temp/solr.cloud.ForceLeaderTest_5F181DCCB6CE386B-001/tempDir-001/control/data, hostPort=40332, coreRootDirectory=/home/jenkins/workspace/Lucene-Solr-master-Linux/solr/build/solr-core/test/J0/temp/solr.cloud.ForceLeaderTest_5F181DCCB6CE386B-001/control-001/cores}
[junit4] 2> 570342 INFO (TEST-ForceLeaderTest.testLastPublishedStateIsActive-seed#[5F181DCCB6CE386B]) [ ] o.a.s.s.SolrDispatchFilter SolrDispatchFilter.init(): jdk.internal.loader.ClassLoaders$AppClassLoader@3ab39c39
[junit4] 2> 570342 INFO (TEST-ForceLeaderTest.testLastPublishedStateIsActive-seed#[5F181DCCB6CE386B]) [ ] o.a.s.c.SolrResourceLoader new SolrResourceLoader for directory: '/home/jenkins/workspace/Lucene-Solr-master-Linux/solr/build/solr-core/test/J0/temp/solr.cloud.ForceLeaderTest_5F181DCCB6CE386B-001/control-001'
[junit4] 2> 570342 INFO (TEST-ForceLeaderTest.testLastPublishedStateIsActive-seed#[5F181DCCB6CE386B]) [ ] o.a.s.c.SolrResourceLoader JNDI not configured for solr (NoInitialContextEx)
[junit4] 2> 570342 INFO (TEST-ForceLeaderTest.testLastPublishedStateIsActive-seed#[5F181DCCB6CE386B]) [ ] o.a.s.c.SolrResourceLoader solr home defaulted to 'solr/' (could not find system property or JNDI)
[junit4] 2> 570342 INFO (TEST-ForceLeaderTest.testLastPublishedStateIsActive-seed#[5F181DCCB6CE386B]) [ ] o.a.s.c.c.SolrZkClient Using default ZkCredentialsProvider
[junit4] 2> 570344 INFO (TEST-ForceLeaderTest.testLastPublishedStateIsActive-seed#[5F181DCCB6CE386B]) [ ] o.a.s.c.c.ConnectionManager Waiting for client to connect to ZooKeeper
[junit4] 2> 570345 INFO (zkCallback-1287-thread-1) [ ] o.a.s.c.c.ConnectionManager Watcher org.apache.solr.common.cloud.ConnectionManager@5c745fe3 name:ZooKeeperConnection Watcher:127.0.0.1:38810/solr got event WatchedEvent state:SyncConnected type:None path:null path:null type:None
[junit4] 2> 570345 INFO (TEST-ForceLeaderTest.testLastPublishedStateIsActive-seed#[5F181DCCB6CE386B]) [ ] o.a.s.c.c.ConnectionManager Client is connected to ZooKeeper
[junit4] 2> 570345 INFO (TEST-ForceLeaderTest.testLastPublishedStateIsActive-seed#[5F181DCCB6CE386B]) [ ] o.a.s.c.c.SolrZkClient Using default ZkACLProvider
[junit4] 2> 570345 INFO (TEST-ForceLeaderTest.testLastPublishedStateIsActive-seed#[5F181DCCB6CE386B]) [ ] o.a.s.s.SolrDispatchFilter Loading solr.xml from SolrHome (not found in ZooKeeper)
[junit4] 2> 570345 INFO (TEST-ForceLeaderTest.testLastPublishedStateIsActive-seed#[5F181DCCB6CE386B]) [ ] o.a.s.c.SolrXmlConfig Loading container configuration from /home/jenkins/workspace/Lucene-Solr-master-Linux/solr/build/solr-core/test/J0/temp/solr.cloud.ForceLeaderTest_5F181DCCB6CE386B-001/control-001/solr.xml
[junit4] 2> 570349 INFO (TEST-ForceLeaderTest.testLastPublishedStateIsActive-seed#[5F181DCCB6CE386B]) [ ] o.a.s.c.CorePropertiesLocator Config-defined core root directory: /home/jenkins/workspace/Lucene-Solr-master-Linux/solr/build/solr-core/test/J0/temp/solr.cloud.ForceLeaderTest_5F181DCCB6CE386B-001/control-001/cores
[junit4] 2> 570349 INFO (TEST-ForceLeaderTest.testLastPublishedStateIsActive-seed#[5F181DCCB6CE386B]) [ ] o.a.s.c.CoreContainer New CoreContainer 728572018
[junit4] 2> 570349 INFO (TEST-ForceLeaderTest.testLastPublishedStateIsActive-seed#[5F181DCCB6CE386B]) [ ] o.a.s.c.CoreContainer Loading cores into CoreContainer [instanceDir=/home/jenkins/workspace/Lucene-Solr-master-Linux/solr/build/solr-core/test/J0/temp/solr.cloud.ForceLeaderTest_5F181DCCB6CE386B-001/control-001]
[junit4] 2> 570349 WARN (TEST-ForceLeaderTest.testLastPublishedStateIsActive-seed#[5F181DCCB6CE386B]) [ ] o.a.s.c.CoreContainer Couldn't add files from /home/jenkins/workspace/Lucene-Solr-master-Linux/solr/build/solr-core/test/J0/temp/solr.cloud.ForceLeaderTest_5F181DCCB6CE386B-001/control-001/lib to classpath: /home/jenkins/workspace/Lucene-Solr-master-Linux/solr/build/solr-core/test/J0/temp/solr.cloud.ForceLeaderTest_5F181DCCB6CE386B-001/control-001/lib
[junit4] 2> 570349 INFO (TEST-ForceLeaderTest.testLastPublishedStateIsActive-seed#[5F181DCCB6CE386B]) [ ] o.a.s.h.c.HttpShardHandlerFactory created with socketTimeout : 90000,urlScheme : ,connTimeout : 15000,maxConnectionsPerHost : 20,maxConnections : 10000,corePoolSize : 0,maximumPoolSize : 2147483647,maxThreadIdleTime : 5,sizeOfQueue : -1,fairnessPolicy : false,
[junit4] 2> 570351 INFO (TEST-ForceLeaderTest.testLastPublishedStateIsActive-seed#[5F181DCCB6CE386B]) [ ] o.a.s.u.UpdateShardHandler Created UpdateShardHandler HTTP client with params: socketTimeout=340000&connTimeout=45000&maxConnections=100000&maxConnectionsPerHost=100000
[junit4] 2> 570351 INFO (TEST-ForceLeaderTest.testLastPublishedStateIsActive-seed#[5F181DCCB6CE386B]) [ ] o.a.s.l.LogWatcher SLF4J impl is org.slf4j.impl.Log4jLoggerFactory
[junit4] 2> 570351 INFO (TEST-ForceLeaderTest.testLastPublishedStateIsActive-seed#[5F181DCCB6CE386B]) [ ] o.a.s.l.LogWatcher Registering Log Listener [Log4j (org.slf4j.impl.Log4jLoggerFactory)]
[junit4] 2> 570351 INFO (TEST-ForceLeaderTest.testLastPublishedStateIsActive-seed#[5F181DCCB6CE386B]) [ ] o.a.s.c.ZkContainer Zookeeper client=127.0.0.1:38810/solr
[junit4] 2> 570351 INFO (TEST-ForceLeaderTest.testLastPublishedStateIsActive-seed#[5F181DCCB6CE386B]) [ ] o.a.s.c.ZkController zkHost includes chroot
[junit4] 2> 570351 INFO (TEST-ForceLeaderTest.testLastPublishedStateIsActive-seed#[5F181DCCB6CE386B]) [ ] o.a.s.c.c.SolrZkClient Using default ZkCredentialsProvider
[junit4] 2> 570351 INFO (TEST-ForceLeaderTest.testLastPublishedStateIsActive-seed#[5F181DCCB6CE386B]) [ ] o.a.s.c.c.ConnectionManager Waiting for client to connect to ZooKeeper
[junit4] 2> 570353 INFO (zkCallback-1290-thread-1) [ ] o.a.s.c.c.ConnectionManager Watcher org.apache.solr.common.cloud.ConnectionManager@2b97f6f7 name:ZooKeeperConnection Watcher:127.0.0.1:38810 got event WatchedEvent state:SyncConnected type:None path:null path:null type:None
[junit4] 2> 570353 INFO (TEST-ForceLeaderTest.testLastPublishedStateIsActive-seed#[5F181DCCB6CE386B]) [ ] o.a.s.c.c.ConnectionManager Client is connected to ZooKeeper
[junit4] 2> 570353 INFO (TEST-ForceLeaderTest.testLastPublishedStateIsActive-seed#[5F181DCCB6CE386B]) [ ] o.a.s.c.c.SolrZkClient Using default ZkACLProvider
[junit4] 2> 570353 INFO (TEST-ForceLeaderTest.testLastPublishedStateIsActive-seed#[5F181DCCB6CE386B]) [ ] o.a.s.c.ZkController Added new OnReconnect listener org.apache.solr.cloud.ZkController$$Lambda$206/771651206@1b9ba444
[junit4] 2> 570354 INFO (TEST-ForceLeaderTest.testLastPublishedStateIsActive-seed#[5F181DCCB6CE386B]) [ ] o.a.s.c.c.ConnectionManager Waiting for client to connect to ZooKeeper
[junit4] 2> 570354 INFO (zkCallback-1291-thread-1) [ ] o.a.s.c.c.ConnectionManager Watcher org.apache.solr.common.cloud.ConnectionManager@3cd2b5f3 name:ZooKeeperConnection Watcher:127.0.0.1:38810/solr got event WatchedEvent state:SyncConnected type:None path:null path:null type:None
[junit4] 2> 570354 INFO (TEST-ForceLeaderTest.testLastPublishedStateIsActive-seed#[5F181DCCB6CE386B]) [ ] o.a.s.c.c.ConnectionManager Client is connected to ZooKeeper
[junit4] 2> 570355 INFO (TEST-ForceLeaderTest.testLastPublishedStateIsActive-seed#[5F181DCCB6CE386B]) [ ] o.a.s.c.c.SolrZkClient makePath: /overseer/queue
[junit4] 2> 570355 INFO (TEST-ForceLeaderTest.testLastPublishedStateIsActive-seed#[5F181DCCB6CE386B]) [ ] o.a.s.c.c.SolrZkClient makePath: /overseer/collection-queue-work
[junit4] 2> 570356 INFO (TEST-ForceLeaderTest.testLastPublishedStateIsActive-seed#[5F181DCCB6CE386B]) [ ] o.a.s.c.c.SolrZkClient makePath: /overseer/collection-map-running
[junit4] 2> 570357 INFO (TEST-ForceLeaderTest.testLastPublishedStateIsActive-seed#[5F181DCCB6CE386B]) [ ] o.a.s.c.c.SolrZkClient makePath: /overseer/collection-map-completed
[junit4] 2> 570357 INFO (TEST-ForceLeaderTest.testLastPublishedStateIsActive-seed#[5F181DCCB6CE386B]) [ ] o.a.s.c.c.SolrZkClient makePath: /overseer/collection-map-failure
[junit4] 2> 570358 INFO (TEST-ForceLeaderTest.testLastPublishedStateIsActive-seed#[5F181DCCB6CE386B]) [ ] o.a.s.c.c.SolrZkClient makePath: /live_nodes
[junit4] 2> 570358 INFO (TEST-ForceLeaderTest.testLastPublishedStateIsActive-seed#[5F181DCCB6CE386B]) [ ] o.a.s.c.c.SolrZkClient makePath: /aliases.json
[junit4] 2> 570359 INFO (TEST-ForceLeaderTest.testLastPublishedStateIsActive-seed#[5F181DCCB6CE386B]) [ ] o.a.s.c.c.SolrZkClient makePath: /clusterstate.json
[junit4] 2> 570359 INFO (TEST-ForceLeaderTest.testLastPublishedStateIsActive-seed#[5F181DCCB6CE386B]) [ ] o.a.s.c.c.SolrZkClient makePath: /security.json
[junit4] 2> 570359 INFO (TEST-ForceLeaderTest.testLastPublishedStateIsActive-seed#[5F181DCCB6CE386B]) [ ] o.a.s.c.c.ZkStateReader Updating cluster state from ZooKeeper...
[junit4] 2> 570359 INFO (TEST-ForceLeaderTest.testLastPublishedStateIsActive-seed#[5F181DCCB6CE386B]) [ ] o.a.s.c.c.ZkStateReader Loaded empty cluster properties
[junit4] 2> 570360 INFO (TEST-ForceLeaderTest.testLastPublishedStateIsActive-seed#[5F181DCCB6CE386B]) [ ] o.a.s.c.c.ZkStateReader Updated live nodes from ZooKeeper... (0) -> (0)
[junit4] 2> 570360 INFO (TEST-ForceLeaderTest.testLastPublishedStateIsActive-seed#[5F181DCCB6CE386B]) [ ] o.a.s.c.c.SolrZkClient makePath: /overseer_elect
[junit4] 2> 570361 INFO (TEST-ForceLeaderTest.testLastPublishedStateIsActive-seed#[5F181DCCB6CE386B]) [ ] o.a.s.c.c.SolrZkClient makePath: /overseer_elect/election
[junit4] 2> 570361 INFO (TEST-ForceLeaderTest.testLastPublishedStateIsActive-seed#[5F181DCCB6CE386B]) [ ] o.a.s.c.Overseer Overseer (id=null) closing
[junit4] 2> 570361 INFO (TEST-ForceLeaderTest.testLastPublishedStateIsActive-seed#[5F181DCCB6CE386B]) [ ] o.a.s.c.LeaderElector Joined leadership election with path: /overseer_elect/election/96375103634604036-127.0.0.1:40332_-n_0000000000
[junit4] 2> 570361 INFO (TEST-ForceLeaderTest.testLastPublishedStateIsActive-seed#[5F181DCCB6CE386B]) [ ] o.a.s.c.OverseerElectionContext I am going to be the leader 127.0.0.1:40332_
[junit4] 2> 570361 INFO (TEST-ForceLeaderTest.testLastPublishedStateIsActive-seed#[5F181DCCB6CE386B]) [ ] o.a.s.c.c.SolrZkClient makePath: /overseer_elect/leader
[junit4] 2> 570362 INFO (TEST-ForceLeaderTest.testLastPublishedStateIsActive-seed#[5F181DCCB6CE386B]) [ ] o.a.s.c.Overseer Overseer (id=96375103634604036-127.0.0.1:40332_-n_0000000000) starting
[junit4] 2> 570362 INFO (TEST-ForceLeaderTest.testLastPublishedStateIsActive-seed#[5F181DCCB6CE386B]) [ ] o.a.s.c.c.SolrZkClient makePath: /overseer/queue-work
[junit4] 2> 570365 INFO (TEST-ForceLeaderTest.testLastPublishedStateIsActive-seed#[5F181DCCB6CE386B]) [ ] o.a.s.c.OverseerAutoReplicaFailoverThread Starting OverseerAutoReplicaFailoverThread autoReplicaFailoverWorkLoopDelay=10000 autoReplicaFailoverWaitAfterExpiration=10000 autoReplicaFailoverBadNodeExpiration=60000
[junit4] 2> 570365 INFO (OverseerCollectionConfigSetProcessor-96375103634604036-127.0.0.1:40332_-n_0000000000) [ ] o.a.s.c.OverseerTaskProcessor Process current queue of overseer operations
[junit4] 2> 570365 INFO (TEST-ForceLeaderTest.testLastPublishedStateIsActive-seed#[5F181DCCB6CE386B]) [ ] o.a.s.c.ZkController Register node as live in ZooKeeper:/live_nodes/127.0.0.1:40332_
[junit4] 2> 570365 INFO (TEST-ForceLeaderTest.testLastPublishedStateIsActive-seed#[5F181DCCB6CE386B]) [ ] o.a.s.c.c.SolrZkClient makePath: /live_nodes/127.0.0.1:40332_
[junit4] 2> 570365 INFO (OverseerStateUpdate-96375103634604036-127.0.0.1:40332_-n_0000000000) [ ] o.a.s.c.Overseer Starting to work on the main queue
[junit4] 2> 570366 INFO (zkCallback-1291-thread-1) [ ] o.a.s.c.c.ZkStateReader A live node change: [WatchedEvent state:SyncConnected type:NodeChildrenChanged path:/live_nodes], has occurred - updating... (live nodes size: [0])
[junit4] 2> 570366 INFO (OverseerStateUpdate-96375103634604036-127.0.0.1:40332_-n_0000000000) [ ] o.a.s.c.c.ZkStateReader Updated live nodes from ZooKeeper... (0) -> (1)
[junit4] 2> 570366 INFO (zkCallback-1291-thread-1) [ ] o.a.s.c.c.ZkStateReader Updated live nodes from ZooKeeper... (1) -> (1)
[junit4] 2> 570371 INFO (TEST-ForceLeaderTest.testLastPublishedStateIsActive-seed#[5F181DCCB6CE386B]) [ ] o.a.s.c.CoreContainer Security conf doesn't exist. Skipping setup for authorization module.
[junit4] 2> 570371 INFO (TEST-ForceLeaderTest.testLastPublishedStateIsActive-seed#[5F181DCCB6CE386B]) [ ] o.a.s.c.CoreContainer No authentication plugin used.
[junit4] 2> 570371 INFO (TEST-ForceLeaderTest.testLastPublishedStateIsActive-seed#[5F181DCCB6CE386B]) [ ] o.a.s.c.CorePropertiesLocator Looking for core definitions underneath /home/jenkins/workspace/Lucene-Solr-master-Linux/solr/build/solr-core/test/J0/temp/solr.cloud.ForceLeaderTest_5F181DCCB6CE386B-001/control-001/cores
[junit4] 2> 570372 INFO (TEST-ForceLeaderTest.testLastPublishedStateIsActive-seed#[5F181DCCB6CE386B]) [ ] o.a.s.c.CoreDescriptor Created CoreDescriptor: {schema=schema.xml, dataDir=data/, collection=control_collection, loadOnStartup=true, coreNodeName=, transient=false, name=collection1, shard=, config=solrconfig.xml, configSetProperties=configsetprops.json}
[junit4] 2> 570372 INFO (TEST-ForceLeaderTest.testLastPublishedStateIsActive-seed#[5F181DCCB6CE386B]) [ ] o.a.s.c.CorePropertiesLocator Found core collection1 in /home/jenkins/workspace/Lucene-Solr-master-Linux/solr/build/solr-core/test/J0/temp/solr.cloud.ForceLeaderTest_5F181DCCB6CE386B-001/control-001/cores/collection1
[junit4] 2> 570372 INFO (TEST-ForceLeaderTest.testLastPublishedStateIsActive-seed#[5F181DCCB6CE386B]) [ ] o.a.s.c.CorePropertiesLocator Found 1 core definitions
[junit4] 2> 570372 INFO (coreLoadExecutor-3212-thread-1) [ ] o.a.s.c.ZkController publishing state=down
[junit4] 2> 570372 INFO (TEST-ForceLeaderTest.testLastPublishedStateIsActive-seed#[5F181DCCB6CE386B]) [ ] o.a.s.s.SolrDispatchFilter user.dir=/home/jenkins/workspace/Lucene-Solr-master-Linux/solr/build/solr-core/test/J0
[junit4] 2> 570372 INFO (coreLoadExecutor-3212-thread-1) [ ] o.a.s.c.ZkController numShards not found on descriptor - reading it from system property
[junit4] 2> 570372 INFO (TEST-ForceLeaderTest.testLastPublishedStateIsActive-seed#[5F181DCCB6CE386B]) [ ] o.a.s.s.SolrDispatchFilter SolrDispatchFilter.init() done
[junit4] 2> 570373 INFO (coreLoadExecutor-3212-thread-1) [ ] o.a.s.c.ZkController Collection control_collection not visible yet, but flagging it so a watch is registered when it becomes visible
[junit4] 2> 570373 INFO (OverseerStateUpdate-96375103634604036-127.0.0.1:40332_-n_0000000000) [ ] o.a.s.c.Overseer processMessage: queueSize: 1, message = {
[junit4] 2> "core":"collection1",
[junit4] 2> "roles":null,
[junit4] 2> "base_url":"http://127.0.0.1:40332",
[junit4] 2> "node_name":"127.0.0.1:40332_",
[junit4] 2> "numShards":"1",
[junit4] 2> "state":"down",
[junit4] 2> "shard":null,
[junit4] 2> "collection":"control_collection",
[junit4] 2> "operation":"state"} current state version: 0
[junit4] 2> 570373 INFO (OverseerStateUpdate-96375103634604036-127.0.0.1:40332_-n_0000000000) [ ] o.a.s.c.o.ReplicaMutator Update state numShards=1 message={
[junit4] 2> "core":"collection1",
[junit4] 2> "roles":null,
[junit4] 2> "base_url":"http://127.0.0.1:40332",
[junit4] 2> "node_name":"127.0.0.1:40332_",
[junit4] 2> "numShards":"1",
[junit4] 2> "state":"down",
[junit4] 2> "shard":null,
[junit4] 2> "collection":"control_collection",
[junit4] 2> "operation":"state"}
[junit4] 2> 570373 INFO (coreLoadExecutor-3212-thread-1) [ ] o.a.s.c.c.ZkStateReader Deleting data for [control_collection]
[junit4] 2> 570373 INFO (OverseerStateUpdate-96375103634604036-127.0.0.1:40332_-n_0000000000) [ ] o.a.s.c.o.ClusterStateMutator building a new cName: control_collection
[junit4] 2> 570373 INFO (OverseerStateUpdate-96375103634604036-127.0.0.1:40332_-n_0000000000) [ ] o.a.s.c.o.ReplicaMutator Assigning new node to shard shard=shard1
[junit4] 2> 570373 INFO (coreLoadExecutor-3212-thread-1) [ ] o.a.s.c.ZkController look for our core node name
[junit4] 2> 570374 INFO (zkCallback-1291-thread-1) [ ] o.a.s.c.c.ZkStateReader A cluster state change: [WatchedEvent state:SyncConnected type:NodeDataChanged path:/clusterstate.json], has occurred - updating... (live nodes size: [1])
[junit4] 2> 571374 INFO (coreLoadExecutor-3212-thread-1) [ ] o.a.s.c.ZkController waiting to find shard id in clusterstate for collection1
[junit4] 2> 571374 INFO (coreLoadExecutor-3212-thread-1) [ ] o.a.s.c.ZkController Check for collection zkNode:control_collection
[junit4] 2> 571374 INFO (coreLoadExecutor-3212-thread-1) [ ] o.a.s.c.ZkController Collection zkNode exists
[junit4] 2> 571374 INFO (coreLoadExecutor-3212-thread-1) [ ] o.a.s.c.c.ZkStateReader Load collection config from: [/collections/control_collection]
[junit4] 2> 571374 INFO (coreLoadExecutor-3212-thread-1) [ ] o.a.s.c.c.ZkStateReader path=[/collections/control_collection] [configName]=[conf1] specified config exists in ZooKeeper
[junit4] 2> 571374 INFO (coreLoadExecutor-3212-thread-1) [ ] o.a.s.c.SolrResourceLoader new SolrResourceLoader for directory: '/home/jenkins/workspace/Lucene-Solr-master-Linux/solr/build/solr-core/test/J0/temp/solr.cloud.ForceLeaderTest_5F181DCCB6CE386B-001/control-001/cores/collection1'
[junit4] 2> 571374 INFO (coreLoadExecutor-3212-thread-1) [ ] o.a.s.c.SolrResourceLoader JNDI not configured for solr (NoInitialContextEx)
[junit4] 2> 571374 INFO (coreLoadExecutor-3212-thread-1) [ ] o.a.s.c.SolrResourceLoader solr home defaulted to 'solr/' (could not find system property or JNDI)
[junit4] 2> 571375 INFO (coreLoadExecutor-3212-thread-1) [ ] o.a.s.c.Config loaded config solrconfig.xml with version 0
[junit4] 2> 571377 INFO (coreLoadExecutor-3212-thread-1) [ ] o.a.s.c.SolrConfig current version of requestparams : -1
[junit4] 2> 571380 WARN (coreLoadExecutor-3212-thread-1) [ ] o.a.s.c.Config Beginning with Solr 5.5, <mergePolicy> is deprecated, use <mergePolicyFactory> instead.
[junit4] 2> 571380 INFO (coreLoadExecutor-3212-thread-1) [ ] o.a.s.c.SolrConfig Using Lucene MatchVersion: 7.0.0
[junit4] 2> 571386 INFO (coreLoadExecutor-3212-thread-1) [ ] o.a.s.c.SolrConfig Loaded SolrConfig: solrconfig.xml
[junit4] 2> 571389 INFO (coreLoadExecutor-3212-thread-1) [ ] o.a.s.s.IndexSchema [collection1] Schema name=test
[junit4] 2> 571443 INFO (coreLoadExecutor-3212-thread-1) [ ] o.a.s.s.OpenExchangeRatesOrgProvider Initialized with rates=open-exchange-rates.json, refreshInterval=1440.
[junit4] 2> 571447 INFO (coreLoadExecutor-3212-thread-1) [ ] o.a.s.s.IndexSchema default search field in schema is text
[junit4] 2> 571448 INFO (coreLoadExecutor-3212-thread-1) [ ] o.a.s.s.IndexSchema unique key field: id
[junit4] 2> 571451 INFO (coreLoadExecutor-3212-thread-1) [ ] o.a.s.s.FileExchangeRateProvider Reloading exchange rates from file currency.xml
[junit4] 2> 571452 INFO (coreLoadExecutor-3212-thread-1) [ ] o.a.s.s.FileExchangeRateProvider Reloading exchange rates from file currency.xml
[junit4] 2> 571470 INFO (coreLoadExecutor-3212-thread-1) [ ] o.a.s.s.OpenExchangeRatesOrgProvider Reloading exchange rates from open-exchange-rates.json
[junit4] 2> 571471 INFO (coreLoadExecutor-3212-thread-1) [ ] o.a.s.s.OpenExchangeRatesOrgProvider Reloading exchange rates from open-exchange-rates.json
[junit4] 2> 571472 INFO (coreLoadExecutor-3212-thread-1) [ ] o.a.s.c.ConfigSetProperties Did not find ConfigSet properties, assuming default properties: Can't find resource 'configsetprops.json' in classpath or '/configs/conf1', cwd=/home/jenkins/workspace/Lucene-Solr-master-Linux/solr/build/solr-core/test/J0
[junit4] 2> 571472 INFO (coreLoadExecutor-3212-thread-1) [ ] o.a.s.c.CoreContainer Creating SolrCore 'collection1' using configuration from collection control_collection
[junit4] 2> 571472 INFO (coreLoadExecutor-3212-thread-1) [ ] o.a.s.c.SolrCore org.apache.solr.core.MockDirectoryFactory
[junit4] 2> 571472 INFO (coreLoadExecutor-3212-thread-1) [ ] o.a.s.c.SolrCore [[collection1] ] Opening new SolrCore at [/home/jenkins/workspace/Lucene-Solr-master-Linux/solr/build/solr-core/test/J0/temp/solr.cloud.ForceLeaderTest_5F181DCCB6CE386B-001/control-001/cores/collection1], dataDir=[/home/jenkins/workspace/Lucene-Solr-master-Linux/solr/build/solr-core/test/J0/temp/solr.cloud.ForceLeaderTest_5F181DCCB6CE386B-001/control-001/cores/collection1/data/]
[junit4] 2> 571472 INFO (coreLoadExecutor-3212-thread-1) [ ] o.a.s.c.JmxMonitoredMap JMX monitoring is enabled. Adding Solr mbeans to JMX Server: com.sun.jmx.mbeanserver.JmxMBeanServer@276da511
[junit4] 2> 571472 INFO (coreLoadExecutor-3212-thread-1) [ ] o.a.s.c.CachingDirectoryFactory return new directory for /home/jenkins/workspace/Lucene-Solr-master-Linux/solr/build/solr-core/test/J0/temp/solr.cloud.ForceLeaderTest_5F181DCCB6CE386B-001/control-001/cores/collection1/data/snapshot_metadata
[junit4] 2> 571473 INFO (coreLoadExecutor-3212-thread-1) [ ] o.a.s.c.s.SolrSnapshotMetaDataManager Loading from snapshot metadata file...
[junit4] 2> 571473 INFO (coreLoadExecutor-3212-thread-1) [ ] o.a.s.c.CachingDirectoryFactory return new directory for /home/jenkins/workspace/Lucene-Solr-master-Linux/solr/build/solr-core/test/J0/temp/solr.cloud.ForceLeaderTest_5F181DCCB6CE386B-001/control-001/cores/collection1/data
[junit4] 2> 571473 INFO (coreLoadExecutor-3212-thread-1) [ ] o.a.s.c.SolrCore New index directory detected: old=null new=/home/jenkins/workspace/Lucene-Solr-master-Linux/solr/build/solr-core/test/J0/temp/solr.cloud.ForceLeaderTest_5F181DCCB6CE386B-001/control-001/cores/collection1/data/index/
[junit4] 2> 571473 WARN (coreLoadExecutor-3212-thread-1) [ ] o.a.s.c.SolrCore [collection1] Solr index directory '/home/jenkins/workspace/Lucene-Solr-master-Linux/solr/build/solr-core/test/J0/temp/solr.cloud.ForceLeaderTest_5F181DCCB6CE386B-001/control-001/cores/collection1/data/index' doesn't exist. Creating new index...
[junit4] 2> 571473 INFO (coreLoadExecutor-3212-thread-1) [ ] o.a.s.c.CachingDirectoryFactory return new directory for /home/jenkins/workspace/Lucene-Solr-master-Linux/solr/build/solr-core/test/J0/temp/solr.cloud.ForceLeaderTest_5F181DCCB6CE386B-001/control-001/cores/collection1/data/index
[junit4] 2> 571473 INFO (coreLoadExecutor-3212-thread-1) [ ] o.a.s.u.RandomMergePolicy RandomMergePolicy wrapping class org.apache.lucene.index.LogByteSizeMergePolicy: [LogByteSizeMergePolicy: minMergeSize=1677721, mergeFactor=27, maxMergeSize=2147483648, maxMergeSizeForForcedMerge=9223372036854775807, calibrateSizeByDeletes=false, maxMergeDocs=2147483647, maxCFSSegmentSizeMB=8.796093022207999E12, noCFSRatio=0.4746775395041497]
[junit4] 2> 571474 INFO (coreLoadExecutor-3212-thread-1) [ ] o.a.s.c.SolrDeletionPolicy SolrDeletionPolicy.onCommit: commits: num=1
[junit4] 2> commit{dir=MockDirectoryWrapper(RAMDirectory@73c0d705 lockFactory=org.apache.lucene.store.SingleInstanceLockFactory@492d8025),segFN=segments_1,generation=1}
[junit4] 2> 571474 INFO (coreLoadExecutor-3212-thread-1) [ ] o.a.s.c.SolrDeletionPolicy newest commit generation = 1
[junit4] 2> 571474 INFO (OldIndexDirectoryCleanupThreadForCore-collection1) [ ] o.a.s.c.SolrCore Looking for old index directories to cleanup for core collection1 in /home/jenkins/workspace/Lucene-Solr-master-Linux/solr/build/solr-core/test/J0/temp/solr.cloud.ForceLeaderTest_5F181DCCB6CE386B-001/control-001/cores/collection1/data/
[junit4] 2> 571474 WARN (OldIndexDirectoryCleanupThreadForCore-collection1) [ ] o.a.s.c.DirectoryFactory /home/jenkins/workspace/Lucene-Solr-master-Linux/solr/build/solr-core/test/J0/temp/solr.cloud.ForceLeaderTest_5F181DCCB6CE386B-001/control-001/cores/collection1/data/ does not point to a valid data directory; skipping clean-up of old index directories.
[junit4] 2> 571477 INFO (coreLoadExecutor-3212-thread-1) [ ] o.a.s.u.p.UpdateRequestProcessorChain creating updateRequestProcessorChain "nodistrib"
[junit4] 2> 571477 INFO (coreLoadExecutor-3212-thread-1) [ ] o.a.s.u.p.UpdateRequestProcessorChain creating updateRequestProcessorChain "dedupe"
[junit4] 2> 571477 INFO (coreLoadExecutor-3212-thread-1) [ ] o.a.s.u.p.UpdateRequestProcessorChain inserting DistributedUpdateProcessorFactory into updateRequestProcessorChain "dedupe"
[junit4] 2> 571477 INFO (coreLoadExecutor-3212-thread-1) [ ] o.a.s.u.p.UpdateRequestProcessorChain creating updateRequestProcessorChain "stored_sig"
[junit4] 2> 571477 INFO (coreLoadExecutor-3212-thread-1) [ ] o.a.s.u.p.UpdateRequestProcessorChain inserting DistributedUpdateProcessorFactory into updateRequestProcessorChain "stored_sig"
[junit4] 2> 571477 INFO (coreLoadExecutor-3212-thread-1) [ ] o.a.s.u.p.UpdateRequestProcessorChain creating updateRequestProcessorChain "distrib-dup-test-chain-explicit"
[junit4] 2> 571478 INFO (coreLoadExecutor-3212-thread-1) [ ] o.a.s.u.p.UpdateRequestProcessorChain creating updateRequestProcessorChain "distrib-dup-test-chain-implicit"
[junit4] 2> 571478 INFO (coreLoadExecutor-3212-thread-1) [ ] o.a.s.u.p.UpdateRequestProcessorChain inserting DistributedUpdateProcessorFactory into updateRequestProcessorChain "distrib-dup-test-chain-implicit"
[junit4] 2> 571478 INFO (coreLoadExecutor-3212-thread-1) [ ] o.a.s.c.SolrCore no updateRequestProcessorChain defined as default, creating implicit default
[junit4] 2> 571478 WARN (coreLoadExecutor-3212-thread-1) [ ] o.a.s.c.RequestHandlers INVALID paramSet a in requestHandler {type = requestHandler,name = /dump,class = DumpRequestHandler,args = {defaults={a=A,b=B}}}
[junit4] 2> 571480 INFO (coreLoadExecutor-3212-thread-1) [ ] o.a.s.h.l.XMLLoader xsltCacheLifetimeSeconds=60
[junit4] 2> 571481 INFO (coreLoadExecutor-3212-thread-1) [ ] o.a.s.h.l.XMLLoader xsltCacheLifetimeSeconds=60
[junit4] 2> 571482 INFO (coreLoadExecutor-3212-thread-1) [ ] o.a.s.h.l.XMLLoader xsltCacheLifetimeSeconds=60
[junit4] 2> 571482 INFO (coreLoadExecutor-3212-thread-1) [ ] o.a.s.h.l.XMLLoader xsltCacheLifetimeSeconds=60
[junit4] 2> 571485 INFO (coreLoadExecutor-3212-thread-1) [ ] o.a.s.c.RequestHandlers Registered paths: /admin/mbeans,standard,/update/json/docs,/admin/luke,/export,/get,/admin/properties,/update/json,/admin/threads,/dump,/update/csv,/sql,/graph,/admin/segments,/admin/system,/replication,/config,/stream,/schema,/admin/plugins,/admin/logging,/admin/ping,/update,/admin/file,/terms
[junit4] 2> 571485 INFO (coreLoadExecutor-3212-thread-1) [ ] o.a.s.c.SolrCore Using default statsCache cache: org.apache.solr.search.stats.LocalStatsCache
[junit4] 2> 571486 INFO (coreLoadExecutor-3212-thread-1) [ ] o.a.s.u.UpdateHandler Using UpdateLog implementation: org.apache.solr.update.UpdateLog
[junit4] 2> 571486 INFO (coreLoadExecutor-3212-thread-1) [ ] o.a.s.u.UpdateLog Initializing UpdateLog: dataDir= defaultSyncLevel=FLUSH numRecordsToKeep=100 maxNumLogsToKeep=10 numVersionBuckets=65536
[junit4] 2> 571486 INFO (coreLoadExecutor-3212-thread-1) [ ] o.a.s.u.CommitTracker Hard AutoCommit: disabled
[junit4] 2> 571486 INFO (coreLoadExecutor-3212-thread-1) [ ] o.a.s.u.CommitTracker Soft AutoCommit: disabled
[junit4] 2> 571487 INFO (coreLoadExecutor-3212-thread-1) [ ] o.a.s.u.RandomMergePolicy RandomMergePolicy wrapping class org.apache.lucene.index.AlcoholicMergePolicy: [AlcoholicMergePolicy: minMergeSize=0, mergeFactor=10, maxMergeSize=1121061251, maxMergeSizeForForcedMerge=9223372036854775807, calibrateSizeByDeletes=true, maxMergeDocs=2147483647, maxCFSSegmentSizeMB=8.796093022207999E12, noCFSRatio=0.1]
[junit4] 2> 571487 INFO (coreLoadExecutor-3212-thread-1) [ ] o.a.s.c.SolrDeletionPolicy SolrDeletionPolicy.onInit: commits: num=1
[junit4] 2> commit{dir=MockDirectoryWrapper(RAMDirectory@73c0d705 lockFactory=org.apache.lucene.store.SingleInstanceLockFactory@492d8025),segFN=segments_1,generation=1}
[junit4] 2> 571487 INFO (coreLoadExecutor-3212-thread-1) [ ] o.a.s.c.SolrDeletionPolicy newest commit generation = 1
[junit4] 2> 571487 INFO (coreLoadExecutor-3212-thread-1) [ ] o.a.s.s.SolrIndexSearcher Opening [Searcher@6afb4ad5[collection1] main]
[junit4] 2> 571488 INFO (coreLoadExecutor-3212-thread-1) [ ] o.a.s.c.c.ZkStateReader Load collection config from: [/collections/control_collection]
[junit4] 2> 571488 INFO (coreLoadExecutor-3212-thread-1) [ ] o.a.s.c.c.ZkStateReader path=[/collections/control_collection] [configName]=[conf1] specified config exists in ZooKeeper
[junit4] 2> 571488 INFO (coreLoadExecutor-3212-thread-1) [ ] o.a.s.r.ManagedResourceStorage Setting up ZooKeeper-based storage for the RestManager with znodeBase: /configs/conf1
[junit4] 2> 571488 INFO (coreLoadExecutor-3212-thread-1) [ ] o.a.s.r.ManagedResourceStorage Configured ZooKeeperStorageIO with znodeBase: /configs/conf1
[junit4] 2> 571488 INFO (coreLoadExecutor-3212-thread-1) [ ] o.a.s.r.RestManager Initializing RestManager with initArgs: {}
[junit4] 2> 571488 INFO (coreLoadExecutor-3212-thread-1) [ ] o.a.s.r.ManagedResourceStorage Reading _rest_managed.json using ZooKeeperStorageIO:path=/configs/conf1
[junit4] 2> 571488 INFO (coreLoadExecutor-3212-thread-1) [ ] o.a.s.r.ManagedResourceStorage No data found for znode /configs/conf1/_rest_managed.json
[junit4] 2> 571488 INFO (coreLoadExecutor-3212-thread-1) [ ] o.a.s.r.ManagedResourceStorage Loaded null at path _rest_managed.json using ZooKeeperStorageIO:path=/configs/conf1
[junit4] 2> 571488 INFO (coreLoadExecutor-3212-thread-1) [ ] o.a.s.r.RestManager Initializing 0 registered ManagedResources
[junit4] 2> 571489 INFO (coreLoadExecutor-3212-thread-1) [ ] o.a.s.h.ReplicationHandler Commits will be reserved for 10000
[junit4] 2> 571489 INFO (searcherExecutor-3213-thread-1) [ ] o.a.s.c.SolrCore [collection1] Registered new searcher Searcher@6afb4ad5[collection1] main{ExitableDirectoryReader(UninvertingDirectoryReader())}
[junit4] 2> 571489 INFO (coreLoadExecutor-3212-thread-1) [ ] o.a.s.u.UpdateLog Looking up max value of version field to seed version buckets
[junit4] 2> 571489 INFO (coreLoadExecutor-3212-thread-1) [ ] o.a.s.u.VersionInfo Refreshing highest value of _version_ for 65536 version buckets from index
[junit4] 2> 571489 INFO (coreLoadExecutor-3212-thread-1) [ ] o.a.s.u.VersionInfo No terms found for _version_, cannot seed version bucket highest value from index
[junit4] 2> 571489 INFO (coreLoadExecutor-3212-thread-1) [ ] o.a.s.u.UpdateLog Could not find max version in index or recent updates, using new clock 1542001659537784832
[junit4] 2> 571491 INFO (coreLoadExecutor-3212-thread-1) [ ] o.a.s.u.UpdateLog Took 2.0ms to seed version buckets with highest version 1542001659537784832
[junit4] 2> 571491 INFO (coreLoadExecutor-3212-thread-1) [ ] o.a.s.c.ZkController watch zkdir /configs/conf1
[junit4] 2> 571492 INFO (coreLoadExecutor-3212-thread-1) [ ] o.a.s.c.CoreContainer registering core: collection1
[junit4] 2> 571492 INFO (coreZkRegister-3206-thread-1) [ ] o.a.s.c.ZkController Register replica - core:collection1 address:http://127.0.0.1:40332 collection:control_collection shard:shard1
[junit4] 2> 571493 INFO (coreZkRegister-3206-thread-1) [ ] o.a.s.c.c.SolrZkClient makePath: /collections/control_collection/leader_elect/shard1/election
[junit4] 2> 571494 INFO (coreZkRegister-3206-thread-1) [ ] o.a.s.c.LeaderElector Joined leadership election with path: /collections/control_collection/leader_elect/shard1/election/96375103634604036-core_node1-n_0000000000
[junit4] 2> 571494 INFO (coreZkRegister-3206-thread-1) [ ] o.a.s.c.ShardLeaderElectionContext Running the leader process for shard=shard1 and weAreReplacement=false and leaderVoteWait=10000
[junit4] 2> 571494 INFO (coreZkRegister-3206-thread-1) [ ] o.a.s.c.ShardLeaderElectionContext Enough replicas found to continue.
[junit4] 2> 571494 INFO (coreZkRegister-3206-thread-1) [ ] o.a.s.c.ShardLeaderElectionContext I may be the new leader - try and sync
[junit4] 2> 571494 INFO (coreZkRegister-3206-thread-1) [ ] o.a.s.c.SyncStrategy Sync replicas to http://127.0.0.1:40332/collection1/
[junit4] 2> 571494 INFO (coreZkRegister-3206-thread-1) [ ] o.a.s.c.SyncStrategy Sync Success - now sync replicas to me
[junit4] 2> 571494 INFO (coreZkRegister-3206-thread-1) [ ] o.a.s.c.SyncStrategy http://127.0.0.1:40332/collection1/ has no replicas
[junit4] 2> 571494 INFO (OverseerStateUpdate-96375103634604036-127.0.0.1:40332_-n_0000000000) [ ] o.a.s.c.Overseer processMessage: queueSize: 1, message = {
[junit4] 2> "operation":"leader",
[junit4] 2> "shard":"shard1",
[junit4] 2> "collection":"control_collection"} current state version: 1
[junit4] 2> 571495 INFO (coreZkRegister-3206-thread-1) [ ] o.a.s.c.c.SolrZkClient makePath: /collections/control_collection/leaders/shard1
[junit4] 2> 571495 INFO (coreZkRegister-3206-thread-1) [ ] o.a.s.c.ShardLeaderElectionContextBase Creating leader registration node /collections/control_collection/leaders/shard1/leader after winning as /collections/control_collection/leader_elect/shard1/election/96375103634604036-core_node1-n_0000000000
[junit4] 2> 571496 INFO (coreZkRegister-3206-thread-1) [ ] o.a.s.c.ShardLeaderElectionContext I am the new leader: http://127.0.0.1:40332/collection1/ shard1
[junit4] 2> 571496 INFO (OverseerStateUpdate-96375103634604036-127.0.0.1:40332_-n_0000000000) [ ] o.a.s.c.Overseer processMessage: queueSize: 1, message = {
[junit4] 2> "operation":"leader",
[junit4] 2> "shard":"shard1",
[junit4] 2> "collection":"control_collection",
[junit4] 2> "base_url":"http://127.0.0.1:40332",
[junit4] 2> "core":"collection1",
[junit4] 2> "state":"active"} current state version: 1
[junit4] 2> 571597 INFO (zkCallback-1291-thread-1) [ ] o.a.s.c.c.ZkStateReader A cluster state change: [WatchedEvent state:SyncConnected type:NodeDataChanged path:/clusterstate.json], has occurred - updating... (live nodes size: [1])
[junit4] 2> 571647 INFO (coreZkRegister-3206-thread-1) [ ] o.a.s.c.ZkController We are http://127.0.0.1:40332/collection1/ and leader is http://127.0.0.1:40332/collection1/
[junit4] 2> 571647 INFO (coreZkRegister-3206-thread-1) [ ] o.a.s.c.ZkController No LogReplay needed for core=collection1 baseURL=http://127.0.0.1:40332
[junit4] 2> 571647 INFO (coreZkRegister-3206-thread-1) [ ] o.a.s.c.ZkController I am the leader, no recovery necessary
[junit4] 2> 571647 INFO (coreZkRegister-3206-thread-1) [ ] o.a.s.c.ZkController publishing state=active
[junit4] 2> 571647 INFO (coreZkRegister-3206-thread-1) [ ] o.a.s.c.ZkController numShards not found on descriptor - reading it from system property
[junit4] 2> 571647 INFO (coreZkRegister-3206-thread-1) [ ] o.a.s.c.c.ZkStateReader Checking legacy cluster state for collection control_collection
[junit4] 2> 571648 INFO (OverseerStateUpdate-96375103634604036-127.0.0.1:40332_-n_0000000000) [ ] o.a.s.c.Overseer processMessage: queueSize: 1, message = {
[junit4] 2> "core":"collection1",
[junit4] 2> "core_node_name":"core_node1",
[junit4] 2> "roles":null,
[junit4] 2> "base_url":"http://127.0.0.1:40332",
[junit4] 2> "node_name":"127.0.0.1:40332_",
[junit4] 2> "numShards":"1",
[junit4] 2> "state":"active",
[junit4] 2> "shard":"shard1",
[junit4] 2> "collection":"control_collection",
[junit4] 2> "operation":"state"} current state version: 2
[junit4] 2> 571648 INFO (OverseerStateUpdate-96375103634604036-127.0.0.1:40332_-n_0000000000) [ ] o.a.s.c.o.ReplicaMutator Update state numShards=1 message={
[junit4] 2> "core":"collection1",
[junit4] 2> "core_node_name":"core_node1",
[junit4] 2> "roles":null,
[junit4] 2> "base_url":"http://127.0.0.1:40332",
[junit4] 2> "node_name":"127.0.0.1:40332_",
[junit4] 2> "numShards":"1",
[junit4] 2> "state":"active",
[junit4] 2> "shard":"shard1",
[junit4] 2> "collection":"control_collection",
[junit4] 2> "operation":"state"}
[junit4] 2> 571749 INFO (zkCallback-1291-thread-1) [ ] o.a.s.c.c.ZkStateReader A cluster state change: [WatchedEvent state:SyncConnected type:NodeDataChanged path:/clusterstate.json], has occurred - updating... (live nodes size: [1])
[junit4] 2> 571875 INFO (TEST-ForceLeaderTest.testLastPublishedStateIsActive-seed#[5F181DCCB6CE386B]) [ ] o.a.s.c.c.SolrZkClient Using default ZkCredentialsProvider
[junit4] 2> 571875 INFO (TEST-ForceLeaderTest.testLastPublishedStateIsActive-seed#[5F181DCCB6CE386B]) [ ] o.a.s.c.c.ConnectionManager Waiting for client to connect to ZooKeeper
[junit4] 2> 571876 INFO (zkCallback-1295-thread-1) [ ] o.a.s.c.c.ConnectionManager Watcher org.apache.solr.common.cloud.ConnectionManager@4b836bed name:ZooKeeperConnection Watcher:127.0.0.1:38810/solr got event WatchedEvent state:SyncConnected type:None path:null path:null type:None
[junit4] 2> 571876 INFO (TEST-ForceLeaderTest.testLastPublishedStateIsActive-seed#[5F181DCCB6CE386B]) [ ] o.a.s.c.c.ConnectionManager Client is connected to ZooKeeper
[junit4] 2> 571876 INFO (TEST-ForceLeaderTest.testLastPublishedStateIsActive-seed#[5F181DCCB6CE386B]) [ ] o.a.s.c.c.SolrZkClient Using default ZkACLProvider
[junit4] 2> 571876 INFO (TEST-ForceLeaderTest.testLastPublishedStateIsActive-seed#[5F181DCCB6CE386B]) [ ] o.a.s.c.c.ZkStateReader Updating cluster state from ZooKeeper...
[junit4] 2> 571877 INFO (TEST-ForceLeaderTest.testLastPublishedStateIsActive-seed#[5F181DCCB6CE386B]) [ ] o.a.s.c.c.ZkStateReader Loaded empty cluster properties
[junit4] 2> 571877 INFO (TEST-ForceLeaderTest.testLastPublishedStateIsActive-seed#[5F181DCCB6CE386B]) [ ] o.a.s.c.c.ZkStateReader Updated live nodes from ZooKeeper... (0) -> (1)
[junit4] 2> 571877 INFO (TEST-ForceLeaderTest.testLastPublishedStateIsActive-seed#[5F181DCCB6CE386B]) [ ] o.a.s.c.ChaosMonkey monkey: init - expire sessions:false cause connection loss:false
[junit4] 2> 571877 INFO (TEST-ForceLeaderTest.testLastPublishedStateIsActive-seed#[5F181DCCB6CE386B]) [ ] o.a.s.c.AbstractFullDistribZkTestBase Creating collection1 with stateFormat=2
[junit4] 2> 571877 INFO (TEST-ForceLeaderTest.testLastPublishedStateIsActive-seed#[5F181DCCB6CE386B]) [ ] o.a.s.c.c.SolrZkClient Using default ZkCredentialsProvider
[junit4] 2> 571878 INFO (TEST-ForceLeaderTest.testLastPublishedStateIsActive-seed#[5F181DCCB6CE386B]) [ ] o.a.s.c.c.ConnectionManager Waiting for client to connect to ZooKeeper
[junit4] 2> 571878 INFO (zkCallback-1296-thread-1) [ ] o.a.s.c.c.ConnectionManager Watcher org.apache.solr.common.cloud.ConnectionManager@3889e943 name:ZooKeeperConnection Watcher:127.0.0.1:38810/solr got event WatchedEvent state:SyncConnected type:None path:null path:null type:None
[junit4] 2> 571878 INFO (TEST-ForceLeaderTest.testLastPublishedStateIsActive-seed#[5F181DCCB6CE386B]) [ ] o.a.s.c.c.ConnectionManager Client is connected to ZooKeeper
[junit4] 2> 571878 INFO (TEST-ForceLeaderTest.testLastPublishedStateIsActive-seed#[5F181DCCB6CE386B]) [ ] o.a.s.c.c.SolrZkClient Using default ZkACLProvider
[junit4] 2> 571879 INFO (OverseerStateUpdate-96375103634604036-127.0.0.1:40332_-n_0000000000) [ ] o.a.s.c.Overseer processMessage: queueSize: 1, message = {
[junit4] 2> "operation":"create",
[junit4] 2> "name":"collection1",
[junit4] 2> "numShards":"2",
[junit4] 2> "stateFormat":"2"} current state version: 3
[junit4] 2> 571879 INFO (OverseerStateUpdate-96375103634604036-127.0.0.1:40332_-n_0000000000) [ ] o.a.s.c.o.ClusterStateMutator building a new cName: collection1
[junit4] 2> 571934 INFO (TEST-ForceLeaderTest.testLastPublishedStateIsActive-seed#[5F181DCCB6CE386B]) [ ] o.a.s.SolrTestCaseJ4 Writing core.properties file to /home/jenkins/workspace/Lucene-Solr-master-Linux/solr/build/solr-core/test/J0/temp/solr.cloud.ForceLeaderTest_5F181DCCB6CE386B-001/shard-1-001/cores/collection1
[junit4] 2> 571935 INFO (TEST-ForceLeaderTest.testLastPublishedStateIsActive-seed#[5F181DCCB6CE386B]) [ ] o.a.s.c.AbstractFullDistribZkTestBase create jetty 1 in directory /home/jenkins/workspace/Lucene-Solr-master-Linux/solr/build/solr-core/test/J0/temp/solr.cloud.ForceLeaderTest_5F181DCCB6CE386B-001/shard-1-001
[junit4] 2> 571936 INFO (TEST-ForceLeaderTest.testLastPublishedStateIsActive-seed#[5F181DCCB6CE386B]) [ ] o.e.j.s.Server jetty-9.3.8.v20160314
[junit4] 2> 571936 INFO (TEST-ForceLeaderTest.testLastPublishedStateIsActive-seed#[5F181DCCB6CE386B]) [ ] o.e.j.s.h.ContextHandler Started o.e.j.s.ServletContextHandler@2e64db45{/,null,AVAILABLE}
[junit4] 2> 571937 INFO (TEST-ForceLeaderTest.testLastPublishedStateIsActive-seed#[5F181DCCB6CE386B]) [ ] o.e.j.s.ServerConnector Started ServerConnector@72b26162{HTTP/1.1,[http/1.1]}{127.0.0.1:37597}
[junit4] 2> 571937 INFO (TEST-ForceLeaderTest.testLastPublishedStateIsActive-seed#[5F181DCCB6CE386B]) [ ] o.e.j.s.Server Started @574020ms
[junit4] 2> 571937 INFO (TEST-ForceLeaderTest.testLastPublishedStateIsActive-seed#[5F181DCCB6CE386B]) [ ] o.a.s.c.s.e.JettySolrRunner Jetty properties: {hostContext=/, solrconfig=solrconfig.xml, solr.data.dir=/home/jenkins/workspace/Lucene-Solr-master-Linux/solr/build/solr-core/test/J0/temp/solr.cloud.ForceLeaderTest_5F181DCCB6CE386B-001/tempDir-001/jetty1, hostPort=46449, coreRootDirectory=/home/jenkins/workspace/Lucene-Solr-master-Linux/solr/build/solr-core/test/J0/temp/solr.cloud.ForceLeaderTest_5F181DCCB6CE386B-001/shard-1-001/cores}
[junit4] 2> 571937 INFO (TEST-ForceLeaderTest.testLastPublishedStateIsActive-seed#[5F181DCCB6CE386B]) [ ] o.a.s.s.SolrDispatchFilter SolrDispatchFilter.init(): jdk.internal.loader.ClassLoaders$AppClassLoader@3ab39c39
[junit4] 2> 571937 INFO (TEST-ForceLeaderTest.testLastPublishedStateIsActive-seed#[5F181DCCB6CE386B]) [ ] o.a.s.c.SolrResourceLoader new SolrResourceLoader for directory: '/home/jenkins/workspace/Lucene-Solr-master-Linux/solr/build/solr-core/test/J0/temp/solr.cloud.ForceLeaderTest_5F181DCCB6CE386B-001/shard-1-001'
[junit4] 2> 571937 INFO (TEST-ForceLeaderTest.testLastPublishedStateIsActive-seed#[5F181DCCB6CE386B]) [ ] o.a.s.c.SolrResourceLoader JNDI not configured for solr (NoInitialContextEx)
[junit4] 2> 571938 INFO (TEST-ForceLeaderTest.testLastPublishedStateIsActive-seed#[5F181DCCB6CE386B]) [ ] o.a.s.c.SolrResourceLoader solr home defaulted to 'solr/' (could not find system property or JNDI)
[junit4] 2> 571938 INFO (TEST-ForceLeaderTest.testLastPublishedStateIsActive-seed#[5F181DCCB6CE386B]) [ ] o.a.s.c.c.SolrZkClient Using default ZkCredentialsProvider
[junit4] 2> 571938 INFO (TEST-ForceLeaderTest.testLastPublishedStateIsActive-seed#[5F181DCCB6CE386B]) [ ] o.a.s.c.c.ConnectionManager Waiting for client to connect to ZooKeeper
[junit4] 2> 571939 INFO (zkCallback-1297-thread-1) [ ] o.a.s.c.c.ConnectionManager Watcher org.apache.solr.common.cloud.ConnectionManager@6e7a0b7d name:ZooKeeperConnection Watcher:127.0.0.1:38810/solr got event WatchedEvent state:SyncConnected type:None path:null path:null type:None
[junit4] 2> 571939 INFO (TEST-ForceLeaderTest.testLastPublishedStateIsActive-seed#[5F181DCCB6CE386B]) [ ] o.a.s.c.c.ConnectionManager Client is connected to ZooKeeper
[junit4] 2> 571939 INFO (TEST-ForceLeaderTest.testLastPublishedStateIsActive-seed#[5F181DCCB6CE386B]) [ ] o.a.s.c.c.SolrZkClient Using default ZkACLProvider
[junit4] 2> 571939 INFO (TEST-ForceLeaderTest.testLastPublishedStateIsActive-seed#[5F181DCCB6CE386B]) [ ] o.a.s.s.SolrDispatchFilter Loading solr.xml from SolrHome (not found in ZooKeeper)
[junit4] 2> 571939 INFO (TEST-ForceLeaderTest.testLastPublishedStateIsActive-seed#[5F181DCCB6CE386B]) [ ] o.a.s.c.SolrXmlConfig Loading container configuration from /home/jenkins/workspace/Lucene-Solr-master-Linux/solr/build/solr-core/test/J0/temp/solr.cloud.ForceLeaderTest_5F181DCCB6CE386B-001/shard-1-001/solr.xml
[junit4] 2> 571942 INFO (TEST-ForceLeaderTest.testLastPublishedStateIsActive-seed#[5F181DCCB6CE386B]) [ ] o.a.s.c.CorePropertiesLocator Config-defined core root directory: /home/jenkins/workspace/Lucene-Solr-master-Linux/solr/build/solr-core/test/J0/temp/solr.cloud.ForceLeaderTest_5F181DCCB6CE386B-001/shard-1-001/cores
[junit4] 2> 571942 INFO (TEST-ForceLeaderTest.testLastPublishedStateIsActive-seed#[5F181DCCB6CE386B]) [ ] o.a.s.c.CoreContainer New CoreContainer 913204650
[junit4] 2> 571942 INFO (TEST-ForceLeaderTest.testLastPublishedStateIsActive-seed#[5F181DCCB6CE386B]) [ ] o.a.s.c.CoreContainer Loading cores into CoreContainer [instanceDir=/home/jenkins/workspace/Lucene-Solr-master-Linux/solr/build/solr-core/test/J0/temp/solr.cloud.ForceLeaderTest_5F181DCCB6CE386B-001/shard-1-001]
[junit4] 2> 571943 WARN (TEST-ForceLeaderTest.testLastPublishedStateIsActive-seed#[5F181DCCB6CE386B]) [ ] o.a.s.c.CoreContainer Couldn't add files from /home/jenkins/workspace/Lucene-Solr-master-Linux/solr/build/solr-core/test/J0/temp/solr.cloud.ForceLeaderTest_5F181DCCB6CE386B-001/shard-1-001/lib to classpath: /home/jenkins/workspace/Lucene-Solr-master-Linux/solr/build/solr-core/test/J0/temp/solr.cloud.ForceLeaderTest_5F181DCCB6CE386B-001/shard-1-001/lib
[junit4] 2> 571943 INFO (TEST-ForceLeaderTest.testLastPublishedStateIsActive-seed#[5F181DCCB6CE386B]) [ ] o.a.s.h.c.HttpShardHandlerFactory created with socketTimeout : 90000,urlScheme : ,connTimeout : 15000,maxConnectionsPerHost : 20,maxConnections : 10000,corePoolSize : 0,maximumPoolSize : 2147483647,maxThreadIdleTime : 5,sizeOfQueue : -1,fairnessPolicy : false,
[junit4] 2> 571944 INFO (TEST-ForceLeaderTest.testLastPublishedStateIsActive-seed#[5F181DCCB6CE386B]) [ ] o.a.s.u.UpdateShardHandler Created UpdateShardHandler HTTP client with params: socketTimeout=340000&connTimeout=45000&maxConnections=100000&maxConnectionsPerHost=100000
[junit4] 2> 571944 INFO (TEST-ForceLeaderTest.testLastPublishedStateIsActive-seed#[5F181DCCB6CE386B]) [ ] o.a.s.l.LogWatcher SLF4J impl is org.slf4j.impl.Log4jLoggerFactory
[junit4] 2> 571944 INFO (TEST-ForceLeaderTest.testLastPublishedStateIsActive-seed#[5F181DCCB6CE386B]) [ ] o.a.s.l.LogWatcher Registering Log Listener [Log4j (org.slf4j.impl.Log4jLoggerFactory)]
[junit4] 2> 571944 INFO (TEST-ForceLeaderTest.testLastPublishedStateIsActive-seed#[5F181DCCB6CE386B]) [ ] o.a.s.c.ZkContainer Zookeeper client=127.0.0.1:38810/solr
[junit4] 2> 571944 INFO (TEST-ForceLeaderTest.testLastPublishedStateIsActive-seed#[5F181DCCB6CE386B]) [ ] o.a.s.c.ZkController zkHost includes chroot
[junit4] 2> 571944 INFO (TEST-ForceLeaderTest.testLastPublishedStateIsActive-seed#[5F181DCCB6CE386B]) [ ] o.a.s.c.c.SolrZkClient Using default ZkCredentialsProvider
[junit4] 2> 571945 INFO (TEST-ForceLeaderTest.testLastPublishedStateIsActive-seed#[5F181DCCB6CE386B]) [ ] o.a.s.c.c.ConnectionManager Waiting for client to connect to ZooKeeper
[junit4] 2> 571945 INFO (zkCallback-1300-thread-1) [ ] o.a.s.c.c.ConnectionManager Watcher org.apache.solr.common.cloud.ConnectionManager@496f1150 name:ZooKeeperConnection Watcher:127.0.0.1:38810 got event WatchedEvent state:SyncConnected type:None path:null path:null type:None
[junit4] 2> 571946 INFO (TEST-ForceLeaderTest.testLastPublishedStateIsActive-seed#[5F181DCCB6CE386B]) [ ] o.a.s.c.c.ConnectionManager Client is connected to ZooKeeper
[junit4] 2> 571946 INFO (TEST-ForceLeaderTest.testLastPublishedStateIsActive-seed#[5F181DCCB6CE386B]) [ ] o.a.s.c.c.SolrZkClient Using default ZkACLProvider
[junit4] 2> 571946 INFO (TEST-ForceLeaderTest.testLastPublishedStateIsActive-seed#[5F181DCCB6CE386B]) [ ] o.a.s.c.ZkController Added new OnReconnect listener org.apache.solr.cloud.ZkController$$Lambda$206/771651206@57516e54
[junit4] 2> 571947 INFO (TEST-ForceLeaderTest.testLastPublishedStateIsActive-seed#[5F181DCCB6CE386B]) [ ] o.a.s.c.c.ConnectionManager Waiting for client to connect to ZooKeeper
[junit4] 2> 571947 INFO (zkCallback-1301-thread-1) [ ] o.a.s.c.c.ConnectionManager Watcher org.apache.solr.common.cloud.ConnectionManager@259930a9 name:ZooKeeperConnection Watcher:127.0.0.1:38810/solr got event WatchedEvent state:SyncConnected type:None path:null path:null type:None
[junit4] 2> 571947 INFO (TEST-ForceLeaderTest.testLastPublishedStateIsActive-seed#[5F181DCCB6CE386B]) [ ] o.a.s.c.c.ConnectionManager Client is connected to ZooKeeper
[junit4] 2> 571950 INFO (TEST-ForceLeaderTest.testLastPublishedStateIsActive-seed#[5F181DCCB6CE386B]) [ ] o.a.s.c.c.ZkStateReader Updating cluster state from ZooKeeper...
[junit4] 2> 571950 INFO (TEST-ForceLeaderTest.testLastPublishedStateIsActive-seed#[5F181DCCB6CE386B]) [ ] o.a.s.c.c.ZkStateReader Loaded empty cluster properties
[junit4] 2> 571950 INFO (TEST-ForceLeaderTest.testLastPublishedStateIsActive-seed#[5F181DCCB6CE386B]) [ ] o.a.s.c.c.ZkStateReader Updated live nodes from ZooKeeper... (0) -> (1)
[junit4] 2> 571951 INFO (TEST-ForceLeaderTest.testLastPublishedStateIsActive-seed#[5F181DCCB6CE386B]) [ ] o.a.s.c.Overseer Overseer (id=null) closing
[junit4] 2> 571952 INFO (TEST-ForceLeaderTest.testLastPublishedStateIsActive-seed#[5F181DCCB6CE386B]) [ ] o.a.s.c.LeaderElector Joined leadership election with path: /overseer_elect/election/96375103634604041-127.0.0.1:46449_-n_0000000001
[junit4] 2> 571952 INFO (TEST-ForceLeaderTest.testLastPublishedStateIsActive-seed#[5F181DCCB6CE386B]) [ ] o.a.s.c.LeaderElector Watching path /overseer_elect/election/96375103634604036-127.0.0.1:40332_-n_0000000000 to know if I could be the leader
[junit4] 2> 571952 INFO (TEST-ForceLeaderTest.testLastPublishedStateIsActive-seed#[5F181DCCB6CE386B]) [ ] o.a.s.c.ZkController Publish node=127.0.0.1:46449_ as DOWN
[junit4] 2> 571952 INFO (TEST-ForceLeaderTest.testLastPublishedStateIsActive-seed#[5F181DCCB6CE386B]) [ ] o.a.s.c.ZkController Register node as live in ZooKeeper:/live_nodes/127.0.0.1:46449_
[junit4] 2> 571952 INFO (TEST-ForceLeaderTest.testLastPublishedStateIsActive-seed#[5F181DCCB6CE386B]) [ ] o.a.s.c.c.SolrZkClient makePath: /live_nodes/127.0.0.1:46449_
[junit4] 2> 571953 INFO (OverseerStateUpdate-96375103634604036-127.0.0.1:40332_-n_0000000000) [ ] o.a.s.c.Overseer processMessage: queueSize: 1, message = {
[junit4] 2> "operation":"downnode",
[junit4] 2> "node_name":"127.0.0.1:46449_"} current state version: 3
[junit4] 2> 571953 INFO (OverseerStateUpdate-96375103634604036-127.0.0.1:40332_-n_0000000000) [ ] o.a.s.c.o.NodeMutator DownNode state invoked for node: 127.0.0.1:46449_
[junit4] 2> 571953 INFO (zkCallback-1291-thread-1) [ ] o.a.s.c.c.ZkStateReader A live node change: [WatchedEvent state:SyncConnected type:NodeChildrenChanged path:/live_nodes], has occurred - updating... (live nodes size: [1])
[junit4] 2> 571953 INFO (zkCallback-1295-thread-1) [ ] o.a.s.c.c.ZkStateReader A live node change: [WatchedEvent state:SyncConnected type:NodeChildrenChanged path:/live_nodes], has occurred - updating... (live nodes size: [1])
[junit4] 2> 571953 INFO (zkCallback-1301-thread-1) [ ] o.a.s.c.c.ZkStateReader A live node change: [WatchedEvent state:SyncConnected type:NodeChildrenChanged path:/live_nodes], has occurred - updating... (live nodes size: [1])
[junit4] 2> 571953 INFO (OverseerStateUpdate-96375103634604036-127.0.0.1:40332_-n_0000000000) [ ] o.a.s.c.o.ZkStateWriter going to create_collection /collections/collection1/state.json
[junit4] 2> 571953 INFO (zkCallback-1291-thread-1) [ ] o.a.s.c.c.ZkStateReader Updated live nodes from ZooKeeper... (1) -> (2)
[junit4] 2> 571953 INFO (zkCallback-1295-thread-1) [ ] o.a.s.c.c.ZkStateReader Updated live nodes from ZooKeeper... (1) -> (2)
[junit4] 2> 571953 INFO (zkCallback-1301-thread-1) [ ] o.a.s.c.c.ZkStateReader Updated live nodes from ZooKeeper... (1) -> (2)
[junit4] 2> 571954 INFO (zkCallback-1291-thread-1) [ ] o.a.s.c.c.ZkStateReader A cluster state change: [WatchedEvent state:SyncConnected type:NodeDataChanged path:/clusterstate.json], has occurred - updating... (live nodes size: [2])
[junit4] 2> 571954 INFO (zkCallback-1295-thread-1) [ ] o.a.s.c.c.ZkStateReader A cluster state change: [WatchedEvent state:SyncConnected type:NodeDataChanged path:/clusterstate.json], has occurred - updating... (live nodes size: [2])
[junit4] 2> 571954 INFO (zkCallback-1301-thread-1) [ ] o.a.s.c.c.ZkStateReader A cluster state change: [WatchedEvent state:SyncConnected type:NodeDataChanged path:/clusterstate.json], has occurred - updating... (live nodes size: [2])
[junit4] 2> 571958 INFO (TEST-ForceLeaderTest.testLastPublishedStateIsActive-seed#[5F181DCCB6CE386B]) [ ] o.a.s.c.CoreContainer Security conf doesn't exist. Skipping setup for authorization module.
[junit4] 2> 571958 INFO (TEST-ForceLeaderTest.testLastPublishedStateIsActive-seed#[5F181DCCB6CE386B]) [ ] o.a.s.c.CoreContainer No authentication plugin used.
[junit4] 2> 571958 INFO (TEST-ForceLeaderTest.testLastPublishedStateIsActive-seed#[5F181DCCB6CE386B]) [ ] o.a.s.c.CorePropertiesLocator Looking for core definitions underneath /home/jenkins/workspace/Lucene-Solr-master-Linux/solr/build/solr-core/test/J0/temp/solr.cloud.ForceLeaderTest_5F181DCCB6CE386B-001/shard-1-001/cores
[junit4] 2> 571959 INFO (TEST-ForceLeaderTest.testLastPublishedStateIsActive-seed#[5F181DCCB6CE386B]) [ ] o.a.s.c.CoreDescriptor Created CoreDescriptor: {schema=schema.xml, dataDir=data/, collection=collection1, loadOnStartup=true, coreNodeName=, transient=false, name=collection1, shard=, config=solrconfig.xml, configSetProperties=configsetprops.json}
[junit4] 2> 571959 INFO (TEST-ForceLeaderTest.testLastPublishedStateIsActive-seed#[5F181DCCB6CE386B]) [ ] o.a.s.c.CorePropertiesLocator Found core collection1 in /home/jenkins/workspace/Lucene-Solr-master-Linux/solr/build/solr-core/test/J0/temp/solr.cloud.ForceLeaderTest_5F181DCCB6CE386B-001/shard-1-001/cores/collection1
[junit4] 2> 571959 INFO (TEST-ForceLeaderTest.testLastPublishedStateIsActive-seed#[5F181DCCB6CE386B]) [ ] o.a.s.c.CorePropertiesLocator Found 1 core definitions
[junit4] 2> 571959 INFO (TEST-ForceLeaderTest.testLastPublishedStateIsActive-seed#[5F181DCCB6CE386B]) [ ] o.a.s.s.SolrDispatchFilter user.dir=/home/jenkins/workspace/Lucene-Solr-master-Linux/solr/build/solr-core/test/J0
[junit4] 2> 571959 INFO (TEST-ForceLeaderTest.testLastPublishedStateIsActive-seed#[5F181DCCB6CE386B]) [ ] o.a.s.s.SolrDispatchFilter SolrDispatchFilter.init() done
[junit4] 2> 571959 INFO (coreLoadExecutor-3223-thread-1) [ ] o.a.s.c.ZkController publishing state=down
[junit4] 2> 571959 INFO (coreLoadExecutor-3223-thread-1) [ ] o.a.s.c.ZkController numShards not found on descriptor - reading it from system property
[junit4] 2> 571960 INFO (coreLoadExecutor-3223-thread-1) [ ] o.a.s.c.ZkController Registering watch for collection collection1
[junit4] 2> 571961 INFO (OverseerStateUpdate-96375103634604036-127.0.0.1:40332_-n_0000000000) [ ] o.a.s.c.Overseer processMessage: queueSize: 1, message = {
[junit4] 2> "core":"collection1",
[junit4] 2> "roles":null,
[junit4] 2> "base_url":"http://127.0.0.1:46449",
[junit4] 2> "node_name":"127.0.0.1:46449_",
[junit4] 2> "numShards":"2",
[junit4] 2> "state":"down",
[junit4] 2> "shard":null,
[junit4] 2> "collection":"collection1",
[junit4] 2> "operation":"state"} current state version: 4
[junit4] 2> 571961 INFO (coreLoadExecutor-3223-thread-1) [ ] o.a.s.c.c.ZkStateReader Add data for [collection1] ver [0]
[junit4] 2> 571961 INFO (OverseerStateUpdate-96375103634604036-127.0.0.1:40332_-n_0000000000) [ ] o.a.s.c.o.ReplicaMutator Update state numShards=2 message={
[junit4] 2> "core":"collection1",
[junit4] 2> "roles":null,
[junit4] 2> "base_url":"http://127.0.0.1:46449",
[junit4] 2> "node_name":"127.0.0.1:46449_",
[junit4] 2> "numShards":"2",
[junit4] 2> "state":"down",
[junit4] 2> "shard":null,
[junit4] 2> "collection":"collection1",
[junit4] 2> "operation":"state"}
[junit4] 2> 571961 INFO (OverseerStateUpdate-96375103634604036-127.0.0.1:40332_-n_0000000000) [ ] o.a.s.c.o.ReplicaMutator Collection already exists with numShards=2
[junit4] 2> 571961 INFO (coreLoadExecutor-3223-thread-1) [ ] o.a.s.c.ZkController look for our core node name
[junit4] 2> 571961 INFO (OverseerStateUpdate-96375103634604036-127.0.0.1:40332_-n_0000000000) [ ] o.a.s.c.o.ReplicaMutator Assigning new node to shard shard=shard2
[junit4] 2> 572062 INFO (OverseerStateUpdate-96375103634604036-127.0.0.1:40332_-n_0000000000) [ ] o.a.s.c.o.ZkStateWriter going to update_collection /collections/collection1/state.json version: 2147483647
[junit4] 2> 572062 WARN (OverseerStateUpdate-96375103634604036-127.0.0.1:40332_-n_0000000000) [ ] o.a.s.c.Overseer Bad version writing to ZK using compare-and-set, will force refresh cluster state
[junit4] 2> org.apache.zookeeper.KeeperException$BadVersionException: KeeperErrorCode = BadVersion for /collections/collection1/state.json
[junit4] 2> at org.apache.zookeeper.KeeperException.create(KeeperException.java:115)
[junit4] 2> at org.apache.zookeeper.KeeperException.create(KeeperException.java:51)
[junit4] 2> at org.apache.zookeeper.ZooKeeper.setData(ZooKeeper.java:1270)
[junit4] 2> at org.apache.solr.common.cloud.SolrZkClient$8.execute(SolrZkClient.java:365)
[junit4] 2> at org.apache.solr.common.cloud.SolrZkClient$8.execute(SolrZkClient.java:362)
[junit4] 2> at org.apache.solr.common.cloud.ZkCmdExecutor.retryOperation(ZkCmdExecutor.java:60)
[junit4] 2> at org.apache.solr.common.cloud.SolrZkClient.setData(SolrZkClient.java:362)
[junit4] 2> at org.apache.solr.cloud.overseer.ZkStateWriter.writePendingUpdates(ZkStateWriter.java:230)
[junit4] 2> at org.apache.solr.cloud.Overseer$ClusterStateUpdater.run(Overseer.java:240)
[junit4] 2> at java.lang.Thread.run(java.base@9-ea/Thread.java:843)
[junit4] 2> 572062 INFO (OverseerStateUpdate-96375103634604036-127.0.0.1:40332_-n_0000000000) [ ] o.a.s.c.c.ZkStateReader Updated live nodes from ZooKeeper... (2) -> (2)
[junit4] 2> 572063 INFO (OverseerStateUpdate-96375103634604036-127.0.0.1:40332_-n_0000000000) [ ] o.a.s.c.Overseer processMessage: workQueueSize: 2, message = {
[junit4] 2> "operation":"downnode",
[junit4] 2> "node_name":"127.0.0.1:46449_"}
[junit4] 2> 572063 INFO (OverseerStateUpdate-96375103634604036-127.0.0.1:40332_-n_0000000000) [ ] o.a.s.c.o.NodeMutator DownNode state invoked for node: 127.0.0.1:46449_
[junit4] 2> 572063 INFO (zkCallback-1291-thread-1) [ ] o.a.s.c.c.ZkStateReader A cluster state change: [WatchedEvent state:SyncConnected type:NodeDataChanged path:/clusterstate.json], has occurred - updating... (live nodes size: [2])
[junit4] 2> 572063 INFO (zkCallback-1301-thread-1) [ ] o.a.s.c.c.ZkStateReader A cluster state change: [WatchedEvent state:SyncConnected type:NodeDataChanged path:/clusterstate.json], has occurred - updating... (live nodes size: [2])
[junit4] 2> 572063 INFO (zkCallback-1295-thread-1) [ ] o.a.s.c.c.ZkStateReader A cluster state change: [WatchedEvent state:SyncConnected type:NodeDataChanged path:/clusterstate.json], has occurred - updating... (live nodes size: [2])
[junit4] 2> 572063 INFO (OverseerStateUpdate-96375103634604036-127.0.0.1:40332_-n_0000000000) [ ] o.a.s.c.o.ZkStateWriter going to update_collection /collections/collection1/state.json version: 0
[junit4] 2> 572063 INFO (zkCallback-1301-thread-1) [ ] o.a.s.c.c.ZkStateReader A cluster state change: [WatchedEvent state:SyncConnected type:NodeDataChanged path:/collections/collection1/state.json] for collection [collection1] has occurred - updating... (live nodes size: [2])
[junit4] 2> 572064 INFO (zkCallback-1301-thread-1) [ ] o.a.s.c.c.ZkStateReader Updating data for [collection1] from [0] to [1]
[junit4] 2> 572064 INFO (OverseerStateUpdate-96375103634604036-127.0.0.1:40332_-n_0000000000) [ ] o.a.s.c.Overseer processMessage: workQueueSize: 1, message = {
[junit4] 2> "core":"collection1",
[junit4] 2> "roles":null,
[junit4] 2> "base_url":"http://127.0.0.1:46449",
[junit4] 2> "node_name":"127.0.0.1:46449_",
[junit4] 2> "numShards":"2",
[junit4] 2> "state":"down",
[junit4] 2> "shard":null,
[junit4] 2> "collection":"collection1",
[junit4] 2> "operation":"state"}
[junit4] 2> 572064 INFO (OverseerStateUpdate-96375103634604036-127.0.0.1:40332_-n_0000000000) [ ] o.a.s.c.o.ReplicaMutator Update state numShards=2 message={
[junit4] 2> "core":"collection1",
[junit4] 2> "roles":null,
[junit4] 2> "base_url":"http://127.0.0.1:46449",
[junit4] 2> "node_name":"127.0.0.1:46449_",
[junit4] 2> "numShards":"2",
[junit4] 2> "state":"down",
[junit4] 2> "shard":null,
[junit4] 2> "collection":"collection1",
[junit4] 2> "operation":"state"}
[junit4] 2> 572064 INFO (OverseerStateUpdate-96375103634604036-127.0.0.1:40332_-n_0000000000) [ ] o.a.s.c.o.ReplicaMutator Collection already exists with numShards=2
[junit4] 2> 572064 INFO (OverseerStateUpdate-96375103634604036-127.0.0.1:40332_-n_0000000000) [ ] o.a.s.c.o.ReplicaMutator Assigning new node to shard shard=shard2
[junit4] 2> 572064 INFO (OverseerStateUpdate-96375103634604036-127.0.0.1:40332_-n_0000000000) [ ] o.a.s.c.o.ZkStateWriter going to update_collection /collections/collection1/state.json version: 1
[junit4] 2> 572064 INFO (zkCallback-1301-thread-1) [ ] o.a.s.c.c.ZkStateReader A cluster state change: [WatchedEvent state:SyncConnected type:NodeDataChanged path:/collections/collection1/state.json] for collection [collection1] has occurred - updating... (live nodes size: [2])
[junit4] 2> 572065 INFO (zkCallback-1301-thread-1) [ ] o.a.s.c.c.ZkStateReader Updating data for [collection1] from [1] to [2]
[junit4] 2> 572961 INFO (coreLoadExecutor-3223-thread-1) [ ] o.a.s.c.ZkController waiting to find shard id in clusterstate for collection1
[junit4] 2> 572961 INFO (coreLoadExecutor-3223-thread-1) [ ] o.a.s.c.ZkController Check for collection zkNode:collection1
[junit4] 2> 572961 INFO (coreLoadExecutor-3223-thread-1) [ ] o.a.s.c.ZkController Collection zkNode exists
[junit4] 2> 572961 INFO (coreLoadExecutor-3223-thread-1) [ ] o.a.s.c.c.ZkStateReader Load collection config from: [/collections/collection1]
[junit4] 2> 572961 INFO (coreLoadExecutor-3223-thread-1) [ ] o.a.s.c.c.ZkStateReader path=[/collections/collection1] [configName]=[conf1] specified config exists in ZooKeeper
[junit4] 2> 572961 INFO (coreLoadExecutor-3223-thread-1) [ ] o.a.s.c.SolrResourceLoader new SolrResourceLoader for directory: '/home/jenkins/workspace/Lucene-Solr-master-Linux/solr/build/solr-core/test/J0/temp/solr.cloud.ForceLeaderTest_5F181DCCB6CE386B-001/shard-1-001/cores/collection1'
[junit4] 2> 572962 INFO (coreLoadExecutor-3223-thread-1) [ ] o.a.s.c.SolrResourceLoader JNDI not configured for solr (NoInitialContextEx)
[junit4] 2> 572962 INFO (coreLoadExecutor-3223-thread-1) [ ] o.a.s.c.SolrResourceLoader solr home defaulted to 'solr/' (could not find system property or JNDI)
[junit4] 2> 572962 INFO (coreLoadExecutor-3223-thread-1) [ ] o.a.s.c.Config loaded config solrconfig.xml with version 0
[junit4] 2> 572965 INFO (coreLoadExecutor-3223-thread-1) [ ] o.a.s.c.SolrConfig current version of requestparams : -1
[junit4] 2> 572967 WARN (coreLoadExecutor-3223-thread-1) [ ] o.a.s.c.Config Beginning with Solr 5.5, <mergePolicy> is deprecated, use <mergePolicyFactory> instead.
[junit4] 2> 572968 INFO (coreLoadExecutor-3223-thread-1) [ ] o.a.s.c.SolrConfig Using Lucene MatchVersion: 7.0.0
[junit4] 2> 572974 INFO (coreLoadExecutor-3223-thread-1) [ ] o.a.s.c.SolrConfig Loaded SolrConfig: solrconfig.xml
[junit4] 2> 572977 INFO (coreLoadExecutor-3223-thread-1) [ ] o.a.s.s.IndexSchema [collection1] Schema name=test
[junit4] 2> 573034 INFO (coreLoadExecutor-3223-thread-1) [ ] o.a.s.s.OpenExchangeRatesOrgProvider Initialized with rates=open-exchange-rates.json, refreshInterval=1440.
[junit4] 2> 573038 INFO (coreLoadExecutor-3223-thread-1) [ ] o.a.s.s.IndexSchema default search field in schema is text
[junit4] 2> 573039 INFO (coreLoadExecutor-3223-thread-1) [ ] o.a.s.s.IndexSchema unique key field: id
[junit4] 2> 573044 INFO (coreLoadExecutor-3223-thread-1) [ ] o.a.s.s.FileExchangeRateProvider Reloading exchange rates from file currency.xml
[junit4] 2> 573045 INFO (coreLoadExecutor-3223-thread-1) [ ] o.a.s.s.FileExchangeRateProvider Reloading exchange rates from file currency.xml
[junit4] 2> 573046 INFO (coreLoadExecutor-3223-thread-1) [ ] o.a.s.s.OpenExchangeRatesOrgProvider Reloading exchange rates from open-exchange-rates.json
[junit4] 2> 573047 INFO (coreLoadExecutor-3223-thread-1) [ ] o.a.s.s.OpenExchangeRatesOrgProvider Reloading exchange rates from open-exchange-rates.json
[junit4] 2> 573048 INFO (coreLoadExecutor-3223-thread-1) [ ] o.a.s.c.ConfigSetProperties Did not find ConfigSet properties, assuming default properties: Can't find resource 'configsetprops.json' in classpath or '/configs/conf1', cwd=/home/jenkins/workspace/Lucene-Solr-master-Linux/solr/build/solr-core/test/J0
[junit4] 2> 573048 INFO (coreLoadExecutor-3223-thread-1) [ ] o.a.s.c.CoreContainer Creating SolrCore 'collection1' using configuration from collection collection1
[junit4] 2> 573048 INFO (coreLoadExecutor-3223-thread-1) [ ] o.a.s.c.SolrCore org.apache.solr.core.MockDirectoryFactory
[junit4] 2> 573048 INFO (coreLoadExecutor-3223-thread-1) [ ] o.a.s.c.SolrCore [[collection1] ] Opening new SolrCore at [/home/jenkins/workspace/Lucene-Solr-master-Linux/solr/build/solr-core/test/J0/temp/solr.cloud.ForceLeaderTest_5F181DCCB6CE386B-001/shard-1-001/cores/collection1], dataDir=[/home/jenkins/workspace/Lucene-Solr-master-Linux/solr/build/solr-core/test/J0/temp/solr.cloud.ForceLeaderTest_5F181DCCB6CE386B-001/shard-1-001/cores/collection1/data/]
[junit4] 2> 573048 INFO (coreLoadExecutor-3223-thread-1) [ ] o.a.s.c.JmxMonitoredMap JMX monitoring is enabled. Adding Solr mbeans to JMX Server: com.sun.jmx.mbeanserver.JmxMBeanServer@276da511
[junit4] 2> 573048 INFO (coreLoadExecutor-3223-thread-1) [ ] o.a.s.c.CachingDirectoryFactory return new directory for /home/jenkins/workspace/Lucene-Solr-master-Linux/solr/build/solr-core/test/J0/temp/solr.cloud.ForceLeaderTest_5F181DCCB6CE386B-001/shard-1-001/cores/collection1/data/snapshot_metadata
[junit4] 2> 573048 INFO (coreLoadExecutor-3223-thread-1) [ ] o.a.s.c.s.SolrSnapshotMetaDataManager Loading from snapshot metadata file...
[junit4] 2> 573049 INFO (coreLoadExecutor-3223-thread-1) [ ] o.a.s.c.CachingDirectoryFactory return new directory for /home/jenkins/workspace/Lucene-Solr-master-Linux/solr/build/solr-core/test/J0/temp/solr.cloud.ForceLeaderTest_5F181DCCB6CE386B-001/shard-1-001/cores/collection1/data
[junit4] 2> 573049 INFO (coreLoadExecutor-3223-thread-1) [ ] o.a.s.c.SolrCore New index directory detected: old=null new=/home/jenkins/workspace/Lucene-Solr-master-Linux/solr/build/solr-core/test/J0/temp/solr.cloud.ForceLeaderTest_5F181DCCB6CE386B-001/shard-1-001/cores/collection1/data/index/
[junit4] 2> 573049 WARN (coreLoadExecutor-3223-thread-1) [ ] o.a.s.c.SolrCore [collection1] Solr index directory '/home/jenkins/workspace/Lucene-Solr-master-Linux/solr/build/solr-core/test/J0/temp/solr.cloud.ForceLeaderTest_5F181DCCB6CE386B-001/shard-1-001/cores/collection1/data/index' doesn't exist. Creating new index...
[junit4] 2> 573049 INFO (coreLoadExecutor-3223-thread-1) [ ] o.a.s.c.CachingDirectoryFactory return new directory for /home/jenkins/workspace/Lucene-Solr-master-Linux/solr/build/solr-core/test/J0/temp/solr.cloud.ForceLeaderTest_5F181DCCB6CE386B-001/shard-1-001/cores/collection1/data/index
[junit4] 2> 573049 INFO (coreLoadExecutor-3223-thread-1) [ ] o.a.s.u.RandomMergePolicy RandomMergePolicy wrapping class org.apache.lucene.index.LogByteSizeMergePolicy: [LogByteSizeMergePolicy: minMergeSize=1677721, mergeFactor=27, maxMergeSize=2147483648, maxMergeSizeForForcedMerge=9223372036854775807, calibrateSizeByDeletes=false, maxMergeDocs=2147483647, maxCFSSegmentSizeMB=8.796093022207999E12, noCFSRatio=0.4746775395041497]
[junit4] 2> 573049 INFO (coreLoad
[...truncated too long message...]
LIRNoLeader-seed#[5F181DCCB6CE386B]) [ ] o.a.s.c.SocketProxy Closing 0 connections to: http://127.0.0.1:42811/, target: http://127.0.0.1:35247/
[junit4] 2> 685843 WARN (TEST-ForceLeaderTest.testReplicasInLIRNoLeader-seed#[5F181DCCB6CE386B]) [ ] o.a.s.c.SocketProxy Closing 3 connections to: http://127.0.0.1:35092/, target: http://127.0.0.1:35044/
[junit4] 2> 685843 WARN (TEST-ForceLeaderTest.testReplicasInLIRNoLeader-seed#[5F181DCCB6CE386B]) [ ] o.a.s.c.SocketProxy Closing 0 connections to: http://127.0.0.1:43713/, target: http://127.0.0.1:42932/
[junit4] 2> 685844 WARN (TEST-ForceLeaderTest.testReplicasInLIRNoLeader-seed#[5F181DCCB6CE386B]) [ ] o.a.s.c.SocketProxy Closing 6 connections to: http://127.0.0.1:35602/, target: http://127.0.0.1:34663/
[junit4] 2> NOTE: reproduce with: ant test -Dtestcase=ForceLeaderTest -Dtests.method=testReplicasInLIRNoLeader -Dtests.seed=5F181DCCB6CE386B -Dtests.multiplier=3 -Dtests.slow=true -Dtests.locale=dsb -Dtests.timezone=Australia/Sydney -Dtests.asserts=true -Dtests.file.encoding=UTF-8
[junit4] ERROR 44.5s J0 | ForceLeaderTest.testReplicasInLIRNoLeader <<<
[junit4] > Throwable #1: org.apache.solr.client.solrj.impl.CloudSolrClient$RouteException: No live SolrServers available to handle this request:[http://127.0.0.1:43713/forceleader_test_collection_shard1_replica3]
[junit4] > at __randomizedtesting.SeedInfo.seed([5F181DCCB6CE386B:B98F290C8F4CC10A]:0)
[junit4] > at org.apache.solr.client.solrj.impl.CloudSolrClient.directUpdate(CloudSolrClient.java:760)
[junit4] > at org.apache.solr.client.solrj.impl.CloudSolrClient.sendRequest(CloudSolrClient.java:1172)
[junit4] > at org.apache.solr.client.solrj.impl.CloudSolrClient.requestWithRetryOnStaleState(CloudSolrClient.java:1061)
[junit4] > at org.apache.solr.client.solrj.impl.CloudSolrClient.request(CloudSolrClient.java:997)
[junit4] > at org.apache.solr.cloud.AbstractFullDistribZkTestBase.sendDocsWithRetry(AbstractFullDistribZkTestBase.java:753)
[junit4] > at org.apache.solr.cloud.AbstractFullDistribZkTestBase.sendDocsWithRetry(AbstractFullDistribZkTestBase.java:741)
[junit4] > at org.apache.solr.cloud.ForceLeaderTest.sendDoc(ForceLeaderTest.java:424)
[junit4] > at org.apache.solr.cloud.ForceLeaderTest.testReplicasInLIRNoLeader(ForceLeaderTest.java:131)
[junit4] > at jdk.internal.reflect.NativeMethodAccessorImpl.invoke0(java.base@9-ea/Native Method)
[junit4] > at jdk.internal.reflect.NativeMethodAccessorImpl.invoke(java.base@9-ea/NativeMethodAccessorImpl.java:62)
[junit4] > at jdk.internal.reflect.DelegatingMethodAccessorImpl.invoke(java.base@9-ea/DelegatingMethodAccessorImpl.java:43)
[junit4] > at org.apache.solr.BaseDistributedSearchTestCase$ShardsRepeatRule$ShardsFixedStatement.callStatement(BaseDistributedSearchTestCase.java:985)
[junit4] > at org.apache.solr.BaseDistributedSearchTestCase$ShardsRepeatRule$ShardsStatement.evaluate(BaseDistributedSearchTestCase.java:960)
[junit4] > at java.lang.Thread.run(java.base@9-ea/Thread.java:843)
[junit4] > Caused by: org.apache.solr.client.solrj.SolrServerException: No live SolrServers available to handle this request:[http://127.0.0.1:43713/forceleader_test_collection_shard1_replica3]
[junit4] > at org.apache.solr.client.solrj.impl.LBHttpSolrClient.request(LBHttpSolrClient.java:393)
[junit4] > at org.apache.solr.client.solrj.impl.CloudSolrClient.lambda$directUpdate$0(CloudSolrClient.java:735)
[junit4] > at java.util.concurrent.FutureTask.run(java.base@9-ea/FutureTask.java:264)
[junit4] > at org.apache.solr.common.util.ExecutorUtil$MDCAwareThreadPoolExecutor.lambda$execute$0(ExecutorUtil.java:229)
[junit4] > at java.util.concurrent.ThreadPoolExecutor.runWorker(java.base@9-ea/ThreadPoolExecutor.java:1158)
[junit4] > at java.util.concurrent.ThreadPoolExecutor$Worker.run(java.base@9-ea/ThreadPoolExecutor.java:632)
[junit4] > ... 1 more
[junit4] > Caused by: org.apache.solr.client.solrj.SolrServerException: Server refused connection at: http://127.0.0.1:43713/forceleader_test_collection_shard1_replica3
[junit4] > at org.apache.solr.client.solrj.impl.HttpSolrClient.executeMethod(HttpSolrClient.java:615)
[junit4] > at org.apache.solr.client.solrj.impl.HttpSolrClient.request(HttpSolrClient.java:261)
[junit4] > at org.apache.solr.client.solrj.impl.HttpSolrClient.request(HttpSolrClient.java:250)
[junit4] > at org.apache.solr.client.solrj.impl.LBHttpSolrClient.doRequest(LBHttpSolrClient.java:413)
[junit4] > at org.apache.solr.client.solrj.impl.LBHttpSolrClient.request(LBHttpSolrClient.java:382)
[junit4] > ... 6 more
[junit4] > Caused by: org.apache.http.conn.HttpHostConnectException: Connect to 127.0.0.1:43713 [/127.0.0.1] failed: Connection refused
[junit4] > at org.apache.http.impl.conn.DefaultHttpClientConnectionOperator.connect(DefaultHttpClientConnectionOperator.java:151)
[junit4] > at org.apache.http.impl.conn.PoolingHttpClientConnectionManager.connect(PoolingHttpClientConnectionManager.java:353)
[junit4] > at org.apache.http.impl.execchain.MainClientExec.establishRoute(MainClientExec.java:380)
[junit4] > at org.apache.http.impl.execchain.MainClientExec.execute(MainClientExec.java:236)
[junit4] > at org.apache.http.impl.execchain.ProtocolExec.execute(ProtocolExec.java:184)
[junit4] > at org.apache.http.impl.execchain.RetryExec.execute(RetryExec.java:88)
[junit4] > at org.apache.http.impl.execchain.RedirectExec.execute(RedirectExec.java:110)
[junit4] > at org.apache.http.impl.client.InternalHttpClient.doExecute(InternalHttpClient.java:184)
[junit4] > at org.apache.http.impl.client.CloseableHttpClient.execute(CloseableHttpClient.java:82)
[junit4] > at org.apache.http.impl.client.CloseableHttpClient.execute(CloseableHttpClient.java:55)
[junit4] > at org.apache.solr.client.solrj.impl.HttpSolrClient.executeMethod(HttpSolrClient.java:513)
[junit4] > ... 10 more
[junit4] > Caused by: java.net.ConnectException: Connection refused
[junit4] > at java.net.PlainSocketImpl.socketConnect(java.base@9-ea/Native Method)
[junit4] > at java.net.AbstractPlainSocketImpl.doConnect(java.base@9-ea/AbstractPlainSocketImpl.java:400)
[junit4] > at java.net.AbstractPlainSocketImpl.connectToAddress(java.base@9-ea/AbstractPlainSocketImpl.java:243)
[junit4] > at java.net.AbstractPlainSocketImpl.connect(java.base@9-ea/AbstractPlainSocketImpl.java:225)
[junit4] > at java.net.SocksSocketImpl.connect(java.base@9-ea/SocksSocketImpl.java:402)
[junit4] > at java.net.Socket.connect(java.base@9-ea/Socket.java:591)
[junit4] > at org.apache.http.conn.socket.PlainConnectionSocketFactory.connectSocket(PlainConnectionSocketFactory.java:74)
[junit4] > at org.apache.http.impl.conn.DefaultHttpClientConnectionOperator.connect(DefaultHttpClientConnectionOperator.java:134)
[junit4] > ... 20 more
[junit4] 2> 685846 INFO (SUITE-ForceLeaderTest-seed#[5F181DCCB6CE386B]-worker) [ ] o.a.s.SolrTestCaseJ4 ###deleteCore
[junit4] 2> NOTE: leaving temporary files on disk at: /home/jenkins/workspace/Lucene-Solr-master-Linux/solr/build/solr-core/test/J0/temp/solr.cloud.ForceLeaderTest_5F181DCCB6CE386B-001
[junit4] 2> Aug 07, 2016 10:58:12 AM com.carrotsearch.randomizedtesting.ThreadLeakControl checkThreadLeaks
[junit4] 2> WARNING: Will linger awaiting termination of 1 leaked thread(s).
[junit4] 2> NOTE: test params are: codec=Asserting(Lucene62), sim=ClassicSimilarity, locale=dsb, timezone=Australia/Sydney
[junit4] 2> NOTE: Linux 4.4.0-31-generic amd64/Oracle Corporation 9-ea (64-bit)/cpus=12,threads=1,free=299256880,total=520093696
[junit4] 2> NOTE: All tests run in this JVM: [TestOmitPositions, TestBinaryField, TestRawResponseWriter, CloudExitableDirectoryReaderTest, ExplicitHLLTest, TestCloudInspectUtil, TestArbitraryIndexDir, SyncSliceTest, TestLazyCores, DistributedFacetPivotSmallAdvancedTest, TestTolerantUpdateProcessorRandomCloud, TestSchemaVersionResource, TestRandomDVFaceting, TestStressLucene, FileBasedSpellCheckerTest, TestCrossCoreJoin, DistributedExpandComponentTest, TestSolrConfigHandlerCloud, HdfsTlogReplayBufferedWhileIndexingTest, TestAddFieldRealTimeGet, XsltUpdateRequestHandlerTest, TestReplicaProperties, DistributedQueryComponentCustomSortTest, OutputWriterTest, TestFaceting, SynonymTokenizerTest, EnumFieldTest, TestConfigSetsAPIZkFailure, UUIDFieldTest, AsyncCallRequestStatusResponseTest, SecurityConfHandlerTest, HdfsChaosMonkeyNothingIsSafeTest, BlockJoinFacetRandomTest, CdcrReplicationDistributedZkTest, TestCloudManagedSchema, TestCSVLoader, ConnectionReuseTest, HighlighterMaxOffsetTest, PrimUtilsTest, TestComplexPhraseQParserPlugin, TestDFISimilarityFactory, TestRandomFlRTGCloud, TestConfigSetProperties, MergeStrategyTest, BufferStoreTest, TestDynamicFieldCollectionResource, ResourceLoaderTest, ChangedSchemaMergeTest, CachingDirectoryFactoryTest, TestFieldCacheSanityChecker, LeaderElectionIntegrationTest, OverseerStatusTest, ExitableDirectoryReaderTest, RulesTest, PathHierarchyTokenizerFactoryTest, SignatureUpdateProcessorFactoryTest, HdfsNNFailoverTest, TestConfig, BigEndianAscendingWordDeserializerTest, TestSchemaManager, QueryEqualityTest, TestIBSimilarityFactory, TestValueSourceCache, RequiredFieldsTest, TestBlendedInfixSuggestions, CloudMLTQParserTest, ConcurrentDeleteAndCreateCollectionTest, ExternalFileFieldSortTest, TestRemoteStreaming, TestCollectionAPI, RollingRestartTest, TestImplicitCoreProperties, AtomicUpdatesTest, DocumentAnalysisRequestHandlerTest, SuggestComponentTest, DistribJoinFromCollectionTest, TestBadConfig, SOLR749Test, ForceLeaderTest]
[junit4] Completed [171/626 (1!)] on J0 in 115.96s, 3 tests, 1 error, 1 skipped <<< FAILURES!
[...truncated 51111 lines...]
[JENKINS] Lucene-Solr-master-Linux (32bit/jdk1.8.0_102) - Build #
17491 - Failure!
Posted by Policeman Jenkins Server <je...@thetaphi.de>.
Build: http://jenkins.thetaphi.de/job/Lucene-Solr-master-Linux/17491/
Java: 32bit/jdk1.8.0_102 -client -XX:+UseParallelGC
2 tests failed.
FAILED: org.apache.solr.cloud.TestTolerantUpdateProcessorCloud.testVariousAddsViaShard1LeaderClient
Error Message:
Error from server at https://127.0.0.1:35113/solr/test_col: Cannot talk to ZooKeeper - Updates are disabled.
Stack Trace:
org.apache.solr.client.solrj.impl.HttpSolrClient$RemoteSolrException: Error from server at https://127.0.0.1:35113/solr/test_col: Cannot talk to ZooKeeper - Updates are disabled.
at org.apache.solr.client.solrj.impl.HttpSolrClient.executeMethod(HttpSolrClient.java:608)
at org.apache.solr.client.solrj.impl.HttpSolrClient.request(HttpSolrClient.java:261)
at org.apache.solr.client.solrj.impl.HttpSolrClient.request(HttpSolrClient.java:250)
at org.apache.solr.client.solrj.SolrRequest.process(SolrRequest.java:149)
at org.apache.solr.client.solrj.SolrClient.commit(SolrClient.java:484)
at org.apache.solr.client.solrj.SolrClient.commit(SolrClient.java:463)
at org.apache.solr.cloud.TestTolerantUpdateProcessorCloud.testVariousAdds(TestTolerantUpdateProcessorCloud.java:609)
at org.apache.solr.cloud.TestTolerantUpdateProcessorCloud.testVariousAddsViaShard1LeaderClient(TestTolerantUpdateProcessorCloud.java:399)
at sun.reflect.NativeMethodAccessorImpl.invoke0(Native Method)
at sun.reflect.NativeMethodAccessorImpl.invoke(NativeMethodAccessorImpl.java:62)
at sun.reflect.DelegatingMethodAccessorImpl.invoke(DelegatingMethodAccessorImpl.java:43)
at java.lang.reflect.Method.invoke(Method.java:498)
at com.carrotsearch.randomizedtesting.RandomizedRunner.invoke(RandomizedRunner.java:1764)
at com.carrotsearch.randomizedtesting.RandomizedRunner$8.evaluate(RandomizedRunner.java:871)
at com.carrotsearch.randomizedtesting.RandomizedRunner$9.evaluate(RandomizedRunner.java:907)
at com.carrotsearch.randomizedtesting.RandomizedRunner$10.evaluate(RandomizedRunner.java:921)
at com.carrotsearch.randomizedtesting.rules.SystemPropertiesRestoreRule$1.evaluate(SystemPropertiesRestoreRule.java:57)
at org.apache.lucene.util.TestRuleSetupTeardownChained$1.evaluate(TestRuleSetupTeardownChained.java:49)
at org.apache.lucene.util.AbstractBeforeAfterRule$1.evaluate(AbstractBeforeAfterRule.java:45)
at org.apache.lucene.util.TestRuleThreadAndTestName$1.evaluate(TestRuleThreadAndTestName.java:48)
at org.apache.lucene.util.TestRuleIgnoreAfterMaxFailures$1.evaluate(TestRuleIgnoreAfterMaxFailures.java:64)
at org.apache.lucene.util.TestRuleMarkFailure$1.evaluate(TestRuleMarkFailure.java:47)
at com.carrotsearch.randomizedtesting.rules.StatementAdapter.evaluate(StatementAdapter.java:36)
at com.carrotsearch.randomizedtesting.ThreadLeakControl$StatementRunner.run(ThreadLeakControl.java:367)
at com.carrotsearch.randomizedtesting.ThreadLeakControl.forkTimeoutingTask(ThreadLeakControl.java:809)
at com.carrotsearch.randomizedtesting.ThreadLeakControl$3.evaluate(ThreadLeakControl.java:460)
at com.carrotsearch.randomizedtesting.RandomizedRunner.runSingleTest(RandomizedRunner.java:880)
at com.carrotsearch.randomizedtesting.RandomizedRunner$5.evaluate(RandomizedRunner.java:781)
at com.carrotsearch.randomizedtesting.RandomizedRunner$6.evaluate(RandomizedRunner.java:816)
at com.carrotsearch.randomizedtesting.RandomizedRunner$7.evaluate(RandomizedRunner.java:827)
at com.carrotsearch.randomizedtesting.rules.StatementAdapter.evaluate(StatementAdapter.java:36)
at com.carrotsearch.randomizedtesting.rules.SystemPropertiesRestoreRule$1.evaluate(SystemPropertiesRestoreRule.java:57)
at org.apache.lucene.util.AbstractBeforeAfterRule$1.evaluate(AbstractBeforeAfterRule.java:45)
at com.carrotsearch.randomizedtesting.rules.StatementAdapter.evaluate(StatementAdapter.java:36)
at org.apache.lucene.util.TestRuleStoreClassName$1.evaluate(TestRuleStoreClassName.java:41)
at com.carrotsearch.randomizedtesting.rules.NoShadowingOrOverridesOnMethodsRule$1.evaluate(NoShadowingOrOverridesOnMethodsRule.java:40)
at com.carrotsearch.randomizedtesting.rules.NoShadowingOrOverridesOnMethodsRule$1.evaluate(NoShadowingOrOverridesOnMethodsRule.java:40)
at com.carrotsearch.randomizedtesting.rules.StatementAdapter.evaluate(StatementAdapter.java:36)
at com.carrotsearch.randomizedtesting.rules.StatementAdapter.evaluate(StatementAdapter.java:36)
at com.carrotsearch.randomizedtesting.rules.StatementAdapter.evaluate(StatementAdapter.java:36)
at org.apache.lucene.util.TestRuleAssertionsRequired$1.evaluate(TestRuleAssertionsRequired.java:53)
at org.apache.lucene.util.TestRuleMarkFailure$1.evaluate(TestRuleMarkFailure.java:47)
at org.apache.lucene.util.TestRuleIgnoreAfterMaxFailures$1.evaluate(TestRuleIgnoreAfterMaxFailures.java:64)
at org.apache.lucene.util.TestRuleIgnoreTestSuites$1.evaluate(TestRuleIgnoreTestSuites.java:54)
at com.carrotsearch.randomizedtesting.rules.StatementAdapter.evaluate(StatementAdapter.java:36)
at com.carrotsearch.randomizedtesting.ThreadLeakControl$StatementRunner.run(ThreadLeakControl.java:367)
at java.lang.Thread.run(Thread.java:745)
FAILED: org.apache.solr.handler.component.DistributedFacetPivotLongTailTest.test
Error Message:
IOException occured when talking to server at: https://127.0.0.1:38493//collection1
Stack Trace:
org.apache.solr.client.solrj.SolrServerException: IOException occured when talking to server at: https://127.0.0.1:38493//collection1
at __randomizedtesting.SeedInfo.seed([E8FD3A80180D004F:60A9055AB6F16DB7]:0)
at org.apache.solr.client.solrj.impl.HttpSolrClient.executeMethod(HttpSolrClient.java:622)
at org.apache.solr.client.solrj.impl.HttpSolrClient.request(HttpSolrClient.java:261)
at org.apache.solr.client.solrj.impl.HttpSolrClient.request(HttpSolrClient.java:250)
at org.apache.solr.client.solrj.SolrRequest.process(SolrRequest.java:149)
at org.apache.solr.client.solrj.SolrClient.add(SolrClient.java:173)
at org.apache.solr.client.solrj.SolrClient.add(SolrClient.java:138)
at org.apache.solr.client.solrj.SolrClient.add(SolrClient.java:152)
at org.apache.solr.handler.component.DistributedFacetPivotLongTailTest.test(DistributedFacetPivotLongTailTest.java:87)
at sun.reflect.NativeMethodAccessorImpl.invoke0(Native Method)
at sun.reflect.NativeMethodAccessorImpl.invoke(NativeMethodAccessorImpl.java:62)
at sun.reflect.DelegatingMethodAccessorImpl.invoke(DelegatingMethodAccessorImpl.java:43)
at java.lang.reflect.Method.invoke(Method.java:498)
at com.carrotsearch.randomizedtesting.RandomizedRunner.invoke(RandomizedRunner.java:1764)
at com.carrotsearch.randomizedtesting.RandomizedRunner$8.evaluate(RandomizedRunner.java:871)
at com.carrotsearch.randomizedtesting.RandomizedRunner$9.evaluate(RandomizedRunner.java:907)
at com.carrotsearch.randomizedtesting.RandomizedRunner$10.evaluate(RandomizedRunner.java:921)
at org.apache.solr.BaseDistributedSearchTestCase$ShardsRepeatRule$ShardsFixedStatement.callStatement(BaseDistributedSearchTestCase.java:985)
at org.apache.solr.BaseDistributedSearchTestCase$ShardsRepeatRule$ShardsStatement.evaluate(BaseDistributedSearchTestCase.java:960)
at com.carrotsearch.randomizedtesting.rules.SystemPropertiesRestoreRule$1.evaluate(SystemPropertiesRestoreRule.java:57)
at org.apache.lucene.util.TestRuleSetupTeardownChained$1.evaluate(TestRuleSetupTeardownChained.java:49)
at org.apache.lucene.util.AbstractBeforeAfterRule$1.evaluate(AbstractBeforeAfterRule.java:45)
at org.apache.lucene.util.TestRuleThreadAndTestName$1.evaluate(TestRuleThreadAndTestName.java:48)
at org.apache.lucene.util.TestRuleIgnoreAfterMaxFailures$1.evaluate(TestRuleIgnoreAfterMaxFailures.java:64)
at org.apache.lucene.util.TestRuleMarkFailure$1.evaluate(TestRuleMarkFailure.java:47)
at com.carrotsearch.randomizedtesting.rules.StatementAdapter.evaluate(StatementAdapter.java:36)
at com.carrotsearch.randomizedtesting.ThreadLeakControl$StatementRunner.run(ThreadLeakControl.java:367)
at com.carrotsearch.randomizedtesting.ThreadLeakControl.forkTimeoutingTask(ThreadLeakControl.java:809)
at com.carrotsearch.randomizedtesting.ThreadLeakControl$3.evaluate(ThreadLeakControl.java:460)
at com.carrotsearch.randomizedtesting.RandomizedRunner.runSingleTest(RandomizedRunner.java:880)
at com.carrotsearch.randomizedtesting.RandomizedRunner$5.evaluate(RandomizedRunner.java:781)
at com.carrotsearch.randomizedtesting.RandomizedRunner$6.evaluate(RandomizedRunner.java:816)
at com.carrotsearch.randomizedtesting.RandomizedRunner$7.evaluate(RandomizedRunner.java:827)
at com.carrotsearch.randomizedtesting.rules.StatementAdapter.evaluate(StatementAdapter.java:36)
at com.carrotsearch.randomizedtesting.rules.SystemPropertiesRestoreRule$1.evaluate(SystemPropertiesRestoreRule.java:57)
at org.apache.lucene.util.AbstractBeforeAfterRule$1.evaluate(AbstractBeforeAfterRule.java:45)
at com.carrotsearch.randomizedtesting.rules.StatementAdapter.evaluate(StatementAdapter.java:36)
at org.apache.lucene.util.TestRuleStoreClassName$1.evaluate(TestRuleStoreClassName.java:41)
at com.carrotsearch.randomizedtesting.rules.NoShadowingOrOverridesOnMethodsRule$1.evaluate(NoShadowingOrOverridesOnMethodsRule.java:40)
at com.carrotsearch.randomizedtesting.rules.NoShadowingOrOverridesOnMethodsRule$1.evaluate(NoShadowingOrOverridesOnMethodsRule.java:40)
at com.carrotsearch.randomizedtesting.rules.StatementAdapter.evaluate(StatementAdapter.java:36)
at com.carrotsearch.randomizedtesting.rules.StatementAdapter.evaluate(StatementAdapter.java:36)
at com.carrotsearch.randomizedtesting.rules.StatementAdapter.evaluate(StatementAdapter.java:36)
at org.apache.lucene.util.TestRuleAssertionsRequired$1.evaluate(TestRuleAssertionsRequired.java:53)
at org.apache.lucene.util.TestRuleMarkFailure$1.evaluate(TestRuleMarkFailure.java:47)
at org.apache.lucene.util.TestRuleIgnoreAfterMaxFailures$1.evaluate(TestRuleIgnoreAfterMaxFailures.java:64)
at org.apache.lucene.util.TestRuleIgnoreTestSuites$1.evaluate(TestRuleIgnoreTestSuites.java:54)
at com.carrotsearch.randomizedtesting.rules.StatementAdapter.evaluate(StatementAdapter.java:36)
at com.carrotsearch.randomizedtesting.ThreadLeakControl$StatementRunner.run(ThreadLeakControl.java:367)
at java.lang.Thread.run(Thread.java:745)
Caused by: javax.net.ssl.SSLHandshakeException: Remote host closed connection during handshake
at sun.security.ssl.SSLSocketImpl.readRecord(SSLSocketImpl.java:992)
at sun.security.ssl.SSLSocketImpl.performInitialHandshake(SSLSocketImpl.java:1375)
at sun.security.ssl.SSLSocketImpl.startHandshake(SSLSocketImpl.java:1403)
at sun.security.ssl.SSLSocketImpl.startHandshake(SSLSocketImpl.java:1387)
at org.apache.http.conn.ssl.SSLConnectionSocketFactory.createLayeredSocket(SSLConnectionSocketFactory.java:394)
at org.apache.http.conn.ssl.SSLConnectionSocketFactory.connectSocket(SSLConnectionSocketFactory.java:353)
at org.apache.http.impl.conn.DefaultHttpClientConnectionOperator.connect(DefaultHttpClientConnectionOperator.java:134)
at org.apache.http.impl.conn.PoolingHttpClientConnectionManager.connect(PoolingHttpClientConnectionManager.java:353)
at org.apache.http.impl.execchain.MainClientExec.establishRoute(MainClientExec.java:380)
at org.apache.http.impl.execchain.MainClientExec.execute(MainClientExec.java:236)
at org.apache.http.impl.execchain.ProtocolExec.execute(ProtocolExec.java:184)
at org.apache.http.impl.execchain.RetryExec.execute(RetryExec.java:88)
at org.apache.http.impl.execchain.RedirectExec.execute(RedirectExec.java:110)
at org.apache.http.impl.client.InternalHttpClient.doExecute(InternalHttpClient.java:184)
at org.apache.http.impl.client.CloseableHttpClient.execute(CloseableHttpClient.java:82)
at org.apache.http.impl.client.CloseableHttpClient.execute(CloseableHttpClient.java:55)
at org.apache.solr.client.solrj.impl.HttpSolrClient.executeMethod(HttpSolrClient.java:513)
... 48 more
Caused by: java.io.EOFException: SSL peer shut down incorrectly
at sun.security.ssl.InputRecord.read(InputRecord.java:505)
at sun.security.ssl.SSLSocketImpl.readRecord(SSLSocketImpl.java:973)
... 64 more
Build Log:
[...truncated 11043 lines...]
[junit4] Suite: org.apache.solr.handler.component.DistributedFacetPivotLongTailTest
[junit4] 2> Creating dataDir: /home/jenkins/workspace/Lucene-Solr-master-Linux/solr/build/solr-core/test/J2/temp/solr.handler.component.DistributedFacetPivotLongTailTest_E8FD3A80180D004F-001/init-core-data-001
[junit4] 2> 478078 INFO (SUITE-DistributedFacetPivotLongTailTest-seed#[E8FD3A80180D004F]-worker) [ ] o.a.s.SolrTestCaseJ4 Randomized ssl (true) and clientAuth (true) via: @org.apache.solr.util.RandomizeSSL(reason=, ssl=NaN, value=NaN, clientAuth=NaN)
[junit4] 2> 478079 INFO (SUITE-DistributedFacetPivotLongTailTest-seed#[E8FD3A80180D004F]-worker) [ ] o.a.s.BaseDistributedSearchTestCase Setting hostContext system property: /
[junit4] 2> 478144 INFO (TEST-DistributedFacetPivotLongTailTest.test-seed#[E8FD3A80180D004F]) [ ] o.a.s.SolrTestCaseJ4 Writing core.properties file to /home/jenkins/workspace/Lucene-Solr-master-Linux/solr/build/solr-core/test/J2/temp/solr.handler.component.DistributedFacetPivotLongTailTest_E8FD3A80180D004F-001/tempDir-001/control/cores/collection1
[junit4] 2> 478146 INFO (TEST-DistributedFacetPivotLongTailTest.test-seed#[E8FD3A80180D004F]) [ ] o.e.j.s.Server jetty-9.3.8.v20160314
[junit4] 2> 478148 INFO (TEST-DistributedFacetPivotLongTailTest.test-seed#[E8FD3A80180D004F]) [ ] o.e.j.s.h.ContextHandler Started o.e.j.s.ServletContextHandler@1e243b7{/,null,AVAILABLE}
[junit4] 2> 478151 INFO (TEST-DistributedFacetPivotLongTailTest.test-seed#[E8FD3A80180D004F]) [ ] o.e.j.s.ServerConnector Started ServerConnector@d4e2db{SSL,[ssl, http/1.1]}{127.0.0.1:33827}
[junit4] 2> 478151 INFO (TEST-DistributedFacetPivotLongTailTest.test-seed#[E8FD3A80180D004F]) [ ] o.e.j.s.Server Started @479406ms
[junit4] 2> 478151 INFO (TEST-DistributedFacetPivotLongTailTest.test-seed#[E8FD3A80180D004F]) [ ] o.a.s.c.s.e.JettySolrRunner Jetty properties: {hostContext=/, hostPort=33827, coreRootDirectory=/home/jenkins/workspace/Lucene-Solr-master-Linux/solr/build/solr-core/test/J2/temp/solr.handler.component.DistributedFacetPivotLongTailTest_E8FD3A80180D004F-001/tempDir-001/control/cores}
[junit4] 2> 478151 INFO (TEST-DistributedFacetPivotLongTailTest.test-seed#[E8FD3A80180D004F]) [ ] o.a.s.s.SolrDispatchFilter SolrDispatchFilter.init(): sun.misc.Launcher$AppClassLoader@1d16e93
[junit4] 2> 478151 INFO (TEST-DistributedFacetPivotLongTailTest.test-seed#[E8FD3A80180D004F]) [ ] o.a.s.c.SolrResourceLoader new SolrResourceLoader for directory: '/home/jenkins/workspace/Lucene-Solr-master-Linux/solr/build/solr-core/test/J2/temp/solr.handler.component.DistributedFacetPivotLongTailTest_E8FD3A80180D004F-001/tempDir-001/control'
[junit4] 2> 478152 INFO (TEST-DistributedFacetPivotLongTailTest.test-seed#[E8FD3A80180D004F]) [ ] o.a.s.c.SolrResourceLoader JNDI not configured for solr (NoInitialContextEx)
[junit4] 2> 478152 INFO (TEST-DistributedFacetPivotLongTailTest.test-seed#[E8FD3A80180D004F]) [ ] o.a.s.c.SolrResourceLoader solr home defaulted to 'solr/' (could not find system property or JNDI)
[junit4] 2> 478152 INFO (TEST-DistributedFacetPivotLongTailTest.test-seed#[E8FD3A80180D004F]) [ ] o.a.s.c.SolrXmlConfig Loading container configuration from /home/jenkins/workspace/Lucene-Solr-master-Linux/solr/build/solr-core/test/J2/temp/solr.handler.component.DistributedFacetPivotLongTailTest_E8FD3A80180D004F-001/tempDir-001/control/solr.xml
[junit4] 2> 478158 INFO (TEST-DistributedFacetPivotLongTailTest.test-seed#[E8FD3A80180D004F]) [ ] o.a.s.c.CorePropertiesLocator Config-defined core root directory: /home/jenkins/workspace/Lucene-Solr-master-Linux/solr/build/solr-core/test/J2/temp/solr.handler.component.DistributedFacetPivotLongTailTest_E8FD3A80180D004F-001/tempDir-001/control/cores
[junit4] 2> 478158 INFO (TEST-DistributedFacetPivotLongTailTest.test-seed#[E8FD3A80180D004F]) [ ] o.a.s.c.CoreContainer New CoreContainer 15421369
[junit4] 2> 478158 INFO (TEST-DistributedFacetPivotLongTailTest.test-seed#[E8FD3A80180D004F]) [ ] o.a.s.c.CoreContainer Loading cores into CoreContainer [instanceDir=/home/jenkins/workspace/Lucene-Solr-master-Linux/solr/build/solr-core/test/J2/temp/solr.handler.component.DistributedFacetPivotLongTailTest_E8FD3A80180D004F-001/tempDir-001/control]
[junit4] 2> 478158 WARN (TEST-DistributedFacetPivotLongTailTest.test-seed#[E8FD3A80180D004F]) [ ] o.a.s.c.CoreContainer Couldn't add files from /home/jenkins/workspace/Lucene-Solr-master-Linux/solr/build/solr-core/test/J2/temp/solr.handler.component.DistributedFacetPivotLongTailTest_E8FD3A80180D004F-001/tempDir-001/control/lib to classpath: /home/jenkins/workspace/Lucene-Solr-master-Linux/solr/build/solr-core/test/J2/temp/solr.handler.component.DistributedFacetPivotLongTailTest_E8FD3A80180D004F-001/tempDir-001/control/lib
[junit4] 2> 478159 INFO (TEST-DistributedFacetPivotLongTailTest.test-seed#[E8FD3A80180D004F]) [ ] o.a.s.h.c.HttpShardHandlerFactory created with socketTimeout : 90000,urlScheme : https,connTimeout : 15000,maxConnectionsPerHost : 20,maxConnections : 10000,corePoolSize : 0,maximumPoolSize : 2147483647,maxThreadIdleTime : 5,sizeOfQueue : -1,fairnessPolicy : false,
[junit4] 2> 478161 INFO (TEST-DistributedFacetPivotLongTailTest.test-seed#[E8FD3A80180D004F]) [ ] o.a.s.u.UpdateShardHandler Created UpdateShardHandler HTTP client with params: socketTimeout=340000&connTimeout=45000&maxConnections=100000&maxConnectionsPerHost=100000
[junit4] 2> 478161 INFO (TEST-DistributedFacetPivotLongTailTest.test-seed#[E8FD3A80180D004F]) [ ] o.a.s.l.LogWatcher SLF4J impl is org.slf4j.impl.Log4jLoggerFactory
[junit4] 2> 478161 INFO (TEST-DistributedFacetPivotLongTailTest.test-seed#[E8FD3A80180D004F]) [ ] o.a.s.l.LogWatcher Registering Log Listener [Log4j (org.slf4j.impl.Log4jLoggerFactory)]
[junit4] 2> 478161 INFO (TEST-DistributedFacetPivotLongTailTest.test-seed#[E8FD3A80180D004F]) [ ] o.a.s.c.CoreContainer Security conf doesn't exist. Skipping setup for authorization module.
[junit4] 2> 478161 INFO (TEST-DistributedFacetPivotLongTailTest.test-seed#[E8FD3A80180D004F]) [ ] o.a.s.c.CoreContainer No authentication plugin used.
[junit4] 2> 478161 INFO (TEST-DistributedFacetPivotLongTailTest.test-seed#[E8FD3A80180D004F]) [ ] o.a.s.c.CorePropertiesLocator Looking for core definitions underneath /home/jenkins/workspace/Lucene-Solr-master-Linux/solr/build/solr-core/test/J2/temp/solr.handler.component.DistributedFacetPivotLongTailTest_E8FD3A80180D004F-001/tempDir-001/control/cores
[junit4] 2> 478162 INFO (TEST-DistributedFacetPivotLongTailTest.test-seed#[E8FD3A80180D004F]) [ ] o.a.s.c.CoreDescriptor Created CoreDescriptor: {name=collection1, config=solrconfig.xml, loadOnStartup=true, schema=schema.xml, configSetProperties=configsetprops.json, transient=false, dataDir=data/, configSet=collection1}
[junit4] 2> 478162 INFO (TEST-DistributedFacetPivotLongTailTest.test-seed#[E8FD3A80180D004F]) [ ] o.a.s.c.CorePropertiesLocator Found core collection1 in /home/jenkins/workspace/Lucene-Solr-master-Linux/solr/build/solr-core/test/J2/temp/solr.handler.component.DistributedFacetPivotLongTailTest_E8FD3A80180D004F-001/tempDir-001/control/cores/collection1
[junit4] 2> 478162 INFO (TEST-DistributedFacetPivotLongTailTest.test-seed#[E8FD3A80180D004F]) [ ] o.a.s.c.CorePropertiesLocator Found 1 core definitions
[junit4] 2> 478163 INFO (TEST-DistributedFacetPivotLongTailTest.test-seed#[E8FD3A80180D004F]) [ ] o.a.s.s.SolrDispatchFilter user.dir=/home/jenkins/workspace/Lucene-Solr-master-Linux/solr/build/solr-core/test/J2
[junit4] 2> 478163 INFO (coreLoadExecutor-1682-thread-1) [ ] o.a.s.c.SolrResourceLoader new SolrResourceLoader for directory: '/home/jenkins/workspace/Lucene-Solr-master-Linux/solr/core/src/test-files/solr/collection1'
[junit4] 2> 478163 INFO (TEST-DistributedFacetPivotLongTailTest.test-seed#[E8FD3A80180D004F]) [ ] o.a.s.s.SolrDispatchFilter SolrDispatchFilter.init() done
[junit4] 2> 478163 INFO (coreLoadExecutor-1682-thread-1) [ ] o.a.s.c.SolrResourceLoader JNDI not configured for solr (NoInitialContextEx)
[junit4] 2> 478163 INFO (coreLoadExecutor-1682-thread-1) [ ] o.a.s.c.SolrResourceLoader solr home defaulted to 'solr/' (could not find system property or JNDI)
[junit4] 2> 478163 INFO (coreLoadExecutor-1682-thread-1) [ ] o.a.s.c.SolrResourceLoader Adding 'file:/home/jenkins/workspace/Lucene-Solr-master-Linux/solr/core/src/test-files/solr/collection1/lib/classes/' to classloader
[junit4] 2> 478163 INFO (coreLoadExecutor-1682-thread-1) [ ] o.a.s.c.SolrResourceLoader Adding 'file:/home/jenkins/workspace/Lucene-Solr-master-Linux/solr/core/src/test-files/solr/collection1/lib/README' to classloader
[junit4] 2> 478186 INFO (coreLoadExecutor-1682-thread-1) [ ] o.a.s.c.SolrConfig current version of requestparams : -1
[junit4] 2> 478203 INFO (coreLoadExecutor-1682-thread-1) [ ] o.a.s.c.SolrConfig Using Lucene MatchVersion: 7.0.0
[junit4] 2> 478224 INFO (coreLoadExecutor-1682-thread-1) [ ] o.a.s.c.SolrConfig Loaded SolrConfig: solrconfig.xml
[junit4] 2> 478234 INFO (coreLoadExecutor-1682-thread-1) [ ] o.a.s.s.IndexSchema [collection1] Schema name=test
[junit4] 2> 478316 INFO (coreLoadExecutor-1682-thread-1) [ ] o.a.s.s.OpenExchangeRatesOrgProvider Initialized with rates=open-exchange-rates.json, refreshInterval=1440.
[junit4] 2> 478322 INFO (coreLoadExecutor-1682-thread-1) [ ] o.a.s.s.IndexSchema default search field in schema is text
[junit4] 2> 478323 INFO (coreLoadExecutor-1682-thread-1) [ ] o.a.s.s.IndexSchema unique key field: id
[junit4] 2> 478329 INFO (coreLoadExecutor-1682-thread-1) [ ] o.a.s.s.FileExchangeRateProvider Reloading exchange rates from file currency.xml
[junit4] 2> 478330 INFO (coreLoadExecutor-1682-thread-1) [ ] o.a.s.s.FileExchangeRateProvider Reloading exchange rates from file currency.xml
[junit4] 2> 478332 INFO (coreLoadExecutor-1682-thread-1) [ ] o.a.s.s.OpenExchangeRatesOrgProvider Reloading exchange rates from open-exchange-rates.json
[junit4] 2> 478332 INFO (coreLoadExecutor-1682-thread-1) [ ] o.a.s.s.OpenExchangeRatesOrgProvider Reloading exchange rates from open-exchange-rates.json
[junit4] 2> 478333 INFO (coreLoadExecutor-1682-thread-1) [ ] o.a.s.c.ConfigSetProperties Did not find ConfigSet properties, assuming default properties: Can't find resource 'configsetprops.json' in classpath or '/home/jenkins/workspace/Lucene-Solr-master-Linux/solr/core/src/test-files/solr/collection1'
[junit4] 2> 478333 INFO (coreLoadExecutor-1682-thread-1) [ ] o.a.s.c.CoreContainer Creating SolrCore 'collection1' using configuration from configset /home/jenkins/workspace/Lucene-Solr-master-Linux/solr/core/src/test-files/solr/collection1
[junit4] 2> 478334 INFO (coreLoadExecutor-1682-thread-1) [ x:collection1] o.a.s.c.SolrCore org.apache.solr.core.MockDirectoryFactory
[junit4] 2> 478334 INFO (coreLoadExecutor-1682-thread-1) [ x:collection1] o.a.s.c.SolrCore [[collection1] ] Opening new SolrCore at [/home/jenkins/workspace/Lucene-Solr-master-Linux/solr/core/src/test-files/solr/collection1], dataDir=[/home/jenkins/workspace/Lucene-Solr-master-Linux/solr/build/solr-core/test/J2/temp/solr.handler.component.DistributedFacetPivotLongTailTest_E8FD3A80180D004F-001/tempDir-001/control/cores/collection1/data/]
[junit4] 2> 478334 INFO (coreLoadExecutor-1682-thread-1) [ x:collection1] o.a.s.c.JmxMonitoredMap JMX monitoring is enabled. Adding Solr mbeans to JMX Server: com.sun.jmx.mbeanserver.JmxMBeanServer@1acc5bf
[junit4] 2> 478335 INFO (coreLoadExecutor-1682-thread-1) [ x:collection1] o.a.s.c.CachingDirectoryFactory return new directory for /home/jenkins/workspace/Lucene-Solr-master-Linux/solr/build/solr-core/test/J2/temp/solr.handler.component.DistributedFacetPivotLongTailTest_E8FD3A80180D004F-001/tempDir-001/control/cores/collection1/data/snapshot_metadata
[junit4] 2> 478335 INFO (coreLoadExecutor-1682-thread-1) [ x:collection1] o.a.s.c.s.SolrSnapshotMetaDataManager Loading from snapshot metadata file...
[junit4] 2> 478335 INFO (coreLoadExecutor-1682-thread-1) [ x:collection1] o.a.s.c.CachingDirectoryFactory return new directory for /home/jenkins/workspace/Lucene-Solr-master-Linux/solr/build/solr-core/test/J2/temp/solr.handler.component.DistributedFacetPivotLongTailTest_E8FD3A80180D004F-001/tempDir-001/control/cores/collection1/data
[junit4] 2> 478335 INFO (coreLoadExecutor-1682-thread-1) [ x:collection1] o.a.s.c.SolrCore New index directory detected: old=null new=/home/jenkins/workspace/Lucene-Solr-master-Linux/solr/build/solr-core/test/J2/temp/solr.handler.component.DistributedFacetPivotLongTailTest_E8FD3A80180D004F-001/tempDir-001/control/cores/collection1/data/index/
[junit4] 2> 478335 WARN (coreLoadExecutor-1682-thread-1) [ x:collection1] o.a.s.c.SolrCore [collection1] Solr index directory '/home/jenkins/workspace/Lucene-Solr-master-Linux/solr/build/solr-core/test/J2/temp/solr.handler.component.DistributedFacetPivotLongTailTest_E8FD3A80180D004F-001/tempDir-001/control/cores/collection1/data/index' doesn't exist. Creating new index...
[junit4] 2> 478335 INFO (coreLoadExecutor-1682-thread-1) [ x:collection1] o.a.s.c.CachingDirectoryFactory return new directory for /home/jenkins/workspace/Lucene-Solr-master-Linux/solr/build/solr-core/test/J2/temp/solr.handler.component.DistributedFacetPivotLongTailTest_E8FD3A80180D004F-001/tempDir-001/control/cores/collection1/data/index
[junit4] 2> 478336 INFO (coreLoadExecutor-1682-thread-1) [ x:collection1] o.a.s.u.RandomMergePolicy RandomMergePolicy wrapping class org.apache.lucene.index.TieredMergePolicy: [TieredMergePolicy: maxMergeAtOnce=41, maxMergeAtOnceExplicit=49, maxMergedSegmentMB=7.21484375, floorSegmentMB=1.3212890625, forceMergeDeletesPctAllowed=18.331618052014555, segmentsPerTier=13.0, maxCFSSegmentSizeMB=8.796093022207999E12, noCFSRatio=0.0
[junit4] 2> 478336 INFO (coreLoadExecutor-1682-thread-1) [ x:collection1] o.a.s.c.SolrDeletionPolicy SolrDeletionPolicy.onCommit: commits: num=1
[junit4] 2> commit{dir=MockDirectoryWrapper(RAMDirectory@6e70e9 lockFactory=org.apache.lucene.store.SingleInstanceLockFactory@93fc6),segFN=segments_1,generation=1}
[junit4] 2> 478336 INFO (coreLoadExecutor-1682-thread-1) [ x:collection1] o.a.s.c.SolrDeletionPolicy newest commit generation = 1
[junit4] 2> 478337 INFO (OldIndexDirectoryCleanupThreadForCore-collection1) [ x:collection1] o.a.s.c.SolrCore Looking for old index directories to cleanup for core collection1 in /home/jenkins/workspace/Lucene-Solr-master-Linux/solr/build/solr-core/test/J2/temp/solr.handler.component.DistributedFacetPivotLongTailTest_E8FD3A80180D004F-001/tempDir-001/control/cores/collection1/data/
[junit4] 2> 478337 WARN (OldIndexDirectoryCleanupThreadForCore-collection1) [ x:collection1] o.a.s.c.DirectoryFactory /home/jenkins/workspace/Lucene-Solr-master-Linux/solr/build/solr-core/test/J2/temp/solr.handler.component.DistributedFacetPivotLongTailTest_E8FD3A80180D004F-001/tempDir-001/control/cores/collection1/data/ does not point to a valid data directory; skipping clean-up of old index directories.
[junit4] 2> 478343 INFO (coreLoadExecutor-1682-thread-1) [ x:collection1] o.a.s.u.p.UpdateRequestProcessorChain creating updateRequestProcessorChain "dedupe"
[junit4] 2> 478343 INFO (coreLoadExecutor-1682-thread-1) [ x:collection1] o.a.s.u.p.UpdateRequestProcessorChain inserting DistributedUpdateProcessorFactory into updateRequestProcessorChain "dedupe"
[junit4] 2> 478343 INFO (coreLoadExecutor-1682-thread-1) [ x:collection1] o.a.s.u.p.UpdateRequestProcessorChain creating updateRequestProcessorChain "dedupe-allfields"
[junit4] 2> 478343 INFO (coreLoadExecutor-1682-thread-1) [ x:collection1] o.a.s.u.p.UpdateRequestProcessorChain inserting DistributedUpdateProcessorFactory into updateRequestProcessorChain "dedupe-allfields"
[junit4] 2> 478343 INFO (coreLoadExecutor-1682-thread-1) [ x:collection1] o.a.s.u.p.UpdateRequestProcessorChain creating updateRequestProcessorChain "stored_sig"
[junit4] 2> 478343 INFO (coreLoadExecutor-1682-thread-1) [ x:collection1] o.a.s.u.p.UpdateRequestProcessorChain inserting DistributedUpdateProcessorFactory into updateRequestProcessorChain "stored_sig"
[junit4] 2> 478343 INFO (coreLoadExecutor-1682-thread-1) [ x:collection1] o.a.s.u.p.UpdateRequestProcessorChain creating updateRequestProcessorChain "uniq-fields"
[junit4] 2> 478343 INFO (coreLoadExecutor-1682-thread-1) [ x:collection1] o.a.s.u.p.UpdateRequestProcessorChain inserting DistributedUpdateProcessorFactory into updateRequestProcessorChain "uniq-fields"
[junit4] 2> 478344 INFO (coreLoadExecutor-1682-thread-1) [ x:collection1] o.a.s.u.p.UpdateRequestProcessorChain creating updateRequestProcessorChain "distrib-dup-test-chain-explicit"
[junit4] 2> 478344 INFO (coreLoadExecutor-1682-thread-1) [ x:collection1] o.a.s.u.p.UpdateRequestProcessorChain creating updateRequestProcessorChain "distrib-dup-test-chain-implicit"
[junit4] 2> 478344 INFO (coreLoadExecutor-1682-thread-1) [ x:collection1] o.a.s.u.p.UpdateRequestProcessorChain inserting DistributedUpdateProcessorFactory into updateRequestProcessorChain "distrib-dup-test-chain-implicit"
[junit4] 2> 478344 INFO (coreLoadExecutor-1682-thread-1) [ x:collection1] o.a.s.c.SolrCore no updateRequestProcessorChain defined as default, creating implicit default
[junit4] 2> 478345 INFO (coreLoadExecutor-1682-thread-1) [ x:collection1] o.a.s.h.l.XMLLoader xsltCacheLifetimeSeconds=60
[junit4] 2> 478347 INFO (coreLoadExecutor-1682-thread-1) [ x:collection1] o.a.s.h.l.XMLLoader xsltCacheLifetimeSeconds=60
[junit4] 2> 478348 INFO (coreLoadExecutor-1682-thread-1) [ x:collection1] o.a.s.h.l.XMLLoader xsltCacheLifetimeSeconds=60
[junit4] 2> 478349 INFO (coreLoadExecutor-1682-thread-1) [ x:collection1] o.a.s.h.l.XMLLoader xsltCacheLifetimeSeconds=60
[junit4] 2> 478358 INFO (coreLoadExecutor-1682-thread-1) [ x:collection1] o.a.s.c.PluginBag requestHandler : 'lazy' created with startup=lazy
[junit4] 2> 478362 INFO (coreLoadExecutor-1682-thread-1) [ x:collection1] o.a.s.c.RequestHandlers Registered paths: /admin/mbeans,standard,spellCheckCompRH,lazy,/update/json/docs,/admin/luke,/export,spellCheckWithWordbreak_Direct,tvrh,/get,/admin/properties,/update/json,mltrh,/admin/threads,/search-facet-def,/update/csv,/sql,/graph,/search-facet-invariants,/admin/segments,spellCheckCompRH1,/mlt,/admin/system,/replication,dismax,defaults,/config,/stream,/schema,/admin/plugins,/admin/logging,spellCheckWithWordbreak,mock,/admin/ping,/update,/admin/file,/terms,spellCheckCompRH_Direct,/debug/dump
[junit4] 2> 478362 INFO (coreLoadExecutor-1682-thread-1) [ x:collection1] o.a.s.c.SolrCore Using default statsCache cache: org.apache.solr.search.stats.LocalStatsCache
[junit4] 2> 478362 INFO (coreLoadExecutor-1682-thread-1) [ x:collection1] o.a.s.u.UpdateHandler Using UpdateLog implementation: org.apache.solr.update.UpdateLog
[junit4] 2> 478362 INFO (coreLoadExecutor-1682-thread-1) [ x:collection1] o.a.s.u.UpdateLog Initializing UpdateLog: dataDir= defaultSyncLevel=FLUSH numRecordsToKeep=100 maxNumLogsToKeep=10 numVersionBuckets=65536
[junit4] 2> 478363 INFO (coreLoadExecutor-1682-thread-1) [ x:collection1] o.a.s.u.CommitTracker Hard AutoCommit: disabled
[junit4] 2> 478363 INFO (coreLoadExecutor-1682-thread-1) [ x:collection1] o.a.s.u.CommitTracker Soft AutoCommit: disabled
[junit4] 2> 478363 INFO (coreLoadExecutor-1682-thread-1) [ x:collection1] o.a.s.u.RandomMergePolicy RandomMergePolicy wrapping class org.apache.lucene.index.TieredMergePolicy: [TieredMergePolicy: maxMergeAtOnce=19, maxMergeAtOnceExplicit=33, maxMergedSegmentMB=59.375, floorSegmentMB=0.576171875, forceMergeDeletesPctAllowed=22.858316225570857, segmentsPerTier=25.0, maxCFSSegmentSizeMB=8.796093022207999E12, noCFSRatio=1.0
[junit4] 2> 478364 INFO (coreLoadExecutor-1682-thread-1) [ x:collection1] o.a.s.c.SolrDeletionPolicy SolrDeletionPolicy.onInit: commits: num=1
[junit4] 2> commit{dir=MockDirectoryWrapper(RAMDirectory@6e70e9 lockFactory=org.apache.lucene.store.SingleInstanceLockFactory@93fc6),segFN=segments_1,generation=1}
[junit4] 2> 478364 INFO (coreLoadExecutor-1682-thread-1) [ x:collection1] o.a.s.c.SolrDeletionPolicy newest commit generation = 1
[junit4] 2> 478364 INFO (coreLoadExecutor-1682-thread-1) [ x:collection1] o.a.s.s.SolrIndexSearcher Opening [Searcher@3e772d[collection1] main]
[junit4] 2> 478364 INFO (coreLoadExecutor-1682-thread-1) [ x:collection1] o.a.s.r.RestManager Initializing RestManager with initArgs: {storageIO=org.apache.solr.rest.ManagedResourceStorage$InMemoryStorageIO}
[junit4] 2> 478364 INFO (coreLoadExecutor-1682-thread-1) [ x:collection1] o.a.s.r.ManagedResourceStorage Reading _rest_managed.json using InMemoryStorage
[junit4] 2> 478364 INFO (coreLoadExecutor-1682-thread-1) [ x:collection1] o.a.s.r.RestManager Initializing 0 registered ManagedResources
[junit4] 2> 478364 INFO (coreLoadExecutor-1682-thread-1) [ x:collection1] o.a.s.h.c.SpellCheckComponent Initializing spell checkers
[junit4] 2> 478430 INFO (coreLoadExecutor-1682-thread-1) [ x:collection1] o.a.s.s.DirectSolrSpellChecker init: {name=direct,classname=DirectSolrSpellChecker,field=lowerfilt,minQueryLength=3}
[junit4] 2> 478537 INFO (coreLoadExecutor-1682-thread-1) [ x:collection1] o.a.s.h.ReplicationHandler Commits will be reserved for 10000
[junit4] 2> 478537 INFO (searcherExecutor-1683-thread-1-processing-x:collection1) [ x:collection1] o.a.s.h.c.SpellCheckComponent Loading spell index for spellchecker: default
[junit4] 2> 478537 INFO (searcherExecutor-1683-thread-1-processing-x:collection1) [ x:collection1] o.a.s.h.c.SpellCheckComponent Loading spell index for spellchecker: direct
[junit4] 2> 478537 INFO (searcherExecutor-1683-thread-1-processing-x:collection1) [ x:collection1] o.a.s.h.c.SpellCheckComponent Loading spell index for spellchecker: wordbreak
[junit4] 2> 478537 INFO (searcherExecutor-1683-thread-1-processing-x:collection1) [ x:collection1] o.a.s.h.c.SpellCheckComponent Loading spell index for spellchecker: multipleFields
[junit4] 2> 478538 INFO (searcherExecutor-1683-thread-1-processing-x:collection1) [ x:collection1] o.a.s.h.c.SpellCheckComponent Loading spell index for spellchecker: jarowinkler
[junit4] 2> 478538 INFO (searcherExecutor-1683-thread-1-processing-x:collection1) [ x:collection1] o.a.s.h.c.SpellCheckComponent Loading spell index for spellchecker: external
[junit4] 2> 478539 INFO (searcherExecutor-1683-thread-1-processing-x:collection1) [ x:collection1] o.a.s.h.c.SpellCheckComponent Loading spell index for spellchecker: freq
[junit4] 2> 478539 INFO (coreLoadExecutor-1682-thread-1) [ x:collection1] o.a.s.u.UpdateLog Looking up max value of version field to seed version buckets
[junit4] 2> 478539 INFO (coreLoadExecutor-1682-thread-1) [ x:collection1] o.a.s.u.VersionInfo Refreshing highest value of _version_ for 65536 version buckets from index
[junit4] 2> 478539 INFO (coreLoadExecutor-1682-thread-1) [ x:collection1] o.a.s.u.VersionInfo No terms found for _version_, cannot seed version bucket highest value from index
[junit4] 2> 478539 INFO (coreLoadExecutor-1682-thread-1) [ x:collection1] o.a.s.u.UpdateLog Could not find max version in index or recent updates, using new clock 1542010749840261120
[junit4] 2> 478539 INFO (searcherExecutor-1683-thread-1-processing-x:collection1) [ x:collection1] o.a.s.h.c.SpellCheckComponent Loading spell index for spellchecker: fqcn
[junit4] 2> 478539 INFO (searcherExecutor-1683-thread-1-processing-x:collection1) [ x:collection1] o.a.s.h.c.SpellCheckComponent Loading spell index for spellchecker: perDict
[junit4] 2> 478541 INFO (coreLoadExecutor-1682-thread-1) [ x:collection1] o.a.s.u.UpdateLog Took 1.0ms to seed version buckets with highest version 1542010749840261120
[junit4] 2> 478541 INFO (searcherExecutor-1683-thread-1-processing-x:collection1) [ x:collection1] o.a.s.c.SolrCore [collection1] Registered new searcher Searcher@3e772d[collection1] main{ExitableDirectoryReader(UninvertingDirectoryReader())}
[junit4] 2> 478541 INFO (coreLoadExecutor-1682-thread-1) [ x:collection1] o.a.s.c.CoreContainer registering core: collection1
[junit4] 2> 478729 INFO (TEST-DistributedFacetPivotLongTailTest.test-seed#[E8FD3A80180D004F]) [ ] o.a.s.SolrTestCaseJ4 Writing core.properties file to /home/jenkins/workspace/Lucene-Solr-master-Linux/solr/build/solr-core/test/J2/temp/solr.handler.component.DistributedFacetPivotLongTailTest_E8FD3A80180D004F-001/tempDir-001/shard0/cores/collection1
[junit4] 2> 478731 INFO (TEST-DistributedFacetPivotLongTailTest.test-seed#[E8FD3A80180D004F]) [ ] o.e.j.s.Server jetty-9.3.8.v20160314
[junit4] 2> 478732 INFO (TEST-DistributedFacetPivotLongTailTest.test-seed#[E8FD3A80180D004F]) [ ] o.e.j.s.h.ContextHandler Started o.e.j.s.ServletContextHandler@1e08cd{/,null,AVAILABLE}
[junit4] 2> 478734 INFO (TEST-DistributedFacetPivotLongTailTest.test-seed#[E8FD3A80180D004F]) [ ] o.e.j.s.ServerConnector Started ServerConnector@98a492{SSL,[ssl, http/1.1]}{127.0.0.1:38493}
[junit4] 2> 478734 INFO (TEST-DistributedFacetPivotLongTailTest.test-seed#[E8FD3A80180D004F]) [ ] o.e.j.s.Server Started @479989ms
[junit4] 2> 478734 INFO (TEST-DistributedFacetPivotLongTailTest.test-seed#[E8FD3A80180D004F]) [ ] o.a.s.c.s.e.JettySolrRunner Jetty properties: {hostContext=/, hostPort=38493, coreRootDirectory=/home/jenkins/workspace/Lucene-Solr-master-Linux/solr/build/solr-core/test/J2/temp/solr.handler.component.DistributedFacetPivotLongTailTest_E8FD3A80180D004F-001/tempDir-001/shard0/cores}
[junit4] 2> 478735 INFO (TEST-DistributedFacetPivotLongTailTest.test-seed#[E8FD3A80180D004F]) [ ] o.a.s.s.SolrDispatchFilter SolrDispatchFilter.init(): sun.misc.Launcher$AppClassLoader@1d16e93
[junit4] 2> 478735 INFO (TEST-DistributedFacetPivotLongTailTest.test-seed#[E8FD3A80180D004F]) [ ] o.a.s.c.SolrResourceLoader new SolrResourceLoader for directory: '/home/jenkins/workspace/Lucene-Solr-master-Linux/solr/build/solr-core/test/J2/temp/solr.handler.component.DistributedFacetPivotLongTailTest_E8FD3A80180D004F-001/tempDir-001/shard0'
[junit4] 2> 478735 INFO (TEST-DistributedFacetPivotLongTailTest.test-seed#[E8FD3A80180D004F]) [ ] o.a.s.c.SolrResourceLoader JNDI not configured for solr (NoInitialContextEx)
[junit4] 2> 478735 INFO (TEST-DistributedFacetPivotLongTailTest.test-seed#[E8FD3A80180D004F]) [ ] o.a.s.c.SolrResourceLoader solr home defaulted to 'solr/' (could not find system property or JNDI)
[junit4] 2> 478735 INFO (TEST-DistributedFacetPivotLongTailTest.test-seed#[E8FD3A80180D004F]) [ ] o.a.s.c.SolrXmlConfig Loading container configuration from /home/jenkins/workspace/Lucene-Solr-master-Linux/solr/build/solr-core/test/J2/temp/solr.handler.component.DistributedFacetPivotLongTailTest_E8FD3A80180D004F-001/tempDir-001/shard0/solr.xml
[junit4] 2> 478740 INFO (TEST-DistributedFacetPivotLongTailTest.test-seed#[E8FD3A80180D004F]) [ ] o.a.s.c.CorePropertiesLocator Config-defined core root directory: /home/jenkins/workspace/Lucene-Solr-master-Linux/solr/build/solr-core/test/J2/temp/solr.handler.component.DistributedFacetPivotLongTailTest_E8FD3A80180D004F-001/tempDir-001/shard0/cores
[junit4] 2> 478740 INFO (TEST-DistributedFacetPivotLongTailTest.test-seed#[E8FD3A80180D004F]) [ ] o.a.s.c.CoreContainer New CoreContainer 9401831
[junit4] 2> 478740 INFO (TEST-DistributedFacetPivotLongTailTest.test-seed#[E8FD3A80180D004F]) [ ] o.a.s.c.CoreContainer Loading cores into CoreContainer [instanceDir=/home/jenkins/workspace/Lucene-Solr-master-Linux/solr/build/solr-core/test/J2/temp/solr.handler.component.DistributedFacetPivotLongTailTest_E8FD3A80180D004F-001/tempDir-001/shard0]
[junit4] 2> 478740 WARN (TEST-DistributedFacetPivotLongTailTest.test-seed#[E8FD3A80180D004F]) [ ] o.a.s.c.CoreContainer Couldn't add files from /home/jenkins/workspace/Lucene-Solr-master-Linux/solr/build/solr-core/test/J2/temp/solr.handler.component.DistributedFacetPivotLongTailTest_E8FD3A80180D004F-001/tempDir-001/shard0/lib to classpath: /home/jenkins/workspace/Lucene-Solr-master-Linux/solr/build/solr-core/test/J2/temp/solr.handler.component.DistributedFacetPivotLongTailTest_E8FD3A80180D004F-001/tempDir-001/shard0/lib
[junit4] 2> 478741 INFO (TEST-DistributedFacetPivotLongTailTest.test-seed#[E8FD3A80180D004F]) [ ] o.a.s.h.c.HttpShardHandlerFactory created with socketTimeout : 90000,urlScheme : https,connTimeout : 15000,maxConnectionsPerHost : 20,maxConnections : 10000,corePoolSize : 0,maximumPoolSize : 2147483647,maxThreadIdleTime : 5,sizeOfQueue : -1,fairnessPolicy : false,
[junit4] 2> 478744 INFO (TEST-DistributedFacetPivotLongTailTest.test-seed#[E8FD3A80180D004F]) [ ] o.a.s.u.UpdateShardHandler Created UpdateShardHandler HTTP client with params: socketTimeout=340000&connTimeout=45000&maxConnections=100000&maxConnectionsPerHost=100000
[junit4] 2> 478744 INFO (TEST-DistributedFacetPivotLongTailTest.test-seed#[E8FD3A80180D004F]) [ ] o.a.s.l.LogWatcher SLF4J impl is org.slf4j.impl.Log4jLoggerFactory
[junit4] 2> 478744 INFO (TEST-DistributedFacetPivotLongTailTest.test-seed#[E8FD3A80180D004F]) [ ] o.a.s.l.LogWatcher Registering Log Listener [Log4j (org.slf4j.impl.Log4jLoggerFactory)]
[junit4] 2> 478744 INFO (TEST-DistributedFacetPivotLongTailTest.test-seed#[E8FD3A80180D004F]) [ ] o.a.s.c.CoreContainer Security conf doesn't exist. Skipping setup for authorization module.
[junit4] 2> 478744 INFO (TEST-DistributedFacetPivotLongTailTest.test-seed#[E8FD3A80180D004F]) [ ] o.a.s.c.CoreContainer No authentication plugin used.
[junit4] 2> 478745 INFO (TEST-DistributedFacetPivotLongTailTest.test-seed#[E8FD3A80180D004F]) [ ] o.a.s.c.CorePropertiesLocator Looking for core definitions underneath /home/jenkins/workspace/Lucene-Solr-master-Linux/solr/build/solr-core/test/J2/temp/solr.handler.component.DistributedFacetPivotLongTailTest_E8FD3A80180D004F-001/tempDir-001/shard0/cores
[junit4] 2> 478745 INFO (TEST-DistributedFacetPivotLongTailTest.test-seed#[E8FD3A80180D004F]) [ ] o.a.s.c.CoreDescriptor Created CoreDescriptor: {name=collection1, config=solrconfig.xml, loadOnStartup=true, schema=schema.xml, configSetProperties=configsetprops.json, transient=false, dataDir=data/, configSet=collection1}
[junit4] 2> 478746 INFO (TEST-DistributedFacetPivotLongTailTest.test-seed#[E8FD3A80180D004F]) [ ] o.a.s.c.CorePropertiesLocator Found core collection1 in /home/jenkins/workspace/Lucene-Solr-master-Linux/solr/build/solr-core/test/J2/temp/solr.handler.component.DistributedFacetPivotLongTailTest_E8FD3A80180D004F-001/tempDir-001/shard0/cores/collection1
[junit4] 2> 478746 INFO (TEST-DistributedFacetPivotLongTailTest.test-seed#[E8FD3A80180D004F]) [ ] o.a.s.c.CorePropertiesLocator Found 1 core definitions
[junit4] 2> 478746 INFO (coreLoadExecutor-1693-thread-1) [ ] o.a.s.c.SolrResourceLoader new SolrResourceLoader for directory: '/home/jenkins/workspace/Lucene-Solr-master-Linux/solr/core/src/test-files/solr/collection1'
[junit4] 2> 478746 INFO (TEST-DistributedFacetPivotLongTailTest.test-seed#[E8FD3A80180D004F]) [ ] o.a.s.s.SolrDispatchFilter user.dir=/home/jenkins/workspace/Lucene-Solr-master-Linux/solr/build/solr-core/test/J2
[junit4] 2> 478747 INFO (TEST-DistributedFacetPivotLongTailTest.test-seed#[E8FD3A80180D004F]) [ ] o.a.s.s.SolrDispatchFilter SolrDispatchFilter.init() done
[junit4] 2> 478747 INFO (coreLoadExecutor-1693-thread-1) [ ] o.a.s.c.SolrResourceLoader JNDI not configured for solr (NoInitialContextEx)
[junit4] 2> 478747 INFO (coreLoadExecutor-1693-thread-1) [ ] o.a.s.c.SolrResourceLoader solr home defaulted to 'solr/' (could not find system property or JNDI)
[junit4] 2> 478747 INFO (coreLoadExecutor-1693-thread-1) [ ] o.a.s.c.SolrResourceLoader Adding 'file:/home/jenkins/workspace/Lucene-Solr-master-Linux/solr/core/src/test-files/solr/collection1/lib/classes/' to classloader
[junit4] 2> 478747 INFO (coreLoadExecutor-1693-thread-1) [ ] o.a.s.c.SolrResourceLoader Adding 'file:/home/jenkins/workspace/Lucene-Solr-master-Linux/solr/core/src/test-files/solr/collection1/lib/README' to classloader
[junit4] 2> 478771 INFO (coreLoadExecutor-1693-thread-1) [ ] o.a.s.c.SolrConfig current version of requestparams : -1
[junit4] 2> 478779 INFO (coreLoadExecutor-1693-thread-1) [ ] o.a.s.c.SolrConfig Using Lucene MatchVersion: 7.0.0
[junit4] 2> 478798 INFO (coreLoadExecutor-1693-thread-1) [ ] o.a.s.c.SolrConfig Loaded SolrConfig: solrconfig.xml
[junit4] 2> 478804 INFO (coreLoadExecutor-1693-thread-1) [ ] o.a.s.s.IndexSchema [collection1] Schema name=test
[junit4] 2> 478892 INFO (coreLoadExecutor-1693-thread-1) [ ] o.a.s.s.OpenExchangeRatesOrgProvider Initialized with rates=open-exchange-rates.json, refreshInterval=1440.
[junit4] 2> 478898 INFO (coreLoadExecutor-1693-thread-1) [ ] o.a.s.s.IndexSchema default search field in schema is text
[junit4] 2> 478899 INFO (coreLoadExecutor-1693-thread-1) [ ] o.a.s.s.IndexSchema unique key field: id
[junit4] 2> 478905 INFO (coreLoadExecutor-1693-thread-1) [ ] o.a.s.s.FileExchangeRateProvider Reloading exchange rates from file currency.xml
[junit4] 2> 478907 INFO (coreLoadExecutor-1693-thread-1) [ ] o.a.s.s.FileExchangeRateProvider Reloading exchange rates from file currency.xml
[junit4] 2> 478909 INFO (coreLoadExecutor-1693-thread-1) [ ] o.a.s.s.OpenExchangeRatesOrgProvider Reloading exchange rates from open-exchange-rates.json
[junit4] 2> 478909 INFO (coreLoadExecutor-1693-thread-1) [ ] o.a.s.s.OpenExchangeRatesOrgProvider Reloading exchange rates from open-exchange-rates.json
[junit4] 2> 478911 INFO (coreLoadExecutor-1693-thread-1) [ ] o.a.s.c.ConfigSetProperties Did not find ConfigSet properties, assuming default properties: Can't find resource 'configsetprops.json' in classpath or '/home/jenkins/workspace/Lucene-Solr-master-Linux/solr/core/src/test-files/solr/collection1'
[junit4] 2> 478911 INFO (coreLoadExecutor-1693-thread-1) [ ] o.a.s.c.CoreContainer Creating SolrCore 'collection1' using configuration from configset /home/jenkins/workspace/Lucene-Solr-master-Linux/solr/core/src/test-files/solr/collection1
[junit4] 2> 478911 INFO (coreLoadExecutor-1693-thread-1) [ x:collection1] o.a.s.c.SolrCore org.apache.solr.core.MockDirectoryFactory
[junit4] 2> 478911 INFO (coreLoadExecutor-1693-thread-1) [ x:collection1] o.a.s.c.SolrCore [[collection1] ] Opening new SolrCore at [/home/jenkins/workspace/Lucene-Solr-master-Linux/solr/core/src/test-files/solr/collection1], dataDir=[/home/jenkins/workspace/Lucene-Solr-master-Linux/solr/build/solr-core/test/J2/temp/solr.handler.component.DistributedFacetPivotLongTailTest_E8FD3A80180D004F-001/tempDir-001/shard0/cores/collection1/data/]
[junit4] 2> 478911 INFO (coreLoadExecutor-1693-thread-1) [ x:collection1] o.a.s.c.JmxMonitoredMap JMX monitoring is enabled. Adding Solr mbeans to JMX Server: com.sun.jmx.mbeanserver.JmxMBeanServer@1acc5bf
[junit4] 2> 478912 INFO (coreLoadExecutor-1693-thread-1) [ x:collection1] o.a.s.c.CachingDirectoryFactory return new directory for /home/jenkins/workspace/Lucene-Solr-master-Linux/solr/build/solr-core/test/J2/temp/solr.handler.component.DistributedFacetPivotLongTailTest_E8FD3A80180D004F-001/tempDir-001/shard0/cores/collection1/data/snapshot_metadata
[junit4] 2> 478912 INFO (coreLoadExecutor-1693-thread-1) [ x:collection1] o.a.s.c.s.SolrSnapshotMetaDataManager Loading from snapshot metadata file...
[junit4] 2> 478912 INFO (coreLoadExecutor-1693-thread-1) [ x:collection1] o.a.s.c.CachingDirectoryFactory return new directory for /home/jenkins/workspace/Lucene-Solr-master-Linux/solr/build/solr-core/test/J2/temp/solr.handler.component.DistributedFacetPivotLongTailTest_E8FD3A80180D004F-001/tempDir-001/shard0/cores/collection1/data
[junit4] 2> 478912 INFO (coreLoadExecutor-1693-thread-1) [ x:collection1] o.a.s.c.SolrCore New index directory detected: old=null new=/home/jenkins/workspace/Lucene-Solr-master-Linux/solr/build/solr-core/test/J2/temp/solr.handler.component.DistributedFacetPivotLongTailTest_E8FD3A80180D004F-001/tempDir-001/shard0/cores/collection1/data/index/
[junit4] 2> 478912 WARN (coreLoadExecutor-1693-thread-1) [ x:collection1] o.a.s.c.SolrCore [collection1] Solr index directory '/home/jenkins/workspace/Lucene-Solr-master-Linux/solr/build/solr-core/test/J2/temp/solr.handler.component.DistributedFacetPivotLongTailTest_E8FD3A80180D004F-001/tempDir-001/shard0/cores/collection1/data/index' doesn't exist. Creating new index...
[junit4] 2> 478913 INFO (coreLoadExecutor-1693-thread-1) [ x:collection1] o.a.s.c.CachingDirectoryFactory return new directory for /home/jenkins/workspace/Lucene-Solr-master-Linux/solr/build/solr-core/test/J2/temp/solr.handler.component.DistributedFacetPivotLongTailTest_E8FD3A80180D004F-001/tempDir-001/shard0/cores/collection1/data/index
[junit4] 2> 478913 INFO (coreLoadExecutor-1693-thread-1) [ x:collection1] o.a.s.u.RandomMergePolicy RandomMergePolicy wrapping class org.apache.lucene.index.TieredMergePolicy: [TieredMergePolicy: maxMergeAtOnce=41, maxMergeAtOnceExplicit=49, maxMergedSegmentMB=7.21484375, floorSegmentMB=1.3212890625, forceMergeDeletesPctAllowed=18.331618052014555, segmentsPerTier=13.0, maxCFSSegmentSizeMB=8.796093022207999E12, noCFSRatio=0.0
[junit4] 2> 478913 INFO (coreLoadExecutor-1693-thread-1) [ x:collection1] o.a.s.c.SolrDeletionPolicy SolrDeletionPolicy.onCommit: commits: num=1
[junit4] 2> commit{dir=MockDirectoryWrapper(RAMDirectory@17e07f9 lockFactory=org.apache.lucene.store.SingleInstanceLockFactory@164f249),segFN=segments_1,generation=1}
[junit4] 2> 478913 INFO (coreLoadExecutor-1693-thread-1) [ x:collection1] o.a.s.c.SolrDeletionPolicy newest commit generation = 1
[junit4] 2> 478914 INFO (OldIndexDirectoryCleanupThreadForCore-collection1) [ x:collection1] o.a.s.c.SolrCore Looking for old index directories to cleanup for core collection1 in /home/jenkins/workspace/Lucene-Solr-master-Linux/solr/build/solr-core/test/J2/temp/solr.handler.component.DistributedFacetPivotLongTailTest_E8FD3A80180D004F-001/tempDir-001/shard0/cores/collection1/data/
[junit4] 2> 478914 WARN (OldIndexDirectoryCleanupThreadForCore-collection1) [ x:collection1] o.a.s.c.DirectoryFactory /home/jenkins/workspace/Lucene-Solr-master-Linux/solr/build/solr-core/test/J2/temp/solr.handler.component.DistributedFacetPivotLongTailTest_E8FD3A80180D004F-001/tempDir-001/shard0/cores/collection1/data/ does not point to a valid data directory; skipping clean-up of old index directories.
[junit4] 2> 478920 INFO (coreLoadExecutor-1693-thread-1) [ x:collection1] o.a.s.u.p.UpdateRequestProcessorChain creating updateRequestProcessorChain "dedupe"
[junit4] 2> 478920 INFO (coreLoadExecutor-1693-thread-1) [ x:collection1] o.a.s.u.p.UpdateRequestProcessorChain inserting DistributedUpdateProcessorFactory into updateRequestProcessorChain "dedupe"
[junit4] 2> 478920 INFO (coreLoadExecutor-1693-thread-1) [ x:collection1] o.a.s.u.p.UpdateRequestProcessorChain creating updateRequestProcessorChain "dedupe-allfields"
[junit4] 2> 478920 INFO (coreLoadExecutor-1693-thread-1) [ x:collection1] o.a.s.u.p.UpdateRequestProcessorChain inserting DistributedUpdateProcessorFactory into updateRequestProcessorChain "dedupe-allfields"
[junit4] 2> 478920 INFO (coreLoadExecutor-1693-thread-1) [ x:collection1] o.a.s.u.p.UpdateRequestProcessorChain creating updateRequestProcessorChain "stored_sig"
[junit4] 2> 478920 INFO (coreLoadExecutor-1693-thread-1) [ x:collection1] o.a.s.u.p.UpdateRequestProcessorChain inserting DistributedUpdateProcessorFactory into updateRequestProcessorChain "stored_sig"
[junit4] 2> 478920 INFO (coreLoadExecutor-1693-thread-1) [ x:collection1] o.a.s.u.p.UpdateRequestProcessorChain creating updateRequestProcessorChain "uniq-fields"
[junit4] 2> 478920 INFO (coreLoadExecutor-1693-thread-1) [ x:collection1] o.a.s.u.p.UpdateRequestProcessorChain inserting DistributedUpdateProcessorFactory into updateRequestProcessorChain "uniq-fields"
[junit4] 2> 478920 INFO (coreLoadExecutor-1693-thread-1) [ x:collection1] o.a.s.u.p.UpdateRequestProcessorChain creating updateRequestProcessorChain "distrib-dup-test-chain-explicit"
[junit4] 2> 478921 INFO (coreLoadExecutor-1693-thread-1) [ x:collection1] o.a.s.u.p.UpdateRequestProcessorChain creating updateRequestProcessorChain "distrib-dup-test-chain-implicit"
[junit4] 2> 478921 INFO (coreLoadExecutor-1693-thread-1) [ x:collection1] o.a.s.u.p.UpdateRequestProcessorChain inserting DistributedUpdateProcessorFactory into updateRequestProcessorChain "distrib-dup-test-chain-implicit"
[junit4] 2> 478921 INFO (coreLoadExecutor-1693-thread-1) [ x:collection1] o.a.s.c.SolrCore no updateRequestProcessorChain defined as default, creating implicit default
[junit4] 2> 478923 INFO (coreLoadExecutor-1693-thread-1) [ x:collection1] o.a.s.h.l.XMLLoader xsltCacheLifetimeSeconds=60
[junit4] 2> 478924 INFO (coreLoadExecutor-1693-thread-1) [ x:collection1] o.a.s.h.l.XMLLoader xsltCacheLifetimeSeconds=60
[junit4] 2> 478925 INFO (coreLoadExecutor-1693-thread-1) [ x:collection1] o.a.s.h.l.XMLLoader xsltCacheLifetimeSeconds=60
[junit4] 2> 478926 INFO (coreLoadExecutor-1693-thread-1) [ x:collection1] o.a.s.h.l.XMLLoader xsltCacheLifetimeSeconds=60
[junit4] 2> 478938 INFO (coreLoadExecutor-1693-thread-1) [ x:collection1] o.a.s.c.PluginBag requestHandler : 'lazy' created with startup=lazy
[junit4] 2> 478943 INFO (coreLoadExecutor-1693-thread-1) [ x:collection1] o.a.s.c.RequestHandlers Registered paths: /admin/mbeans,standard,spellCheckCompRH,lazy,/update/json/docs,/admin/luke,/export,spellCheckWithWordbreak_Direct,tvrh,/get,/admin/properties,/update/json,mltrh,/admin/threads,/search-facet-def,/update/csv,/sql,/graph,/search-facet-invariants,/admin/segments,spellCheckCompRH1,/mlt,/admin/system,/replication,dismax,defaults,/config,/stream,/schema,/admin/plugins,/admin/logging,spellCheckWithWordbreak,mock,/admin/ping,/update,/admin/file,/terms,spellCheckCompRH_Direct,/debug/dump
[junit4] 2> 478943 INFO (coreLoadExecutor-1693-thread-1) [ x:collection1] o.a.s.c.SolrCore Using default statsCache cache: org.apache.solr.search.stats.LocalStatsCache
[junit4] 2> 478943 INFO (coreLoadExecutor-1693-thread-1) [ x:collection1] o.a.s.u.UpdateHandler Using UpdateLog implementation: org.apache.solr.update.UpdateLog
[junit4] 2> 478943 INFO (coreLoadExecutor-1693-thread-1) [ x:collection1] o.a.s.u.UpdateLog Initializing UpdateLog: dataDir= defaultSyncLevel=FLUSH numRecordsToKeep=100 maxNumLogsToKeep=10 numVersionBuckets=65536
[junit4] 2> 478944 INFO (coreLoadExecutor-1693-thread-1) [ x:collection1] o.a.s.u.CommitTracker Hard AutoCommit: disabled
[junit4] 2> 478944 INFO (coreLoadExecutor-1693-thread-1) [ x:collection1] o.a.s.u.CommitTracker Soft AutoCommit: disabled
[junit4] 2> 478945 INFO (coreLoadExecutor-1693-thread-1) [ x:collection1] o.a.s.u.RandomMergePolicy RandomMergePolicy wrapping class org.apache.lucene.index.TieredMergePolicy: [TieredMergePolicy: maxMergeAtOnce=19, maxMergeAtOnceExplicit=33, maxMergedSegmentMB=59.375, floorSegmentMB=0.576171875, forceMergeDeletesPctAllowed=22.858316225570857, segmentsPerTier=25.0, maxCFSSegmentSizeMB=8.796093022207999E12, noCFSRatio=1.0
[junit4] 2> 478945 INFO (coreLoadExecutor-1693-thread-1) [ x:collection1] o.a.s.c.SolrDeletionPolicy SolrDeletionPolicy.onInit: commits: num=1
[junit4] 2> commit{dir=MockDirectoryWrapper(RAMDirectory@17e07f9 lockFactory=org.apache.lucene.store.SingleInstanceLockFactory@164f249),segFN=segments_1,generation=1}
[junit4] 2> 478946 INFO (coreLoadExecutor-1693-thread-1) [ x:collection1] o.a.s.c.SolrDeletionPolicy newest commit generation = 1
[junit4] 2> 478946 INFO (coreLoadExecutor-1693-thread-1) [ x:collection1] o.a.s.s.SolrIndexSearcher Opening [Searcher@592c6f[collection1] main]
[junit4] 2> 478946 INFO (coreLoadExecutor-1693-thread-1) [ x:collection1] o.a.s.r.RestManager Initializing RestManager with initArgs: {storageIO=org.apache.solr.rest.ManagedResourceStorage$InMemoryStorageIO}
[junit4] 2> 478946 INFO (coreLoadExecutor-1693-thread-1) [ x:collection1] o.a.s.r.ManagedResourceStorage Reading _rest_managed.json using InMemoryStorage
[junit4] 2> 478946 INFO (coreLoadExecutor-1693-thread-1) [ x:collection1] o.a.s.r.RestManager Initializing 0 registered ManagedResources
[junit4] 2> 478946 INFO (coreLoadExecutor-1693-thread-1) [ x:collection1] o.a.s.h.c.SpellCheckComponent Initializing spell checkers
[junit4] 2> 478999 INFO (coreLoadExecutor-1693-thread-1) [ x:collection1] o.a.s.s.DirectSolrSpellChecker init: {name=direct,classname=DirectSolrSpellChecker,field=lowerfilt,minQueryLength=3}
[junit4] 2> 479463 INFO (coreLoadExecutor-1693-thread-1) [ x:collection1] o.a.s.h.ReplicationHandler Commits will be reserved for 10000
[junit4] 2> 479463 INFO (searcherExecutor-1694-thread-1-processing-x:collection1) [ x:collection1] o.a.s.h.c.SpellCheckComponent Loading spell index for spellchecker: default
[junit4] 2> 479463 INFO (searcherExecutor-1694-thread-1-processing-x:collection1) [ x:collection1] o.a.s.h.c.SpellCheckComponent Loading spell index for spellchecker: direct
[junit4] 2> 479463 INFO (searcherExecutor-1694-thread-1-processing-x:collection1) [ x:collection1] o.a.s.h.c.SpellCheckComponent Loading spell index for spellchecker: wordbreak
[junit4] 2> 479463 INFO (searcherExecutor-1694-thread-1-processing-x:collection1) [ x:collection1] o.a.s.h.c.SpellCheckComponent Loading spell index for spellchecker: multipleFields
[junit4] 2> 479464 INFO (searcherExecutor-1694-thread-1-processing-x:collection1) [ x:collection1] o.a.s.h.c.SpellCheckComponent Loading spell index for spellchecker: jarowinkler
[junit4] 2> 479464 INFO (searcherExecutor-1694-thread-1-processing-x:collection1) [ x:collection1] o.a.s.h.c.SpellCheckComponent Loading spell index for spellchecker: external
[junit4] 2> 479464 INFO (searcherExecutor-1694-thread-1-processing-x:collection1) [ x:collection1] o.a.s.h.c.SpellCheckComponent Loading spell index for spellchecker: freq
[junit4] 2> 479464 INFO (searcherExecutor-1694-thread-1-processing-x:collection1) [ x:collection1] o.a.s.h.c.SpellCheckComponent Loading spell index for spellchecker: fqcn
[junit4] 2> 479464 INFO (coreLoadExecutor-1693-thread-1) [ x:collection1] o.a.s.u.UpdateLog Looking up max value of version field to seed version buckets
[junit4] 2> 479464 INFO (coreLoadExecutor-1693-thread-1) [ x:collection1] o.a.s.u.VersionInfo Refreshing highest value of _version_ for 65536 version buckets from index
[junit4] 2> 479464 INFO (searcherExecutor-1694-thread-1-processing-x:collection1) [ x:collection1] o.a.s.h.c.SpellCheckComponent Loading spell index for spellchecker: perDict
[junit4] 2> 479464 INFO (coreLoadExecutor-1693-thread-1) [ x:collection1] o.a.s.u.VersionInfo No terms found for _version_, cannot seed version bucket highest value from index
[junit4] 2> 479464 INFO (coreLoadExecutor-1693-thread-1) [ x:collection1] o.a.s.u.UpdateLog Could not find max version in index or recent updates, using new clock 1542010750810193920
[junit4] 2> 479466 INFO (coreLoadExecutor-1693-thread-1) [ x:collection1] o.a.s.u.UpdateLog Took 1.0ms to seed version buckets with highest version 1542010750810193920
[junit4] 2> 479466 INFO (coreLoadExecutor-1693-thread-1) [ x:collection1] o.a.s.c.CoreContainer registering core: collection1
[junit4] 2> 479467 INFO (searcherExecutor-1694-thread-1-processing-x:collection1) [ x:collection1] o.a.s.c.SolrCore [collection1] Registered new searcher Searcher@592c6f[collection1] main{ExitableDirectoryReader(UninvertingDirectoryReader())}
[junit4] 2> 479817 INFO (TEST-DistributedFacetPivotLongTailTest.test-seed#[E8FD3A80180D004F]) [ ] o.a.s.SolrTestCaseJ4 Writing core.properties file to /home/jenkins/workspace/Lucene-Solr-master-Linux/solr/build/solr-core/test/J2/temp/solr.handler.component.DistributedFacetPivotLongTailTest_E8FD3A80180D004F-001/tempDir-001/shard1/cores/collection1
[junit4] 2> 479818 INFO (TEST-DistributedFacetPivotLongTailTest.test-seed#[E8FD3A80180D004F]) [ ] o.e.j.s.Server jetty-9.3.8.v20160314
[junit4] 2> 479819 INFO (TEST-DistributedFacetPivotLongTailTest.test-seed#[E8FD3A80180D004F]) [ ] o.e.j.s.h.ContextHandler Started o.e.j.s.ServletContextHandler@e4ab8b{/,null,AVAILABLE}
[junit4] 2> 479822 INFO (TEST-DistributedFacetPivotLongTailTest.test-seed#[E8FD3A80180D004F]) [ ] o.e.j.s.ServerConnector Started ServerConnector@a0c71{SSL,[ssl, http/1.1]}{127.0.0.1:38361}
[junit4] 2> 479822 INFO (TEST-DistributedFacetPivotLongTailTest.test-seed#[E8FD3A80180D004F]) [ ] o.e.j.s.Server Started @481077ms
[junit4] 2> 479822 INFO (TEST-DistributedFacetPivotLongTailTest.test-seed#[E8FD3A80180D004F]) [ ] o.a.s.c.s.e.JettySolrRunner Jetty properties: {hostContext=/, hostPort=38361, coreRootDirectory=/home/jenkins/workspace/Lucene-Solr-master-Linux/solr/build/solr-core/test/J2/temp/solr.handler.component.DistributedFacetPivotLongTailTest_E8FD3A80180D004F-001/tempDir-001/shard1/cores}
[junit4] 2> 479822 INFO (TEST-DistributedFacetPivotLongTailTest.test-seed#[E8FD3A80180D004F]) [ ] o.a.s.s.SolrDispatchFilter SolrDispatchFilter.init(): sun.misc.Launcher$AppClassLoader@1d16e93
[junit4] 2> 479822 INFO (TEST-DistributedFacetPivotLongTailTest.test-seed#[E8FD3A80180D004F]) [ ] o.a.s.c.SolrResourceLoader new SolrResourceLoader for directory: '/home/jenkins/workspace/Lucene-Solr-master-Linux/solr/build/solr-core/test/J2/temp/solr.handler.component.DistributedFacetPivotLongTailTest_E8FD3A80180D004F-001/tempDir-001/shard1'
[junit4] 2> 479822 INFO (TEST-DistributedFacetPivotLongTailTest.test-seed#[E8FD3A80180D004F]) [ ] o.a.s.c.SolrResourceLoader JNDI not configured for solr (NoInitialContextEx)
[junit4] 2> 479823 INFO (TEST-DistributedFacetPivotLongTailTest.test-seed#[E8FD3A80180D004F]) [ ] o.a.s.c.SolrResourceLoader solr home defaulted to 'solr/' (could not find system property or JNDI)
[junit4] 2> 479823 INFO (TEST-DistributedFacetPivotLongTailTest.test-seed#[E8FD3A80180D004F]) [ ] o.a.s.c.SolrXmlConfig Loading container configuration from /home/jenkins/workspace/Lucene-Solr-master-Linux/solr/build/solr-core/test/J2/temp/solr.handler.component.DistributedFacetPivotLongTailTest_E8FD3A80180D004F-001/tempDir-001/shard1/solr.xml
[junit4] 2> 479827 INFO (TEST-DistributedFacetPivotLongTailTest.test-seed#[E8FD3A80180D004F]) [ ] o.a.s.c.CorePropertiesLocator Config-defined core root directory: /home/jenkins/workspace/Lucene-Solr-master-Linux/solr/build/solr-core/test/J2/temp/solr.handler.component.DistributedFacetPivotLongTailTest_E8FD3A80180D004F-001/tempDir-001/shard1/cores
[junit4] 2> 479827 INFO (TEST-DistributedFacetPivotLongTailTest.test-seed#[E8FD3A80180D004F]) [ ] o.a.s.c.CoreContainer New CoreContainer 32474504
[junit4] 2> 479827 INFO (TEST-DistributedFacetPivotLongTailTest.test-seed#[E8FD3A80180D004F]) [ ] o.a.s.c.CoreContainer Loading cores into CoreContainer [instanceDir=/home/jenkins/workspace/Lucene-Solr-master-Linux/solr/build/solr-core/test/J2/temp/solr.handler.component.DistributedFacetPivotLongTailTest_E8FD3A80180D004F-001/tempDir-001/shard1]
[junit4] 2> 479828 WARN (TEST-DistributedFacetPivotLongTailTest.test-seed#[E8FD3A80180D004F]) [ ] o.a.s.c.CoreContainer Couldn't add files from /home/jenkins/workspace/Lucene-Solr-master-Linux/solr/build/solr-core/test/J2/temp/solr.handler.component.DistributedFacetPivotLongTailTest_E8FD3A80180D004F-001/tempDir-001/shard1/lib to classpath: /home/jenkins/workspace/Lucene-Solr-master-Linux/solr/build/solr-core/test/J2/temp/solr.handler.component.DistributedFacetPivotLongTailTest_E8FD3A80180D004F-001/tempDir-001/shard1/lib
[junit4] 2> 479828 INFO (TEST-DistributedFacetPivotLongTailTest.test-seed#[E8FD3A80180D004F]) [ ] o.a.s.h.c.HttpShardHandlerFactory created with socketTimeout : 90000,urlScheme : https,connTimeout : 15000,maxConnectionsPerHost : 20,maxConnections : 10000,corePoolSize : 0,maximumPoolSize : 2147483647,maxThreadIdleTime : 5,sizeOfQueue : -1,fairnessPolicy : false,
[junit4] 2> 479830 INFO (TEST-DistributedFacetPivotLongTailTest.test-seed#[E8FD3A80180D004F]) [ ] o.a.s.u.UpdateShardHandler Created UpdateShardHandler HTTP client with params: socketTimeout=340000&connTimeout=45000&maxConnections=100000&maxConnectionsPerHost=100000
[junit4] 2> 479830 INFO (TEST-DistributedFacetPivotLongTailTest.test-seed#[E8FD3A80180D004F]) [ ] o.a.s.l.LogWatcher SLF4J impl is org.slf4j.impl.Log4jLoggerFactory
[junit4] 2> 479830 INFO (TEST-DistributedFacetPivotLongTailTest.test-seed#[E8FD3A80180D004F]) [ ] o.a.s.l.LogWatcher Registering Log Listener [Log4j (org.slf4j.impl.Log4jLoggerFactory)]
[junit4] 2> 479830 INFO (TEST-DistributedFacetPivotLongTailTest.test-seed#[E8FD3A80180D004F]) [ ] o.a.s.c.CoreContainer Security conf doesn't exist. Skipping setup for authorization module.
[junit4] 2> 479830 INFO (TEST-DistributedFacetPivotLongTailTest.test-seed#[E8FD3A80180D004F]) [ ] o.a.s.c.CoreContainer No authentication plugin used.
[junit4] 2> 479831 INFO (TEST-DistributedFacetPivotLongTailTest.test-seed#[E8FD3A80180D004F]) [ ] o.a.s.c.CorePropertiesLocator Looking for core definitions underneath /home/jenkins/workspace/Lucene-Solr-master-Linux/solr/build/solr-core/test/J2/temp/solr.handler.component.DistributedFacetPivotLongTailTest_E8FD3A80180D004F-001/tempDir-001/shard1/cores
[junit4] 2> 479831 INFO (TEST-DistributedFacetPivotLongTailTest.test-seed#[E8FD3A80180D004F]) [ ] o.a.s.c.CoreDescriptor Created CoreDescriptor: {name=collection1, config=solrconfig.xml, loadOnStartup=true, schema=schema.xml, configSetProperties=configsetprops.json, transient=false, dataDir=data/, configSet=collection1}
[junit4] 2> 479831 INFO (TEST-DistributedFacetPivotLongTailTest.test-seed#[E8FD3A80180D004F]) [ ] o.a.s.c.CorePropertiesLocator Found core collection1 in /home/jenkins/workspace/Lucene-Solr-master-Linux/solr/build/solr-core/test/J2/temp/solr.handler.component.DistributedFacetPivotLongTailTest_E8FD3A80180D004F-001/tempDir-001/shard1/cores/collection1
[junit4] 2> 479831 INFO (TEST-DistributedFacetPivotLongTailTest.test-seed#[E8FD3A80180D004F]) [ ] o.a.s.c.CorePropertiesLocator Found 1 core definitions
[junit4] 2> 479832 INFO (coreLoadExecutor-1704-thread-1) [ ] o.a.s.c.SolrResourceLoader new SolrResourceLoader for directory: '/home/jenkins/workspace/Lucene-Solr-master-Linux/solr/core/src/test-files/solr/collection1'
[junit4] 2> 479832 INFO (TEST-DistributedFacetPivotLongTailTest.test-seed#[E8FD3A80180D004F]) [ ] o.a.s.s.SolrDispatchFilter user.dir=/home/jenkins/workspace/Lucene-Solr-master-Linux/solr/build/solr-core/test/J2
[junit4] 2> 479832 INFO (TEST-DistributedFacetPivotLongTailTest.test-seed#[E8FD3A80180D004F]) [ ] o.a.s.s.SolrDispatchFilter SolrDispatchFilter.init() done
[junit4] 2> 479832 INFO (coreLoadExecutor-1704-thread-1) [ ] o.a.s.c.SolrResourceLoader JNDI not configured for solr (NoInitialContextEx)
[junit4] 2> 479832 INFO (coreLoadExecutor-1704-thread-1) [ ] o.a.s.c.SolrResourceLoader solr home defaulted to 'solr/' (could not find system property or JNDI)
[junit4] 2> 479832 INFO (coreLoadExecutor-1704-thread-1) [ ] o.a.s.c.SolrResourceLoader Adding 'file:/home/jenkins/workspace/Lucene-Solr-master-Linux/solr/core/src/test-files/solr/collection1/lib/classes/' to classloader
[junit4] 2> 479832 INFO (coreLoadExecutor-1704-thread-1) [ ] o.a.s.c.SolrResourceLoader Adding 'file:/home/jenkins/workspace/Lucene-Solr-master-Linux/solr/core/src/test-files/solr/collection1/lib/README' to classloader
[junit4] 2> 479855 INFO (coreLoadExecutor-1704-thread-1) [ ] o.a.s.c.SolrConfig current version of requestparams : -1
[junit4] 2> 479863 INFO (coreLoadExecutor-1704-thread-1) [ ] o.a.s.c.SolrConfig Using Lucene MatchVersion: 7.0.0
[junit4] 2> 479881 INFO (coreLoadExecutor-1704-thread-1) [ ] o.a.s.c.SolrConfig Loaded SolrConfig: solrconfig.xml
[junit4] 2> 479887 INFO (coreLoadExecutor-1704-thread-1) [ ] o.a.s.s.IndexSchema [collection1] Schema name=test
[junit4] 2> 479967 INFO (coreLoadExecutor-1704-thread-1) [ ] o.a.s.s.OpenExchangeRatesOrgProvider Initialized with rates=open-exchange-rates.json, refreshInterval=1440.
[junit4] 2> 479972 INFO (coreLoadExecutor-1704-thread-1) [ ] o.a.s.s.IndexSchema default search field in schema is text
[junit4] 2> 479973 INFO (coreLoadExecutor-1704-thread-1) [ ] o.a.s.s.IndexSchema unique key field: id
[junit4] 2> 479978 INFO (coreLoadExecutor-1704-thread-1) [ ] o.a.s.s.FileExchangeRateProvider Reloading exchange rates from file currency.xml
[junit4] 2> 479979 INFO (coreLoadExecutor-1704-thread-1) [ ] o.a.s.s.FileExchangeRateProvider Reloading exchange rates from file currency.xml
[junit4] 2> 479981 INFO (coreLoadExecutor-1704-thread-1) [ ] o.a.s.s.OpenExchangeRatesOrgProvider Reloading exchange rates from open-exchange-rates.json
[junit4] 2> 479981 INFO (coreLoadExecutor-1704-thread-1) [ ] o.a.s.s.OpenExchangeRatesOrgProvider Reloading exchange rates from open-exchange-rates.json
[junit4] 2> 479982 INFO (coreLoadExecutor-1704-thread-1) [ ] o.a.s.c.ConfigSetProperties Did not find ConfigSet properties, assuming default properties: Can't find resource 'configsetprops.json' in classpath or '/home/jenkins/workspace/Lucene-Solr-master-Linux/solr/core/src/test-files/solr/collection1'
[junit4] 2> 479982 INFO (coreLoadExecutor-1704-thread-1) [ ] o.a.s.c.CoreContainer Creating SolrCore 'collection1' using configuration from configset /home/jenkins/workspace/Lucene-Solr-master-Linux/solr/core/src/test-files/solr/collection1
[junit4] 2> 479983 INFO (coreLoadExecutor-1704-thread-1) [ x:collection1] o.a.s.c.SolrCore org.apache.solr.core.MockDirectoryFactory
[junit4] 2> 479983 INFO (coreLoadExecutor-1704-thread-1) [ x:collection1] o.a.s.c.SolrCore [[collection1] ] Opening new SolrCore at [/home/jenkins/workspace/Lucene-Solr-master-Linux/solr/core/src/test-files/solr/collection1], dataDir=[/home/jenkins/workspace/Lucene-Solr-master-Linux/solr/build/solr-core/test/J2/temp/solr.handler.component.DistributedFacetPivotLongTailTest_E8FD3A80180D004F-001/tempDir-001/shard1/cores/collection1/data/]
[junit4] 2> 479983 INFO (coreLoadExecutor-1704-thread-1) [ x:collection1] o.a.s.c.JmxMonitoredMap JMX monitoring is enabled. Adding Solr mbeans to JMX Server: com.sun.jmx.mbeanserver.JmxMBeanServer@1acc5bf
[junit4] 2> 479983 INFO (coreLoadExecutor-1704-thread-1) [ x:collection1] o.a.s.c.CachingDirectoryFactory return new directory for /home/jenkins/workspace/Lucene-Solr-master-Linux/solr/build/solr-core/test/J2/temp/solr.handler.component.DistributedFacetPivotLongTailTest_E8FD3A80180D004F-001/tempDir-001/shard1/cores/collection1/data/snapshot_metadata
[junit4] 2> 479983 INFO (coreLoadExecutor-1704-thread-1) [ x:collection1] o.a.s.c.s.SolrSnapshotMetaDataManager Loading from snapshot metadata file...
[junit4] 2> 479984 INFO (coreLoadExecutor-1704-thread-1) [ x:collection1] o.a.s.c.CachingDirectoryFactory return new directory for /home/jenkins/workspace/Lucene-Solr-master-Linux/solr/build/solr-core/test/J2/temp/solr.handler.component.DistributedFacetPivotLongTailTest_E8FD3A80180D004F-001/tempDir-001/shard1/cores/collection1/data
[junit4] 2> 479984 INFO (coreLoadExecutor-1704-thread-1) [ x:collection1] o.a.s.c.SolrCore New index directory detected: old=null new=/home/jenkins/workspace/Lucene-Solr-master-Linux/solr/build/solr-core/test/J2/temp/solr.handler.component.DistributedFacetPivotLongTailTest_E8FD3A80180D004F-001/tempDir-001/shard1/cores/collection1/data/index/
[junit4] 2> 479984 WARN (coreLoadExecutor-1704-thread-1) [ x:collection1] o.a.s.c.SolrCore [collection1] Solr index directory '/home/jenkins/workspace/Lucene-Solr-master-Linux/solr/build/solr-core/test/J2/temp/solr.handler.component.DistributedFacetPivotLongTailTest_E8FD3A80180D004F-001/tempDir-001/shard1/cores/collection1/data/index' doesn't exist. Creating new index...
[junit4] 2> 479984 INFO (coreLoadExecutor-1704-thread-1) [ x:collection1] o.a.s.c.CachingDirectoryFactory return new directory for /home/jenkins/workspace/Lucene-Solr-master-Linux/solr/build/solr-core/test/J2/temp/solr.handler.component.DistributedFacetPivotLongTailTest_E8FD3A80180D004F-001/tempDir-001/shard1/cores/collection1/data/index
[junit4] 2> 479984 INFO (coreLoadExecutor-1704-thread-1) [ x:collection1] o.a.s.u.RandomMergePolicy RandomMergePolicy wrapping class org.apache.lucene.index.TieredMergePolicy: [TieredMergePolicy: maxMergeAtOnce=41, maxMergeAtOnceExplicit=49, maxMergedSegmentMB=7.21484375, floorSegmentMB=1.3212890625, forceMergeDeletesPctAllowed=18.331618052014555, segmentsPerTier=13.0, maxCFSSegmentSizeMB=8.796093022207999E12, noCFSRatio=0.0
[junit4] 2> 479985 INFO (coreLoadExecutor-1704-thread-1) [ x:collection1] o.a.s.c.SolrDeletionPolicy SolrDeletionPolicy.onCommit: commits: num=1
[junit4] 2> commit{dir=MockDirectoryWrapper(RAMDirectory@185592c lockFactory=org.apache.lucene.store.SingleInstanceLockFactory@17f04e4),segFN=segments_1,generation=1}
[junit4] 2> 479985 INFO (coreLoadExecutor-1704-thread-1) [ x:collection1] o.a.s.c.SolrDeletionPolicy newest commit generation = 1
[junit4] 2> 479985 INFO (OldIndexDirectoryCleanupThreadForCore-collection1) [ x:collection1] o.a.s.c.SolrCore Looking for old index directories to cleanup for core collection1 in /home/jenkins/workspace/Lucene-Solr-master-Linux/solr/build/solr-core/test/J2/temp/solr.handler.component.DistributedFacetPivotLongTailTest_E8FD3A80180D004F-001/tempDir-001/shard1/cores/collection1/data/
[junit4] 2> 479985 WARN (OldIndexDirectoryCleanupThreadForCore-collection1) [ x:collection1] o.a.s.c.DirectoryFactory /home/jenkins/workspace/Lucene-Solr-master-Linux/solr/build/solr-core/test/J2/temp/solr.handler.component.DistributedFacetPivotLongTailTest_E8FD3A80180D004F-001/tempDir-001/shard1/cores/collection1/data/ does not point to a valid data directory; skipping clean-up of old index directories.
[junit4] 2> 479991 INFO (coreLoadExecutor-1704-thread-1) [ x:collection1] o.a.s.u.p.UpdateRequestProcessorChain creating updateRequestProcessorChain "dedupe"
[junit4] 2> 479991 INFO (coreLoadExecutor-1704-thread-1) [ x:collection1] o.a.s.u.p.UpdateRequestProcessorChain inserting DistributedUpdateProcessorFactory into updateRequestProcessorChain "dedupe"
[junit4] 2> 479991 INFO (coreLoadExecutor-1704-thread-1) [ x:collection1] o.a.s.u.p.UpdateRequestProcessorChain creating updateRequestProcessorChain "dedupe-allfields"
[junit4] 2> 479991 INFO (coreLoadExecutor-1704-thread-1) [ x:collection1] o.a.s.u.p.UpdateRequestProcessorChain inserting DistributedUpdateProcessorFactory into updateRequestProcessorChain "dedupe-allfields"
[junit4] 2> 479991 INFO (coreLoadExecutor-1704-thread-1) [ x:collection1] o.a.s.u.p.UpdateRequestProcessorChain creating updateRequestProcessorChain "stored_sig"
[junit4] 2> 479991 INFO (coreLoadExecutor-1704-thread-1) [ x:collection1] o.a.s.u.p.UpdateRequestProcessorChain inserting DistributedUpdateProcessorFactory into updateRequestProcessorChain "stored_sig"
[junit4] 2> 479991 INFO (coreLoadExecutor-1704-thread-1) [ x:collection1] o.a.s.u.p.UpdateRequestProcessorChain creating updateRequestProcessorChain "uniq-fields"
[junit4] 2> 479992 INFO (coreLoadExecutor-1704-thread-1) [ x:collection1] o.a.s.u.p.UpdateRequestProcessorChain inserting DistributedUpdateProcessorFactory into updateRequestProcessorChain "uniq-fields"
[junit4] 2> 479992 INFO (coreLoadExecutor-1704-thread-1) [ x:collection1] o.a.s.u.p.UpdateRequestProcessorChain creating updateRequestProcessorChain "distrib-dup-test-chain-explicit"
[junit4] 2> 479992 INFO (coreLoadExecutor-1704-thread-1) [ x:collection1] o.a.s.u.p.UpdateRequestProcessorChain creating updateRequestProcessorChain "distrib-dup-test-chain-implicit"
[junit4] 2> 479992 INFO (coreLoadExecutor-1704-thread-1) [ x:collection1] o.a.s.u.p.UpdateRequestProcessorChain inserting DistributedUpdateProcessorFactory into updateRequestProcessorChain "distrib-dup-test-chain-implicit"
[junit4] 2> 479992 INFO (coreLoadExecutor-1704-thread-1) [ x:collection1] o.a.s.c.SolrCore no updateRequestProcessorChain defined as default, creating implicit default
[junit4] 2> 479994 INFO (coreLoadExecutor-1704-thread-1) [ x:collection1] o.a.s.h.l.XMLLoader xsltCacheLifetimeSeconds=60
[junit4] 2> 479995 INFO (coreLoadExecutor-1704-thread-1) [ x:collection1] o.a.s.h.l.XMLLoader xsltCacheLifetimeSeconds=60
[junit4] 2> 479996 INFO (coreLoadExecutor-1704-thread-1) [ x:collection1] o.a.s.h.l.XMLLoader xsltCacheLifetimeSeconds=60
[junit4] 2> 479997 INFO (coreLoadExecutor-1704-thread-1) [ x:collection1] o.a.s.h.l.XMLLoader xsltCacheLifetimeSeconds=60
[junit4] 2> 480008 INFO (coreLoadExecutor-1704-thread-1) [ x:collection1] o.a.s.c.PluginBag requestHandler : 'lazy' created with startup=lazy
[junit4] 2> 480012 INFO (coreLoadExecutor-1704-thread-1) [ x:collection1] o.a.s.c.RequestHandlers Registered paths: /admin/mbeans,standard,spellCheckCompRH,lazy,/update/json/docs,/admin/luke,/export,spellCheckWithWordbreak_Direct,tvrh,/get,/admin/properties,/update/json,mltrh,/admin/threads,/search-facet-def,/update/csv,/sql,/graph,/search-facet-invariants,/admin/segments,spellCheckCompRH1,/mlt,/admin/system,/replication,dismax,defaults,/config,/stream,/schema,/admin/plugins,/admin/logging,spellCheckWithWordbreak,mock,/admin/ping,/update,/admin/file,/terms,spellCheckCompRH_Direct,/debug/dump
[junit4] 2> 480012 INFO (coreLoadExecutor-1704-thread-1) [ x:collection1] o.a.s.c.SolrCore Using default statsCache cache: org.apache.solr.search.stats.LocalStatsCache
[junit4] 2> 480013 INFO (coreLoadExecutor-1704-thread-1) [ x:collection1] o.a.s.u.UpdateHandler Using UpdateLog implementation: org.apache.solr.update.UpdateLog
[junit4] 2> 480013 INFO (coreLoadExecutor-1704-thread-1) [ x:collection1] o.a.s.u.UpdateLog Initializing UpdateLog: dataDir= defaultSyncLevel=FLUSH numRecordsToKeep=100 maxNumLogsToKeep=10 numVersionBuckets=65536
[junit4] 2> 480013 INFO (coreLoadExecutor-1704-thread-1) [ x:collection1] o.a.s.u.CommitTracker Hard AutoCommit: disabled
[junit4] 2> 480013 INFO (coreLoadExecutor-1704-thread-1) [ x:collection1] o.a.s.u.CommitTracker Soft AutoCommit: disabled
[junit4] 2> 480015 INFO (coreLoadExecutor-1704-thread-1) [ x:collection1] o.a.s.u.RandomMergePolicy RandomMergePolicy wrapping class org.apache.lucene.index.TieredMergePolicy: [TieredMergePolicy: maxMergeAtOnce=19, maxMergeAtOnceExplicit=33, maxMergedSegmentMB=59.375, floorSegmentMB=0.576171875, forceMergeDeletesPctAllowed=22.858316225570857, segmentsPerTier=25.0, maxCFSSegmentSizeMB=8.796093022207999E12, noCFSRatio=1.0
[junit4] 2> 480015 INFO (coreLoadExecutor-1704-thread-1) [ x:collection1] o.a.s.c.SolrDeletionPolicy SolrDeletionPolicy.onInit: commits: num=1
[junit4] 2> commit{dir=MockDirectoryWrapper(RAMDirectory@185592c lockFactory=org.apache.lucene.store.SingleInstanceLockFactory@17f04e4),segFN=segments_1,generation=1}
[junit4] 2> 480015 INFO (coreLoadExecutor-1704-thread-1) [ x:collection1] o.a.s.c.SolrDeletionPolicy newest commit generation = 1
[junit4] 2> 480015 INFO (coreLoadExecutor-1704-thread-1) [ x:collection1] o.a.s.s.SolrIndexSearcher Opening [Searcher@89bda0[collection1] main]
[junit4] 2> 480016 INFO (coreLoadExecutor-1704-thread-1) [ x:collection1] o.a.s.r.RestManager Initializing RestManager with initArgs: {storageIO=org.apache.solr.rest.ManagedResourceStorage$InMemoryStorageIO}
[junit4] 2> 480016 INFO (coreLoadExecutor-1704-thread-1) [ x:collection1] o.a.s.r.ManagedResourceStorage Reading _rest_managed.json using InMemoryStorage
[junit4] 2> 480016 INFO (coreLoadExecutor-1704-thread-1) [ x:collection1] o.a.s.r.RestManager Initializing 0 registered ManagedResources
[junit4] 2> 480016 INFO (coreLoadExecutor-1704-thread-1) [ x:collection1] o.a.s.h.c.SpellCheckComponent Initializing spell checkers
[junit4] 2> 480098 INFO (coreLoadExecutor-1704-thread-1) [ x:collection1] o.a.s.s.DirectSolrSpellChecker init: {name=direct,classname=DirectSolrSpellChecker,field=lowerfilt,minQueryLength=3}
[junit4] 2> 480281 INFO (coreLoadExecutor-1704-thread-1) [ x:collection1] o.a.s.h.ReplicationHandler Commits will be reserved for 10000
[junit4] 2> 480281 INFO (searcherExecutor-1705-thread-1-processing-x:collection1) [ x:collection1] o.a.s.h.c.SpellCheckComponent Loading spell index for spellchecker: default
[junit4] 2> 480282 INFO (searcherExecutor-1705-thread-1-processing-x:collection1) [ x:collection1] o.a.s.h.c.SpellCheckComponent Loading spell index for spellchecker: direct
[junit4] 2> 480282 INFO (searcherExecutor-1705-thread-1-processing-x:collection1) [ x:collection1] o.a.s.h.c.SpellCheckComponent Loading spell index for spellchecker: wordbreak
[junit4] 2> 480282 INFO (searcherExecutor-1705-thread-1-processing-x:collection1) [ x:collection1] o.a.s.h.c.SpellCheckComponent Loading spell index for spellchecker: multipleFields
[junit4] 2> 480282 INFO (searcherExecutor-1705-thread-1-processing-x:collection1) [ x:collection1] o.a.s.h.c.SpellCheckComponent Loading spell index for spellchecker: jarowinkler
[junit4] 2> 480282 INFO (searcherExecutor-1705-thread-1-processing-x:collection1) [ x:collection1] o.a.s.h.c.SpellCheckComponent Loading spell index for spellchecker: external
[junit4] 2> 480282 INFO (searcherExecutor-1705-thread-1-processing-x:collection1) [ x:collection1] o.a.s.h.c.SpellCheckComponent Loading spell index for spellchecker: freq
[junit4] 2> 480283 INFO (coreLoadExecutor-1704-thread-1) [ x:collection1] o.a.s.u.UpdateLog Looking up max value of version field to seed version buckets
[junit4] 2> 480283 INFO (coreLoadExecutor-1704-thread-1) [ x:collection1] o.a.s.u.VersionInfo Refreshing highest value of _version_ for 65536 version buckets from index
[junit4] 2> 480283 INFO (coreLoadExecutor-1704-thread-1) [ x:collection1] o.a.s.u.VersionInfo No terms found for _version_, cannot seed version bucket highest value from index
[junit4] 2> 480283 INFO (coreLoadExecutor-1704-thread-1) [ x:collection1] o.a.s.u.UpdateLog Could not find max version in index or recent updates, using new clock 1542010751668977664
[junit4] 2> 480283 INFO (searcherExecutor-1705-thread-1-processing-x:collection1) [ x:collection1] o.a.s.h.c.SpellCheckComponent Loading spell index for spellchecker: fqcn
[junit4] 2> 480283 INFO (searcherExecutor-1705-thread-1-processing-x:collection1) [ x:collection1] o.a.s.h.c.SpellCheckComponent Loading spell index for spellchecker: perDict
[junit4] 2> 480284 INFO (coreLoadExecutor-1704-thread-1) [ x:collection1] o.a.s.u.UpdateLog Took 1.0ms to seed version buckets with highest version 1542010751668977664
[junit4] 2> 480285 INFO (coreLoadExecutor-1704-thread-1) [ x:collection1] o.a.s.c.CoreContainer registering core: collection1
[junit4] 2> 480285 INFO (searcherExecutor-1705-thread-1-processing-x:collection1) [ x:collection1] o.a.s.c.SolrCore [collection1] Registered new searcher Searcher@89bda0[collection1] main{ExitableDirectoryReader(UninvertingDirectoryReader())}
[junit4] 2> 480442 INFO (TEST-DistributedFacetPivotLongTailTest.test-seed#[E8FD3A80180D004F]) [ ] o.a.s.SolrTestCaseJ4 Writing core.properties file to /home/jenkins/workspace/Lucene-Solr-master-Linux/solr/build/solr-core/test/J2/temp/solr.handler.component.DistributedFacetPivotLongTailTest_E8FD3A80180D004F-001/tempDir-001/shard2/cores/collection1
[junit4] 2> 480445 INFO (TEST-DistributedFacetPivotLongTailTest.test-seed#[E8FD3A80180D004F]) [ ] o.e.j.s.Server jetty-9.3.8.v20160314
[junit4] 2> 480447 INFO (TEST-DistributedFacetPivotLongTailTest.test-seed#[E8FD3A80180D004F]) [ ] o.e.j.s.h.ContextHandler Started o.e.j.s.ServletContextHandler@8045b5{/,null,AVAILABLE}
[junit4] 2> 480450 INFO (TEST-DistributedFacetPivotLongTailTest.test-seed#[E8FD3A80180D004F]) [ ] o.e.j.s.ServerConnector Started ServerConnector@1536806{SSL,[ssl, http/1.1]}{127.0.0.1:33611}
[junit4] 2> 480450 INFO (TEST-DistributedFacetPivotLongTailTest.test-seed#[E8FD3A80180D004F]) [ ] o.e.j.s.Server Started @481706ms
[junit4] 2> 480451 INFO (TEST-DistributedFacetPivotLongTailTest.test-seed#[E8FD3A80180D004F]) [ ] o.a.s.c.s.e.JettySolrRunner Jetty properties: {hostContext=/, hostPort=33611, coreRootDirectory=/home/jenkins/workspace/Lucene-Solr-master-Linux/solr/build/solr-core/test/J2/temp/solr.handler.component.DistributedFacetPivotLongTailTest_E8FD3A80180D004F-001/tempDir-001/shard2/cores}
[junit4] 2> 480451 INFO (TEST-DistributedFacetPivotLongTailTest.test-seed#[E8FD3A80180D004F]) [ ] o.a.s.s.SolrDispatchFilter SolrDispatchFilter.init(): sun.misc.Launcher$AppClassLoader@1d16e93
[junit4] 2> 480451 INFO (TEST-DistributedFacetPivotLongTailTest.test-seed#[E8FD3A80180D004F]) [ ] o.a.s.c.SolrResourceLoader new SolrResourceLoader for directory: '/home/jenkins/workspace/Lucene-Solr-master-Linux/solr/build/solr-core/test/J2/temp/solr.handler.component.DistributedFacetPivotLongTailTest_E8FD3A80180D004F-001/tempDir-001/shard2'
[junit4] 2> 480451 INFO (TEST-DistributedFacetPivotLongTailTest.test-seed#[E8FD3A80180D004F]) [ ] o.a.s.c.SolrResourceLoader JNDI not configured for solr (NoInitialContextEx)
[junit4] 2> 480451 INFO (TEST-DistributedFacetPivotLongTailTest.test-seed#[E8FD3A80180D004F]) [ ] o.a.s.c.SolrResourceLoader solr home defaulted to 'solr/' (could not find system property or JNDI)
[junit4] 2> 480451 INFO (TEST-DistributedFacetPivotLongTailTest.test-seed#[E8FD3A80180D004F]) [ ] o.a.s.c.SolrXmlConfig Loading container configuration from /home/jenkins/workspace/Lucene-Solr-master-Linux/solr/build/solr-core/test/J2/temp/solr.handler.component.DistributedFacetPivotLongTailTest_E8FD3A80180D004F-001/tempDir-001/shard2/solr.xml
[junit4] 2> 480464 INFO (TEST-DistributedFacetPivotLongTailTest.test-seed#[E8FD3A80180D004F]) [ ] o.a.s.c.CorePropertiesLocator Config-defined core root directory: /home/jenkins/workspace/Lucene-Solr-master-Linux/solr/build/solr-core/test/J2/temp/solr.handler.component.DistributedFacetPivotLongTailTest_E8FD3A80180D004F-001/tempDir-001/shard2/cores
[junit4] 2> 480464 INFO (TEST-DistributedFacetPivotLongTailTest.test-seed#[E8FD3A80180D004F]) [ ] o.a.s.c.CoreContainer New CoreContainer 9967877
[junit4] 2> 480464 INFO (TEST-DistributedFacetPivotLongTailTest.test-seed#[E8FD3A80180D004F]) [ ] o.a.s.c.CoreContainer Loading cores into CoreContainer [instanceDir=/home/jenkins/workspace/Lucene-Solr-master-Linux/solr/build/solr-core/test/J2/temp/solr.handler.component.DistributedFacetPivotLongTailTest_E8FD3A80180D004F-001/tempDir-001/shard2]
[junit4] 2> 480465 WARN (TEST-DistributedFacetPivotLongTailTest.test-seed#[E8FD3A80180D004F]) [ ] o.a.s.c.CoreContainer Couldn't add files from /home/jenkins/workspace/Lucene-Solr-master-Linux/solr/build/solr-core/test/J2/temp/solr.handler.component.DistributedFacetPivotLongTailTest_E8FD3A80180D004F-001/tempDir-001/shard2/lib to classpath: /home/jenkins/workspace/Lucene-Solr-master-Linux/solr/build/solr-core/test/J2/temp/solr.handler.component.DistributedFacetPivotLongTailTest_E8FD3A80180D004F-001/tempDir-001/shard2/lib
[junit4] 2> 480465 INFO (TEST-DistributedFacetPivotLongTailTest.test-seed#[E8FD3A80180D004F]) [ ] o.a.s.h.c.HttpShardHandlerFactory created with socketTimeout : 90000,urlScheme : https,connTimeout : 15000,maxConnectionsPerHost : 20,maxConnections : 10000,corePoolSize : 0,maximumPoolSize : 2147483647,maxThreadIdleTime : 5,sizeOfQueue : -1,fairnessPolicy : false,
[junit4] 2> 480467 INFO (TEST-DistributedFacetPivotLongTailTest.test-seed#[E8FD3A80180D004F]) [ ] o.a.s.u.UpdateShardHandler Created UpdateShardHandler HTTP client with params: socketTimeout=340000&connTimeout=45000&maxConnections=100000&maxConnectionsPe
[...truncated too long message...]
s:shard2 r:core_node4 x:test_col_shard2_replica1] o.a.s.c.CachingDirectoryFactory looking to close /home/jenkins/workspace/Lucene-Solr-master-Linux/solr/build/solr-core/test/J2/temp/solr.cloud.TestTolerantUpdateProcessorCloud_E8FD3A80180D004F-001/tempDir-001/node2/./test_col_shard2_replica1/data/snapshot_metadata [CachedDir<<refCount=0;path=/home/jenkins/workspace/Lucene-Solr-master-Linux/solr/build/solr-core/test/J2/temp/solr.cloud.TestTolerantUpdateProcessorCloud_E8FD3A80180D004F-001/tempDir-001/node2/./test_col_shard2_replica1/data/snapshot_metadata;done=false>>]
[junit4] 2> 1810395 INFO (coreCloseExecutor-6256-thread-1) [n:127.0.0.1:46212_solr c:test_col s:shard2 r:core_node4 x:test_col_shard2_replica1] o.a.s.c.CachingDirectoryFactory Closing directory, CoreContainer#isShutdown=true
[junit4] 2> 1810395 INFO (coreCloseExecutor-6256-thread-1) [n:127.0.0.1:46212_solr c:test_col s:shard2 r:core_node4 x:test_col_shard2_replica1] o.a.s.c.CachingDirectoryFactory Closing directory: /home/jenkins/workspace/Lucene-Solr-master-Linux/solr/build/solr-core/test/J2/temp/solr.cloud.TestTolerantUpdateProcessorCloud_E8FD3A80180D004F-001/tempDir-001/node2/./test_col_shard2_replica1/data/snapshot_metadata
[junit4] 2> 1810395 INFO (coreCloseExecutor-6256-thread-1) [n:127.0.0.1:46212_solr c:test_col s:shard2 r:core_node4 x:test_col_shard2_replica1] o.a.s.c.CachingDirectoryFactory looking to close /home/jenkins/workspace/Lucene-Solr-master-Linux/solr/build/solr-core/test/J2/temp/solr.cloud.TestTolerantUpdateProcessorCloud_E8FD3A80180D004F-001/tempDir-001/node2/./test_col_shard2_replica1/data [CachedDir<<refCount=0;path=/home/jenkins/workspace/Lucene-Solr-master-Linux/solr/build/solr-core/test/J2/temp/solr.cloud.TestTolerantUpdateProcessorCloud_E8FD3A80180D004F-001/tempDir-001/node2/./test_col_shard2_replica1/data;done=false>>]
[junit4] 2> 1810395 INFO (coreCloseExecutor-6256-thread-1) [n:127.0.0.1:46212_solr c:test_col s:shard2 r:core_node4 x:test_col_shard2_replica1] o.a.s.c.CachingDirectoryFactory Closing directory, CoreContainer#isShutdown=true
[junit4] 2> 1810395 INFO (coreCloseExecutor-6256-thread-1) [n:127.0.0.1:46212_solr c:test_col s:shard2 r:core_node4 x:test_col_shard2_replica1] o.a.s.c.CachingDirectoryFactory Closing directory: /home/jenkins/workspace/Lucene-Solr-master-Linux/solr/build/solr-core/test/J2/temp/solr.cloud.TestTolerantUpdateProcessorCloud_E8FD3A80180D004F-001/tempDir-001/node2/./test_col_shard2_replica1/data
[junit4] 2> 1810812 INFO (jetty-launcher-2445-thread-7) [ ] o.e.j.s.h.ContextHandler Stopped o.e.j.s.ServletContextHandler@6ee9e2{/solr,null,UNAVAILABLE}
[junit4] 2> 1810812 INFO (SUITE-TestTolerantUpdateProcessorCloud-seed#[E8FD3A80180D004F]-worker) [ ] o.a.s.c.ZkTestServer connecting to 127.0.0.1:34658 34658
[junit4] 2> 1810815 INFO (SUITE-TestTolerantUpdateProcessorCloud-seed#[E8FD3A80180D004F]-worker) [ ] o.a.s.SolrTestCaseJ4 ###deleteCore
[junit4] 2> NOTE: leaving temporary files on disk at: /home/jenkins/workspace/Lucene-Solr-master-Linux/solr/build/solr-core/test/J2/temp/solr.cloud.TestTolerantUpdateProcessorCloud_E8FD3A80180D004F-001
[junit4] 2> NOTE: test params are: codec=Asserting(Lucene62): {foo_i=BlockTreeOrds(blocksize=128), expected_shard_s=Lucene50(blocksize=128), _version_=PostingsFormat(name=Memory doPackFST= false), id=PostingsFormat(name=Asserting)}, docValues:{}, maxPointsInLeafNode=1467, maxMBSortInHeap=5.626015681048854, sim=RandomSimilarity(queryNorm=false): {}, locale=lt, timezone=SystemV/CST6
[junit4] 2> NOTE: Linux 4.4.0-31-generic i386/Oracle Corporation 1.8.0_102 (32-bit)/cpus=12,threads=1,free=217998800,total=477364224
[junit4] 2> NOTE: All tests run in this JVM: [LeaderElectionTest, TestConfigSetImmutable, FullSolrCloudDistribCmdsTest, HdfsRecoveryZkTest, TestDynamicLoading, TestAnalyzeInfixSuggestions, CollectionsAPISolrJTest, TestFieldSortValues, TestSizeLimitedDistributedMap, CoreAdminCreateDiscoverTest, QueryParsingTest, TestSolrCloudWithSecureImpersonation, SuggesterTSTTest, DistributedDebugComponentTest, TestMacros, TestFieldCacheSortRandom, TestObjectReleaseTracker, DirectoryFactoryTest, CoreAdminHandlerTest, SimpleFacetsTest, DeleteShardTest, TestSolrIndexConfig, UnloadDistributedZkTest, NoCacheHeaderTest, CollectionStateFormat2Test, ParsingFieldUpdateProcessorsTest, RegexBoostProcessorTest, StatelessScriptUpdateProcessorFactoryTest, FieldMutatingUpdateProcessorTest, HdfsWriteToMultipleCollectionsTest, TestSQLHandler, TestPerFieldSimilarity, TestFreeTextSuggestions, DistributedVersionInfoTest, TestCharFilters, TestSolrQueryParser, TestCSVResponseWriter, TestJmxIntegration, DeleteInactiveReplicaTest, PrimitiveFieldTypeTest, TestSearcherReuse, DistributedFacetPivotLongTailTest, TestXmlQParserPlugin, TestSchemaSimilarityResource, OverseerTest, TestCollationField, LeaderFailoverAfterPartitionTest, JavabinLoaderTest, TestManagedSchemaAPI, TestIndexingPerformance, DocValuesMissingTest, CircularListTest, DirectUpdateHandlerOptimizeTest, CdcrUpdateLogTest, SolrCloudExampleTest, TestHdfsCloudBackupRestore, ClusterStateTest, ScriptEngineTest, CursorMarkTest, TestReversedWildcardFilterFactory, DirectUpdateHandlerTest, SuggestComponentContextFilterQueryTest, BlockJoinFacetDistribTest, CurrencyFieldXmlFileTest, TestOrdValues, BitVectorTest, OverseerRolesTest, SolrTestCaseJ4Test, CdcrRequestHandlerTest, CleanupOldIndexTest, SuggesterTest, TestLocalFSCloudBackupRestore, BooleanFieldTest, TestManagedStopFilterFactory, DistribDocExpirationUpdateProcessorTest, InfoHandlerTest, TestAuthorizationFramework, TestUninvertingReader, BlockDirectoryTest, TestLegacyFieldCache, DistributedFacetPivotWhiteBoxTest, SampleTest, TestSha256AuthenticationProvider, TestManagedResource, HardAutoCommitTest, QueryResultKeyTest, TestRebalanceLeaders, TestBlobHandler, ZkStateReaderTest, TestRecovery, DocValuesMultiTest, TestCoreDiscovery, LukeRequestHandlerTest, FieldAnalysisRequestHandlerTest, TestFieldTypeResource, TestExtendedDismaxParser, DirectSolrConnectionTest, PluginInfoTest, HLLSerializationTest, SuggesterWFSTTest, MigrateRouteKeyTest, LeaderElectionIntegrationTest, TestReplicationHandler, TestGroupingSearch, TestIndexSearcher, ShowFileRequestHandlerTest, CurrencyFieldOpenExchangeTest, SolrIndexSplitterTest, SimplePostToolTest, SpellCheckCollatorTest, SuggesterFSTTest, DocValuesTest, SolrPluginUtilsTest, JsonLoaderTest, TestPHPSerializedResponseWriter, HighlighterConfigTest, UpdateParamsTest, CopyFieldTest, SolrIndexConfigTest, MultiTermTest, TestDocSet, TestBinaryField, TestSearchPerf, TestElisionMultitermQuery, TestConfig, OutputWriterTest, TestFuzzyAnalyzedSuggestions, TestPostingsSolrHighlighter, TestPhraseSuggestions, TestCodecSupport, TestXIncludeConfig, TestSweetSpotSimilarityFactory, TestLMDirichletSimilarityFactory, TestLMJelinekMercerSimilarityFactory, TestFastWriter, TestJmxMonitoredMap, TimeZoneUtilsTest, TestFastOutputStream, URLClassifyProcessorTest, TestFastLRUCache, DateMathParserTest, TestSystemIdResolver, PrimUtilsTest, TestSuggestSpellingConverter, SpellingQueryConverterTest, DOMUtilTest, RAMDirectoryFactoryTest, TestDocumentBuilder, UUIDFieldTest, TestRTGBase, TestDistributedMissingSort, TestSimpleTrackingShardHandler, TestJettySolrRunner, AliasIntegrationTest, CustomCollectionTest, LeaderInitiatedRecoveryOnCommitTest, LeaderInitiatedRecoveryOnShardRestartTest, OverriddenZkACLAndCredentialsProvidersTest, OverseerCollectionConfigSetProcessorTest, OverseerModifyCollectionTest, OverseerStatusTest, OverseerTaskQueueTest, RemoteQueryErrorTest, TestCloudPseudoReturnFields, TestCollectionAPI, TestDownShardTolerantSearch, TestLeaderInitiatedRecoveryThread, TestOnReconnectListenerSupport, TestTolerantUpdateProcessorCloud]
[junit4] Completed [536/626 (2!)] on J2 in 163.62s, 19 tests, 1 error <<< FAILURES!
[...truncated 272 lines...]
[junit4] JVM J2: stdout was not empty, see: /home/jenkins/workspace/Lucene-Solr-master-Linux/solr/build/solr-core/test/temp/junit4-J2-20160807_131247_911.sysout
[junit4] >>> JVM J2 emitted unexpected output (verbatim) ----
[junit4] java.lang.OutOfMemoryError: GC overhead limit exceeded
[junit4] Dumping heap to /home/jenkins/workspace/Lucene-Solr-master-Linux/heapdumps/java_pid19132.hprof ...
[junit4] Heap dump file created [437676203 bytes in 1.937 secs]
[junit4] <<< JVM J2: EOF ----
[junit4] JVM J2: stderr was not empty, see: /home/jenkins/workspace/Lucene-Solr-master-Linux/solr/build/solr-core/test/temp/junit4-J2-20160807_131247_911.syserr
[junit4] >>> JVM J2 emitted unexpected output (verbatim) ----
[junit4]
[junit4] Exception: java.lang.OutOfMemoryError thrown from the UncaughtExceptionHandler in thread "NIOServerCxn.Factory:0.0.0.0/0.0.0.0:0"
[junit4] <<< JVM J2: EOF ----
[...truncated 674 lines...]
[junit4] JVM J0: stdout was not empty, see: /home/jenkins/workspace/Lucene-Solr-master-Linux/solr/build/solr-solrj/test/temp/junit4-J0-20160807_135333_645.sysout
[junit4] >>> JVM J0 emitted unexpected output (verbatim) ----
[junit4] java.lang.OutOfMemoryError: GC overhead limit exceeded
[junit4] Dumping heap to /home/jenkins/workspace/Lucene-Solr-master-Linux/heapdumps/java_pid27284.hprof ...
[junit4] Heap dump file created [431631148 bytes in 1.552 secs]
[junit4] <<< JVM J0: EOF ----
[...truncated 10378 lines...]
BUILD FAILED
/home/jenkins/workspace/Lucene-Solr-master-Linux/build.xml:763: The following error occurred while executing this line:
/home/jenkins/workspace/Lucene-Solr-master-Linux/build.xml:715: Some of the tests produced a heap dump, but did not fail. Maybe a suppressed OutOfMemoryError? Dumps created:
* java_pid19132.hprof
* java_pid27284.hprof
Total time: 74 minutes 16 seconds
Build step 'Invoke Ant' marked build as failure
Archiving artifacts
[WARNINGS] Skipping publisher since build result is FAILURE
Recording test results
Email was triggered for: Failure - Any
Sending email for trigger: Failure - Any