You are viewing a plain text version of this content. The canonical link for it is here.
Posted to dev@royale.apache.org by ap...@gmail.com on 2020/02/18 07:54:06 UTC
Build failed in Jenkins: Royale_ASDoc_Example #639
See <http://apacheroyaleci2.westus2.cloudapp.azure.com:8080/job/Royale_ASDoc_Example/639/display/redirect?page=changes>
Changes:
[greg.dove] Fix for currentState bindings not working. It is either this fix, or
------------------------------------------
[...truncated 5.25 KB...]
[mxmlc] 14
[mxmlc] -output=<http://apacheroyaleci2.westus2.cloudapp.azure.com:8080/job/Royale_ASDoc_Example/639/artifact/examples/royale/ASDoc/bin-debug/ASDoc.swf>
[mxmlc] --
[mxmlc] <http://apacheroyaleci2.westus2.cloudapp.azure.com:8080/job/Royale_ASDoc_Example/639/artifact/examples/royale/ASDoc/src/main/royale/ASDoc.mxml>
[mxmlc] Loading configuration: C:\jenkins\workspace\royale-asjs\frameworks\royale-config.xml
[mxmlc] Loading configuration: <http://apacheroyaleci2.westus2.cloudapp.azure.com:8080/job/Royale_ASDoc_Example/639/artifact/examples/royale/ASDoc/src/main/config/compile-app-config.xml>
[mxmlc]
[mxmlc] 131246 bytes written to C:\jenkins\workspace\Royale_ASDoc_Example\examples\royale\ASDoc\bin-debug\ASDoc.swf in 10.618 seconds
[mxmlc] The project 'ASDoc' has been successfully compiled.
[mxmlc] 29.9576657 seconds
[mxmlc] Picked up JAVA_TOOL_OPTIONS: -Dfile.encoding=UTF-8 -Xms384m -Xmx2g
build_example.check-air:
build_example.wrapper:
[copy] Copying 1 file to <http://apacheroyaleci2.westus2.cloudapp.azure.com:8080/job/Royale_ASDoc_Example/639/artifact/examples/royale/ASDoc/bin-debug>
[copy] Copied 1 empty directory to 1 empty directory under <http://apacheroyaleci2.westus2.cloudapp.azure.com:8080/job/Royale_ASDoc_Example/639/artifact/examples/royale/ASDoc/bin-debug/history>
[copy] Copying 2 files to <http://apacheroyaleci2.westus2.cloudapp.azure.com:8080/job/Royale_ASDoc_Example/639/artifact/examples/royale/ASDoc/bin-debug>
build_example.check-resources:
build_example.copy-resources:
[copy] Copying 1 file to <http://apacheroyaleci2.westus2.cloudapp.azure.com:8080/job/Royale_ASDoc_Example/639/artifact/examples/royale/ASDoc/bin-debug>
build_example.compile-js-release:
[mxmlc] MXMLJSC
[mxmlc] -load-config+=<http://apacheroyaleci2.westus2.cloudapp.azure.com:8080/job/Royale_ASDoc_Example/639/artifact/examples/royale/ASDoc/src/main/config/compile-app-config.xml>
[mxmlc] -js-dynamic-access-unknown-members=true
[mxmlc] +playerglobal.version=11.7
[mxmlc] +env.PLAYERGLOBAL_HOME=C:\adobe\flash
[mxmlc] -compiler.debug=false
[mxmlc] +royalelib=C:\jenkins\workspace\royale-asjs/frameworks/
[mxmlc] -closure-lib=C:\jenkins\workspace\royale-asjs/js/lib/google/closure-library
[mxmlc] +configname=royale
[mxmlc] -swf-version
[mxmlc] 14
[mxmlc] -output=<http://apacheroyaleci2.westus2.cloudapp.azure.com:8080/job/Royale_ASDoc_Example/639/artifact/examples/royale/ASDoc/bin-release/ASDoc.swf>
[mxmlc] --
[mxmlc] <http://apacheroyaleci2.westus2.cloudapp.azure.com:8080/job/Royale_ASDoc_Example/639/artifact/examples/royale/ASDoc/src/main/royale/ASDoc.mxml>
[mxmlc] Loading configuration: C:\jenkins\workspace\royale-asjs\frameworks\royale-config.xml
[mxmlc] Loading configuration: <http://apacheroyaleci2.westus2.cloudapp.azure.com:8080/job/Royale_ASDoc_Example/639/artifact/examples/royale/ASDoc/src/main/config/compile-app-config.xml>
[mxmlc]
[mxmlc] 66493 bytes written to C:\jenkins\workspace\Royale_ASDoc_Example\examples\royale\ASDoc\bin-release\ASDoc.swf in 7.471 seconds
[mxmlc] Feb 18, 2020 7:51:31 AM com.google.javascript.jscomp.LoggerErrorManager printSummary
[mxmlc] INFO: 0 error(s), 0 warning(s), 97.3% typed
[mxmlc] The project 'ASDoc' has been successfully compiled and optimized.
[mxmlc] 51.7942321 seconds
[mxmlc] Picked up JAVA_TOOL_OPTIONS: -Dfile.encoding=UTF-8 -Xms384m -Xmx2g
build_example.check-air:
build_example.copy-app-xml:
main:
json:
[echo] ROYALE_COMPILER_HOME: C:\jenkins\workspace\royale-asjs/js
[java] C:\jenkins\workspace\royale-asjs\frameworks\projects\Core\src\main\royale\org\apache\royale\utils\object\defineSimpleProperty.as(36): col: 12 Encountered this keyword within closure. Value of this will not be the same as enclosing scope.
[java]
[java] return this[privateProp];
[java] ^
[java]
[java] C:\jenkins\workspace\royale-asjs\frameworks\projects\Core\src\main\royale\org\apache\royale\utils\object\defineSimpleProperty.as(39): col: 5 Encountered this keyword within closure. Value of this will not be the same as enclosing scope.
[java]
[java] this[privateProp] = val;
[java] ^
[java]
[java] C:\jenkins\workspace\royale-asjs\frameworks\projects\GoogleMaps\src\main\royale\org\apache\royale\maps\google\beads\GoogleMapView.as(114): col: 6 Encountered this keyword within closure. Value of this will not be the same as enclosing scope.
[java]
[java] (this['mapView'] as GoogleMapView).finishInitialization();
[java] ^
[java]
[java] C:\jenkins\workspace\royale-asjs\frameworks\projects\Jewel\src\main\royale\JewelClasses.as(84): col: 13 Definition org.apache.royale.jewel.beads.views.CheckBoxView could not be found.
[java]
[java] import org.apache.royale.jewel.beads.views.CheckBoxView; CheckBoxView;
[java] ^
[java]
[java] C:\jenkins\workspace\royale-asjs\frameworks\projects\Jewel\src\main\royale\JewelClasses.as(84): col: 63 Access of possibly undefined property CheckBoxView.
[java]
[java] import org.apache.royale.jewel.beads.views.CheckBoxView; CheckBoxView;
[java] ^
[java]
[java] C:\jenkins\workspace\royale-asjs\frameworks\projects\Language\src\main\royale\org\apache\royale\utils\Language.as(148): col: 17 Use of the instanceof operator. The instanceof operator is deprecated, use the is operator instead.
[java]
[java] if (leftOperand instanceof rightOperand)
[java] ^
[java]
[java] C:\jenkins\workspace\royale-asjs\frameworks\projects\Language\src\main\royale\org\apache\royale\utils\Language.as(721): col: 36 Use of the instanceof operator. The instanceof operator is deprecated, use the is operator instead.
[java]
[java] var ret:Boolean = base && v[Language.SYNTH_TAG_FIELD] instanceof langSynthType['_types'][typeName];
[java] ^
[java]
[java] C:\jenkins\workspace\royale-asjs\frameworks\projects\MXRoyale\src\main\royale\mx\charts\AreaChart.as(231): col: 21 Encountered this keyword within closure. Value of this will not be the same as enclosing scope.
[java]
[java] this.areaFill = fill;
[java] ^
[java]
[java] C:\jenkins\workspace\royale-asjs\frameworks\projects\MXRoyale\src\main\royale\mx\charts\AreaChart.as(232): col: 21 Encountered this keyword within closure. Value of this will not be the same as enclosing scope.
[java]
[java] this.fill = fill;
[java] ^
[java]
[java] C:\jenkins\workspace\royale-asjs\frameworks\projects\MXRoyale\src\main\royale\mx\charts\CandlestickChart.as(231): col: 22 Encountered this keyword within closure. Value of this will not be the same as enclosing scope.
[java]
[java] this.boxStroke = boxStroke;
[java] ^
[java]
[java] C:\jenkins\workspace\royale-asjs\frameworks\projects\MXRoyale\src\main\royale\mx\charts\CandlestickChart.as(232): col: 22 Encountered this keyword within closure. Value of this will not be the same as enclosing scope.
[java]
[java] this.declineFill = declineFill;
[java] ^
[java]
[java] C:\jenkins\workspace\royale-asjs\frameworks\projects\MXRoyale\src\main\royale\mx\charts\HLOCChart.as(228): col: 22 Encountered this keyword within closure. Value of this will not be the same as enclosing scope.
[java]
[java] this.closeTickStroke = tickStroke;
[java] ^
[java]
[java] C:\jenkins\workspace\royale-asjs\frameworks\projects\MXRoyale\src\main\royale\mx\charts\HLOCChart.as(229): col: 22 Encountered this keyword within closure. Value of this will not be the same as enclosing scope.
[java]
[java] this.openTickStroke = tickStroke;
[java] ^
[java]
[java] C:\jenkins\workspace\royale-asjs\frameworks\projects\MXRoyale\src\main\royale\mx\charts\HLOCChart.as(230): col: 22 Encountered this keyword within closure. Value of this will not be the same as enclosing scope.
[java]
[java] this.stroke = stroke;
[java] ^
[java]
[java] C:\jenkins\workspace\royale-asjs\frameworks\projects\MXRoyale\src\main\royale\mx\charts\HLOCChart.as(231): col: 22 Encountered this keyword within closure. Value of this will not be the same as enclosing scope.
[java]
[java] this.hlocColor = stroke.color;
[java] ^
[java]
[java] C:\jenkins\workspace\royale-asjs\frameworks\projects\MXRoyale\src\main\royale\mx\charts\LineChart.as(179): col: 22 Encountered this keyword within closure. Value of this will not be the same as enclosing scope.
[java]
[java] this.lineStroke = stroke;
[java] ^
[java]
[java] C:\jenkins\workspace\royale-asjs\frameworks\projects\MXRoyale\src\main\royale\mx\charts\LineChart.as(180): col: 22 Encountered this keyword within closure. Value of this will not be the same as enclosing scope.
[java]
[java] this.stroke = stroke;
[java] ^
[java]
[java] C:\jenkins\workspace\royale-asjs\frameworks\projects\MXRoyale\src\main\royale\mx\charts\LineChart.as(181): col: 22 Encountered this keyword within closure. Value of this will not be the same as enclosing scope.
[java]
[java] this.lineSegmentRenderer = new ClassFactory(LineRenderer);
[java] ^
[java]
[java] C:\jenkins\workspace\royale-asjs\frameworks\projects\MXRoyale\src\main\royale\mx\charts\PlotChart.as(158): col: 22 Encountered this keyword within closure. Value of this will not be the same as enclosing scope.
[java]
[java] this.fill = fill;
[java] ^
[java]
[java] C:\jenkins\workspace\royale-asjs\frameworks\projects\MXRoyale\src\main\royale\mx\charts\PlotChart.as(159): col: 22 Encountered this keyword within closure. Value of this will not be the same as enclosing scope.
[java]
[java] this.itemRenderer = skin;
[java] ^
[java]
[java] C:\jenkins\workspace\royale-asjs\frameworks\projects\MXRoyale\src\main\royale\mx\charts\PlotChart.as(160): col: 22 Encountered this keyword within closure. Value of this will not be the same as enclosing scope.
[java]
[java] this.radius = radius
[java] ^
[java]
[java] C:\jenkins\workspace\royale-asjs\frameworks\projects\MXRoyale\src\main\royale\mx\charts\styles\HaloDefaults.as(213): col: 6 Encountered this keyword within closure. Value of this will not be the same as enclosing scope.
[java]
[java] this.fill = defaultFill;
[java] ^
[java]
[java] C:\jenkins\workspace\royale-asjs\frameworks\projects\MXRoyale\src\main\royale\mx\charts\styles\HaloDefaults.as(214): col: 6 Encountered this keyword within closure. Value of this will not be the same as enclosing scope.
[java]
[java] this.areaFill = defaultFill;
[java] ^
[java]
[java] C:\jenkins\workspace\royale-asjs\frameworks\projects\MXRoyale\src\main\royale\mx\charts\styles\HaloDefaults.as(215): col: 6 Encountered this keyword within closure. Value of this will not be the same as enclosing scope.
[java]
[java] this.areaStroke = emptyStroke;
[java] ^
[java]
[java] C:\jenkins\workspace\royale-asjs\frameworks\projects\MXRoyale\src\main\royale\mx\charts\styles\HaloDefaults.as(216): col: 6 Encountered this keyword within closure. Value of this will not be the same as enclosing scope.
[java]
[java] this.lineStroke = defaultStroke;
[java] ^
[java]
[java] C:\jenkins\workspace\royale-asjs\frameworks\projects\MXRoyale\src\main\royale\mx\utils\ObjectUtil.as(715): col: 34 Use of the instanceof operator. The instanceof operator is deprecated, use the is operator instead.
[java]
[java] isDict = value instanceof Map || value instanceof WeakMap;
[java] ^
[java]
[java] C:\jenkins\workspace\royale-asjs\frameworks\projects\MXRoyale\src\main\royale\mx\utils\ObjectUtil.as(715): col: 58 Use of the instanceof operator. The instanceof operator is deprecated, use the is operator instead.
[java]
[java] isDict = value instanceof Map || value instanceof WeakMap;
[java] ^
[java]
[java] C:\jenkins\workspace\royale-asjs\frameworks\projects\MXRoyale\src\main\royale\mx\utils\ObjectUtil.as(1447): col: 32 Use of the instanceof operator. The instanceof operator is deprecated, use the is operator instead.
[java]
[java] var isDict:Boolean = (obj instanceof Map || obj instanceof WeakMap);
[java] ^
[java]
[java] C:\jenkins\workspace\royale-asjs\frameworks\projects\MXRoyale\src\main\royale\mx\utils\ObjectUtil.as(1447): col: 54 Use of the instanceof operator. The instanceof operator is deprecated, use the is operator instead.
[java]
[java] var isDict:Boolean = (obj instanceof Map || obj instanceof WeakMap);
[java] ^
[java]
[java] C:\jenkins\workspace\royale-asjs\frameworks\projects\MXRoyale\src\main\royale\mx\utils\ObjectUtil.as(1449): col: 17 Use of the instanceof operator. The instanceof operator is deprecated, use the is operator instead.
[java]
[java] if (obj instanceof WeakMap) throw new Error('WeakMap cannot be enumerated, use Map instead');
[java] ^
[java]
[java] C:\jenkins\workspace\royale-asjs\frameworks\projects\Network\src\main\royale\org\apache\royale\net\remoting\amf\AMFBinaryData.as(823): col: 7 Use of the instanceof operator. The instanceof operator is deprecated, use the is operator instead.
[java]
[java] if (value instanceof Function) {
[java] ^
[java]
[java] C:\jenkins\workspace\royale-asjs\frameworks\projects\SparkRoyale\src\main\royale\spark\skins\spark\FormItemSkin.mxml(169): col: 30 Data binding will not be able to detect assignments to 'x'.
[java]
[java] <s:Group x="{contentGroup.x + contentGroup.contentWidth + 4}" y="{contentGroup.y}"
[java] ^
[java]
[java] C:\jenkins\workspace\royale-asjs\frameworks\projects\SparkRoyale\src\main\royale\spark\skins\spark\FormItemSkin.mxml(169): col: 83 Data binding will not be able to detect assignments to 'y'.
[java]
[java] <s:Group x="{contentGroup.x + contentGroup.contentWidth + 4}" y="{contentGroup.y}"
[java] ^
[java]
[java] C:\jenkins\workspace\royale-asjs\frameworks\projects\Storage\src\main\royale\org\apache\royale\storage\file\DataInputStream.as(73): col: 24 Encountered this keyword within closure. Value of this will not be the same as enclosing scope.
[java]
[java] streamEvent.data = this.result;
[java] ^
[java]
[java] C:\jenkins\workspace\royale-asjs\frameworks\projects\Storage\src\main\royale\org\apache\royale\storage\providers\AndroidExternalStorageProvider.as(106): col: 24 Encountered this keyword within closure. Value of this will not be the same as enclosing scope.
[java]
[java] newEvent.data = this.result;
[java] ^
[java]
[java] C:\jenkins\workspace\royale-asjs\frameworks\projects\Storage\src\main\royale\org\apache\royale\storage\providers\WebStorageProvider.as(105): col: 24 Encountered this keyword within closure. Value of this will not be the same as enclosing scope.
[java]
[java] newEvent.data = this.result;
[java] ^
[java]
[java] 152.6455468 seconds
[java] Picked up JAVA_TOOL_OPTIONS: -Dfile.encoding=UTF-8 -Xms384m -Xmx2g
[java] Java Result: 3
BUILD FAILED
<http://apacheroyaleci2.westus2.cloudapp.azure.com:8080/job/Royale_ASDoc_Example/639/artifact/examples/royale/ASDoc/build.xml>:49: The following error occurred while executing this line:
<http://apacheroyaleci2.westus2.cloudapp.azure.com:8080/job/Royale_ASDoc_Example/639/artifact/examples/royale/ASDoc/build.xml>:109: condition satisfied
Total time: 3 minutes 57 seconds
Picked up JAVA_TOOL_OPTIONS: -Dfile.encoding=UTF-8 -Xms384m -Xmx2g
Build step 'Invoke Ant' marked build as failure
Skipped archiving because build is not successful
Jenkins build is back to normal : Royale_ASDoc_Example #648
Posted by ap...@gmail.com.
See <http://apacheroyaleci2.westus2.cloudapp.azure.com:8080/job/Royale_ASDoc_Example/648/display/redirect?page=changes>
Build failed in Jenkins: Royale_ASDoc_Example #647
Posted by ap...@gmail.com.
See <http://apacheroyaleci2.westus2.cloudapp.azure.com:8080/job/Royale_ASDoc_Example/647/display/redirect>
Changes:
------------------------------------------
[...truncated 5.15 KB...]
[mxmlc] 14
[mxmlc] -output=<http://apacheroyaleci2.westus2.cloudapp.azure.com:8080/job/Royale_ASDoc_Example/647/artifact/examples/royale/ASDoc/bin-debug/ASDoc.swf>
[mxmlc] --
[mxmlc] <http://apacheroyaleci2.westus2.cloudapp.azure.com:8080/job/Royale_ASDoc_Example/647/artifact/examples/royale/ASDoc/src/main/royale/ASDoc.mxml>
[mxmlc] Loading configuration: C:\jenkins\workspace\royale-asjs\frameworks\royale-config.xml
[mxmlc] Loading configuration: <http://apacheroyaleci2.westus2.cloudapp.azure.com:8080/job/Royale_ASDoc_Example/647/artifact/examples/royale/ASDoc/src/main/config/compile-app-config.xml>
[mxmlc]
[mxmlc] 131244 bytes written to C:\jenkins\workspace\Royale_ASDoc_Example\examples\royale\ASDoc\bin-debug\ASDoc.swf in 8.193 seconds
[mxmlc] The project 'ASDoc' has been successfully compiled.
[mxmlc] 22.7833904 seconds
[mxmlc] Picked up JAVA_TOOL_OPTIONS: -Dfile.encoding=UTF-8 -Xms384m -Xmx2g
build_example.check-air:
build_example.wrapper:
[copy] Copying 1 file to <http://apacheroyaleci2.westus2.cloudapp.azure.com:8080/job/Royale_ASDoc_Example/647/artifact/examples/royale/ASDoc/bin-debug>
[copy] Copied 1 empty directory to 1 empty directory under <http://apacheroyaleci2.westus2.cloudapp.azure.com:8080/job/Royale_ASDoc_Example/647/artifact/examples/royale/ASDoc/bin-debug/history>
[copy] Copying 2 files to <http://apacheroyaleci2.westus2.cloudapp.azure.com:8080/job/Royale_ASDoc_Example/647/artifact/examples/royale/ASDoc/bin-debug>
build_example.check-resources:
build_example.copy-resources:
[copy] Copying 1 file to <http://apacheroyaleci2.westus2.cloudapp.azure.com:8080/job/Royale_ASDoc_Example/647/artifact/examples/royale/ASDoc/bin-debug>
build_example.compile-js-release:
[mxmlc] MXMLJSC
[mxmlc] -load-config+=<http://apacheroyaleci2.westus2.cloudapp.azure.com:8080/job/Royale_ASDoc_Example/647/artifact/examples/royale/ASDoc/src/main/config/compile-app-config.xml>
[mxmlc] -js-dynamic-access-unknown-members=true
[mxmlc] +playerglobal.version=11.7
[mxmlc] +env.PLAYERGLOBAL_HOME=C:\adobe\flash
[mxmlc] -compiler.debug=false
[mxmlc] +royalelib=C:\jenkins\workspace\royale-asjs/frameworks/
[mxmlc] -closure-lib=C:\jenkins\workspace\royale-asjs/js/lib/google/closure-library
[mxmlc] +configname=royale
[mxmlc] -swf-version
[mxmlc] 14
[mxmlc] -output=<http://apacheroyaleci2.westus2.cloudapp.azure.com:8080/job/Royale_ASDoc_Example/647/artifact/examples/royale/ASDoc/bin-release/ASDoc.swf>
[mxmlc] --
[mxmlc] <http://apacheroyaleci2.westus2.cloudapp.azure.com:8080/job/Royale_ASDoc_Example/647/artifact/examples/royale/ASDoc/src/main/royale/ASDoc.mxml>
[mxmlc] Loading configuration: C:\jenkins\workspace\royale-asjs\frameworks\royale-config.xml
[mxmlc] Loading configuration: <http://apacheroyaleci2.westus2.cloudapp.azure.com:8080/job/Royale_ASDoc_Example/647/artifact/examples/royale/ASDoc/src/main/config/compile-app-config.xml>
[mxmlc]
[mxmlc] 66503 bytes written to C:\jenkins\workspace\Royale_ASDoc_Example\examples\royale\ASDoc\bin-release\ASDoc.swf in 7.439 seconds
[mxmlc] Feb 19, 2020 7:56:39 PM com.google.javascript.jscomp.LoggerErrorManager printSummary
[mxmlc] INFO: 0 error(s), 0 warning(s), 97.3% typed
[mxmlc] Picked up JAVA_TOOL_OPTIONS: -Dfile.encoding=UTF-8 -Xms384m -Xmx2g
[mxmlc] The project 'ASDoc' has been successfully compiled and optimized.
[mxmlc] 44.190563 seconds
build_example.check-air:
build_example.copy-app-xml:
main:
json:
[echo] ROYALE_COMPILER_HOME: C:\jenkins\workspace\royale-asjs/js
[java] C:\jenkins\workspace\royale-asjs\frameworks\projects\Core\src\main\royale\org\apache\royale\utils\object\defineSimpleProperty.as(36): col: 12 Encountered this keyword within closure. Value of this will not be the same as enclosing scope.
[java]
[java] return this[privateProp];
[java] ^
[java]
[java] C:\jenkins\workspace\royale-asjs\frameworks\projects\Core\src\main\royale\org\apache\royale\utils\object\defineSimpleProperty.as(39): col: 5 Encountered this keyword within closure. Value of this will not be the same as enclosing scope.
[java]
[java] this[privateProp] = val;
[java] ^
[java]
[java] C:\jenkins\workspace\royale-asjs\frameworks\projects\GoogleMaps\src\main\royale\org\apache\royale\maps\google\beads\GoogleMapView.as(114): col: 6 Encountered this keyword within closure. Value of this will not be the same as enclosing scope.
[java]
[java] (this['mapView'] as GoogleMapView).finishInitialization();
[java] ^
[java]
[java] C:\jenkins\workspace\royale-asjs\frameworks\projects\Jewel\src\main\royale\JewelClasses.as(84): col: 13 Definition org.apache.royale.jewel.beads.views.CheckBoxView could not be found.
[java]
[java] import org.apache.royale.jewel.beads.views.CheckBoxView; CheckBoxView;
[java] ^
[java]
[java] C:\jenkins\workspace\royale-asjs\frameworks\projects\Jewel\src\main\royale\JewelClasses.as(84): col: 63 Access of possibly undefined property CheckBoxView.
[java]
[java] import org.apache.royale.jewel.beads.views.CheckBoxView; CheckBoxView;
[java] ^
[java]
[java] C:\jenkins\workspace\royale-asjs\frameworks\projects\Language\src\main\royale\org\apache\royale\utils\Language.as(148): col: 17 Use of the instanceof operator. The instanceof operator is deprecated, use the is operator instead.
[java]
[java] if (leftOperand instanceof rightOperand)
[java] ^
[java]
[java] C:\jenkins\workspace\royale-asjs\frameworks\projects\Language\src\main\royale\org\apache\royale\utils\Language.as(721): col: 36 Use of the instanceof operator. The instanceof operator is deprecated, use the is operator instead.
[java]
[java] var ret:Boolean = base && v[Language.SYNTH_TAG_FIELD] instanceof langSynthType['_types'][typeName];
[java] ^
[java]
[java] C:\jenkins\workspace\royale-asjs\frameworks\projects\MXRoyale\src\main\royale\mx\charts\AreaChart.as(231): col: 21 Encountered this keyword within closure. Value of this will not be the same as enclosing scope.
[java]
[java] this.areaFill = fill;
[java] ^
[java]
[java] C:\jenkins\workspace\royale-asjs\frameworks\projects\MXRoyale\src\main\royale\mx\charts\AreaChart.as(232): col: 21 Encountered this keyword within closure. Value of this will not be the same as enclosing scope.
[java]
[java] this.fill = fill;
[java] ^
[java]
[java] C:\jenkins\workspace\royale-asjs\frameworks\projects\MXRoyale\src\main\royale\mx\charts\CandlestickChart.as(231): col: 22 Encountered this keyword within closure. Value of this will not be the same as enclosing scope.
[java]
[java] this.boxStroke = boxStroke;
[java] ^
[java]
[java] C:\jenkins\workspace\royale-asjs\frameworks\projects\MXRoyale\src\main\royale\mx\charts\CandlestickChart.as(232): col: 22 Encountered this keyword within closure. Value of this will not be the same as enclosing scope.
[java]
[java] this.declineFill = declineFill;
[java] ^
[java]
[java] C:\jenkins\workspace\royale-asjs\frameworks\projects\MXRoyale\src\main\royale\mx\charts\HLOCChart.as(228): col: 22 Encountered this keyword within closure. Value of this will not be the same as enclosing scope.
[java]
[java] this.closeTickStroke = tickStroke;
[java] ^
[java]
[java] C:\jenkins\workspace\royale-asjs\frameworks\projects\MXRoyale\src\main\royale\mx\charts\HLOCChart.as(229): col: 22 Encountered this keyword within closure. Value of this will not be the same as enclosing scope.
[java]
[java] this.openTickStroke = tickStroke;
[java] ^
[java]
[java] C:\jenkins\workspace\royale-asjs\frameworks\projects\MXRoyale\src\main\royale\mx\charts\HLOCChart.as(230): col: 22 Encountered this keyword within closure. Value of this will not be the same as enclosing scope.
[java]
[java] this.stroke = stroke;
[java] ^
[java]
[java] C:\jenkins\workspace\royale-asjs\frameworks\projects\MXRoyale\src\main\royale\mx\charts\HLOCChart.as(231): col: 22 Encountered this keyword within closure. Value of this will not be the same as enclosing scope.
[java]
[java] this.hlocColor = stroke.color;
[java] ^
[java]
[java] C:\jenkins\workspace\royale-asjs\frameworks\projects\MXRoyale\src\main\royale\mx\charts\LineChart.as(179): col: 22 Encountered this keyword within closure. Value of this will not be the same as enclosing scope.
[java]
[java] this.lineStroke = stroke;
[java] ^
[java]
[java] C:\jenkins\workspace\royale-asjs\frameworks\projects\MXRoyale\src\main\royale\mx\charts\LineChart.as(180): col: 22 Encountered this keyword within closure. Value of this will not be the same as enclosing scope.
[java]
[java] this.stroke = stroke;
[java] ^
[java]
[java] C:\jenkins\workspace\royale-asjs\frameworks\projects\MXRoyale\src\main\royale\mx\charts\LineChart.as(181): col: 22 Encountered this keyword within closure. Value of this will not be the same as enclosing scope.
[java]
[java] this.lineSegmentRenderer = new ClassFactory(LineRenderer);
[java] ^
[java]
[java] C:\jenkins\workspace\royale-asjs\frameworks\projects\MXRoyale\src\main\royale\mx\charts\PlotChart.as(158): col: 22 Encountered this keyword within closure. Value of this will not be the same as enclosing scope.
[java]
[java] this.fill = fill;
[java] ^
[java]
[java] C:\jenkins\workspace\royale-asjs\frameworks\projects\MXRoyale\src\main\royale\mx\charts\PlotChart.as(159): col: 22 Encountered this keyword within closure. Value of this will not be the same as enclosing scope.
[java]
[java] this.itemRenderer = skin;
[java] ^
[java]
[java] C:\jenkins\workspace\royale-asjs\frameworks\projects\MXRoyale\src\main\royale\mx\charts\PlotChart.as(160): col: 22 Encountered this keyword within closure. Value of this will not be the same as enclosing scope.
[java]
[java] this.radius = radius
[java] ^
[java]
[java] C:\jenkins\workspace\royale-asjs\frameworks\projects\MXRoyale\src\main\royale\mx\charts\styles\HaloDefaults.as(213): col: 6 Encountered this keyword within closure. Value of this will not be the same as enclosing scope.
[java]
[java] this.fill = defaultFill;
[java] ^
[java]
[java] C:\jenkins\workspace\royale-asjs\frameworks\projects\MXRoyale\src\main\royale\mx\charts\styles\HaloDefaults.as(214): col: 6 Encountered this keyword within closure. Value of this will not be the same as enclosing scope.
[java]
[java] this.areaFill = defaultFill;
[java] ^
[java]
[java] C:\jenkins\workspace\royale-asjs\frameworks\projects\MXRoyale\src\main\royale\mx\charts\styles\HaloDefaults.as(215): col: 6 Encountered this keyword within closure. Value of this will not be the same as enclosing scope.
[java]
[java] this.areaStroke = emptyStroke;
[java] ^
[java]
[java] C:\jenkins\workspace\royale-asjs\frameworks\projects\MXRoyale\src\main\royale\mx\charts\styles\HaloDefaults.as(216): col: 6 Encountered this keyword within closure. Value of this will not be the same as enclosing scope.
[java]
[java] this.lineStroke = defaultStroke;
[java] ^
[java]
[java] C:\jenkins\workspace\royale-asjs\frameworks\projects\MXRoyale\src\main\royale\mx\utils\ObjectUtil.as(715): col: 34 Use of the instanceof operator. The instanceof operator is deprecated, use the is operator instead.
[java]
[java] isDict = value instanceof Map || value instanceof WeakMap;
[java] ^
[java]
[java] C:\jenkins\workspace\royale-asjs\frameworks\projects\MXRoyale\src\main\royale\mx\utils\ObjectUtil.as(715): col: 58 Use of the instanceof operator. The instanceof operator is deprecated, use the is operator instead.
[java]
[java] isDict = value instanceof Map || value instanceof WeakMap;
[java] ^
[java]
[java] C:\jenkins\workspace\royale-asjs\frameworks\projects\MXRoyale\src\main\royale\mx\utils\ObjectUtil.as(1447): col: 32 Use of the instanceof operator. The instanceof operator is deprecated, use the is operator instead.
[java]
[java] var isDict:Boolean = (obj instanceof Map || obj instanceof WeakMap);
[java] ^
[java]
[java] C:\jenkins\workspace\royale-asjs\frameworks\projects\MXRoyale\src\main\royale\mx\utils\ObjectUtil.as(1447): col: 54 Use of the instanceof operator. The instanceof operator is deprecated, use the is operator instead.
[java]
[java] var isDict:Boolean = (obj instanceof Map || obj instanceof WeakMap);
[java] ^
[java]
[java] C:\jenkins\workspace\royale-asjs\frameworks\projects\MXRoyale\src\main\royale\mx\utils\ObjectUtil.as(1449): col: 17 Use of the instanceof operator. The instanceof operator is deprecated, use the is operator instead.
[java]
[java] if (obj instanceof WeakMap) throw new Error('WeakMap cannot be enumerated, use Map instead');
[java] ^
[java]
[java] C:\jenkins\workspace\royale-asjs\frameworks\projects\Network\src\main\royale\org\apache\royale\net\remoting\amf\AMFBinaryData.as(823): col: 7 Use of the instanceof operator. The instanceof operator is deprecated, use the is operator instead.
[java]
[java] if (value instanceof Function) {
[java] ^
[java]
[java] C:\jenkins\workspace\royale-asjs\frameworks\projects\SparkRoyale\src\main\royale\spark\skins\spark\FormItemSkin.mxml(169): col: 30 Data binding will not be able to detect assignments to 'x'.
[java]
[java] <s:Group x="{contentGroup.x + contentGroup.contentWidth + 4}" y="{contentGroup.y}"
[java] ^
[java]
[java] C:\jenkins\workspace\royale-asjs\frameworks\projects\SparkRoyale\src\main\royale\spark\skins\spark\FormItemSkin.mxml(169): col: 83 Data binding will not be able to detect assignments to 'y'.
[java]
[java] <s:Group x="{contentGroup.x + contentGroup.contentWidth + 4}" y="{contentGroup.y}"
[java] ^
[java]
[java] C:\jenkins\workspace\royale-asjs\frameworks\projects\Storage\src\main\royale\org\apache\royale\storage\file\DataInputStream.as(73): col: 24 Encountered this keyword within closure. Value of this will not be the same as enclosing scope.
[java]
[java] streamEvent.data = this.result;
[java] ^
[java]
[java] C:\jenkins\workspace\royale-asjs\frameworks\projects\Storage\src\main\royale\org\apache\royale\storage\providers\AndroidExternalStorageProvider.as(106): col: 24 Encountered this keyword within closure. Value of this will not be the same as enclosing scope.
[java]
[java] newEvent.data = this.result;
[java] ^
[java]
[java] C:\jenkins\workspace\royale-asjs\frameworks\projects\Storage\src\main\royale\org\apache\royale\storage\providers\WebStorageProvider.as(105): col: 24 Encountered this keyword within closure. Value of this will not be the same as enclosing scope.
[java]
[java] newEvent.data = this.result;
[java] ^
[java]
[java] 136.5685375 seconds
[java] Picked up JAVA_TOOL_OPTIONS: -Dfile.encoding=UTF-8 -Xms384m -Xmx2g
[java] Java Result: 3
BUILD FAILED
<http://apacheroyaleci2.westus2.cloudapp.azure.com:8080/job/Royale_ASDoc_Example/647/artifact/examples/royale/ASDoc/build.xml>:49: The following error occurred while executing this line:
<http://apacheroyaleci2.westus2.cloudapp.azure.com:8080/job/Royale_ASDoc_Example/647/artifact/examples/royale/ASDoc/build.xml>:109: condition satisfied
Total time: 3 minutes 26 seconds
Picked up JAVA_TOOL_OPTIONS: -Dfile.encoding=UTF-8 -Xms384m -Xmx2g
Build step 'Invoke Ant' marked build as failure
Skipped archiving because build is not successful
Build failed in Jenkins: Royale_ASDoc_Example #646
Posted by ap...@gmail.com.
See <http://apacheroyaleci2.westus2.cloudapp.azure.com:8080/job/Royale_ASDoc_Example/646/display/redirect?page=changes>
Changes:
[carlosrovira] jewel-button: recover multiline buttons that was removed by mistake in a
------------------------------------------
[...truncated 5.15 KB...]
[mxmlc] 14
[mxmlc] -output=<http://apacheroyaleci2.westus2.cloudapp.azure.com:8080/job/Royale_ASDoc_Example/646/artifact/examples/royale/ASDoc/bin-debug/ASDoc.swf>
[mxmlc] --
[mxmlc] <http://apacheroyaleci2.westus2.cloudapp.azure.com:8080/job/Royale_ASDoc_Example/646/artifact/examples/royale/ASDoc/src/main/royale/ASDoc.mxml>
[mxmlc] Loading configuration: C:\jenkins\workspace\royale-asjs\frameworks\royale-config.xml
[mxmlc] Loading configuration: <http://apacheroyaleci2.westus2.cloudapp.azure.com:8080/job/Royale_ASDoc_Example/646/artifact/examples/royale/ASDoc/src/main/config/compile-app-config.xml>
[mxmlc]
[mxmlc] 131245 bytes written to C:\jenkins\workspace\Royale_ASDoc_Example\examples\royale\ASDoc\bin-debug\ASDoc.swf in 17.839 seconds
[mxmlc] The project 'ASDoc' has been successfully compiled.
[mxmlc] 33.4781386 seconds
[mxmlc] Picked up JAVA_TOOL_OPTIONS: -Dfile.encoding=UTF-8 -Xms384m -Xmx2g
build_example.check-air:
build_example.wrapper:
[copy] Copying 1 file to <http://apacheroyaleci2.westus2.cloudapp.azure.com:8080/job/Royale_ASDoc_Example/646/artifact/examples/royale/ASDoc/bin-debug>
[copy] Copied 1 empty directory to 1 empty directory under <http://apacheroyaleci2.westus2.cloudapp.azure.com:8080/job/Royale_ASDoc_Example/646/artifact/examples/royale/ASDoc/bin-debug/history>
[copy] Copying 2 files to <http://apacheroyaleci2.westus2.cloudapp.azure.com:8080/job/Royale_ASDoc_Example/646/artifact/examples/royale/ASDoc/bin-debug>
build_example.check-resources:
build_example.copy-resources:
[copy] Copying 1 file to <http://apacheroyaleci2.westus2.cloudapp.azure.com:8080/job/Royale_ASDoc_Example/646/artifact/examples/royale/ASDoc/bin-debug>
build_example.compile-js-release:
[mxmlc] MXMLJSC
[mxmlc] -load-config+=<http://apacheroyaleci2.westus2.cloudapp.azure.com:8080/job/Royale_ASDoc_Example/646/artifact/examples/royale/ASDoc/src/main/config/compile-app-config.xml>
[mxmlc] -js-dynamic-access-unknown-members=true
[mxmlc] +playerglobal.version=11.7
[mxmlc] +env.PLAYERGLOBAL_HOME=C:\adobe\flash
[mxmlc] -compiler.debug=false
[mxmlc] +royalelib=C:\jenkins\workspace\royale-asjs/frameworks/
[mxmlc] -closure-lib=C:\jenkins\workspace\royale-asjs/js/lib/google/closure-library
[mxmlc] +configname=royale
[mxmlc] -swf-version
[mxmlc] 14
[mxmlc] -output=<http://apacheroyaleci2.westus2.cloudapp.azure.com:8080/job/Royale_ASDoc_Example/646/artifact/examples/royale/ASDoc/bin-release/ASDoc.swf>
[mxmlc] --
[mxmlc] <http://apacheroyaleci2.westus2.cloudapp.azure.com:8080/job/Royale_ASDoc_Example/646/artifact/examples/royale/ASDoc/src/main/royale/ASDoc.mxml>
[mxmlc] Loading configuration: C:\jenkins\workspace\royale-asjs\frameworks\royale-config.xml
[mxmlc] Loading configuration: <http://apacheroyaleci2.westus2.cloudapp.azure.com:8080/job/Royale_ASDoc_Example/646/artifact/examples/royale/ASDoc/src/main/config/compile-app-config.xml>
[mxmlc]
[mxmlc] 66501 bytes written to C:\jenkins\workspace\Royale_ASDoc_Example\examples\royale\ASDoc\bin-release\ASDoc.swf in 6.996 seconds
[mxmlc] Feb 19, 2020 6:12:53 PM com.google.javascript.jscomp.LoggerErrorManager printSummary
[mxmlc] INFO: 0 error(s), 0 warning(s), 97.3% typed
[mxmlc] The project 'ASDoc' has been successfully compiled and optimized.
[mxmlc] 63.1378599 seconds
[mxmlc] Picked up JAVA_TOOL_OPTIONS: -Dfile.encoding=UTF-8 -Xms384m -Xmx2g
build_example.check-air:
build_example.copy-app-xml:
main:
json:
[echo] ROYALE_COMPILER_HOME: C:\jenkins\workspace\royale-asjs/js
[java] C:\jenkins\workspace\royale-asjs\frameworks\projects\Core\src\main\royale\org\apache\royale\utils\object\defineSimpleProperty.as(36): col: 12 Encountered this keyword within closure. Value of this will not be the same as enclosing scope.
[java]
[java] return this[privateProp];
[java] ^
[java]
[java] C:\jenkins\workspace\royale-asjs\frameworks\projects\Core\src\main\royale\org\apache\royale\utils\object\defineSimpleProperty.as(39): col: 5 Encountered this keyword within closure. Value of this will not be the same as enclosing scope.
[java]
[java] this[privateProp] = val;
[java] ^
[java]
[java] C:\jenkins\workspace\royale-asjs\frameworks\projects\GoogleMaps\src\main\royale\org\apache\royale\maps\google\beads\GoogleMapView.as(114): col: 6 Encountered this keyword within closure. Value of this will not be the same as enclosing scope.
[java]
[java] (this['mapView'] as GoogleMapView).finishInitialization();
[java] ^
[java]
[java] C:\jenkins\workspace\royale-asjs\frameworks\projects\Jewel\src\main\royale\JewelClasses.as(84): col: 13 Definition org.apache.royale.jewel.beads.views.CheckBoxView could not be found.
[java]
[java] import org.apache.royale.jewel.beads.views.CheckBoxView; CheckBoxView;
[java] ^
[java]
[java] C:\jenkins\workspace\royale-asjs\frameworks\projects\Jewel\src\main\royale\JewelClasses.as(84): col: 63 Access of possibly undefined property CheckBoxView.
[java]
[java] import org.apache.royale.jewel.beads.views.CheckBoxView; CheckBoxView;
[java] ^
[java]
[java] C:\jenkins\workspace\royale-asjs\frameworks\projects\Language\src\main\royale\org\apache\royale\utils\Language.as(148): col: 17 Use of the instanceof operator. The instanceof operator is deprecated, use the is operator instead.
[java]
[java] if (leftOperand instanceof rightOperand)
[java] ^
[java]
[java] C:\jenkins\workspace\royale-asjs\frameworks\projects\Language\src\main\royale\org\apache\royale\utils\Language.as(721): col: 36 Use of the instanceof operator. The instanceof operator is deprecated, use the is operator instead.
[java]
[java] var ret:Boolean = base && v[Language.SYNTH_TAG_FIELD] instanceof langSynthType['_types'][typeName];
[java] ^
[java]
[java] C:\jenkins\workspace\royale-asjs\frameworks\projects\MXRoyale\src\main\royale\mx\charts\AreaChart.as(231): col: 21 Encountered this keyword within closure. Value of this will not be the same as enclosing scope.
[java]
[java] this.areaFill = fill;
[java] ^
[java]
[java] C:\jenkins\workspace\royale-asjs\frameworks\projects\MXRoyale\src\main\royale\mx\charts\AreaChart.as(232): col: 21 Encountered this keyword within closure. Value of this will not be the same as enclosing scope.
[java]
[java] this.fill = fill;
[java] ^
[java]
[java] C:\jenkins\workspace\royale-asjs\frameworks\projects\MXRoyale\src\main\royale\mx\charts\CandlestickChart.as(231): col: 22 Encountered this keyword within closure. Value of this will not be the same as enclosing scope.
[java]
[java] this.boxStroke = boxStroke;
[java] ^
[java]
[java] C:\jenkins\workspace\royale-asjs\frameworks\projects\MXRoyale\src\main\royale\mx\charts\CandlestickChart.as(232): col: 22 Encountered this keyword within closure. Value of this will not be the same as enclosing scope.
[java]
[java] this.declineFill = declineFill;
[java] ^
[java]
[java] C:\jenkins\workspace\royale-asjs\frameworks\projects\MXRoyale\src\main\royale\mx\charts\HLOCChart.as(228): col: 22 Encountered this keyword within closure. Value of this will not be the same as enclosing scope.
[java]
[java] this.closeTickStroke = tickStroke;
[java] ^
[java]
[java] C:\jenkins\workspace\royale-asjs\frameworks\projects\MXRoyale\src\main\royale\mx\charts\HLOCChart.as(229): col: 22 Encountered this keyword within closure. Value of this will not be the same as enclosing scope.
[java]
[java] this.openTickStroke = tickStroke;
[java] ^
[java]
[java] C:\jenkins\workspace\royale-asjs\frameworks\projects\MXRoyale\src\main\royale\mx\charts\HLOCChart.as(230): col: 22 Encountered this keyword within closure. Value of this will not be the same as enclosing scope.
[java]
[java] this.stroke = stroke;
[java] ^
[java]
[java] C:\jenkins\workspace\royale-asjs\frameworks\projects\MXRoyale\src\main\royale\mx\charts\HLOCChart.as(231): col: 22 Encountered this keyword within closure. Value of this will not be the same as enclosing scope.
[java]
[java] this.hlocColor = stroke.color;
[java] ^
[java]
[java] C:\jenkins\workspace\royale-asjs\frameworks\projects\MXRoyale\src\main\royale\mx\charts\LineChart.as(179): col: 22 Encountered this keyword within closure. Value of this will not be the same as enclosing scope.
[java]
[java] this.lineStroke = stroke;
[java] ^
[java]
[java] C:\jenkins\workspace\royale-asjs\frameworks\projects\MXRoyale\src\main\royale\mx\charts\LineChart.as(180): col: 22 Encountered this keyword within closure. Value of this will not be the same as enclosing scope.
[java]
[java] this.stroke = stroke;
[java] ^
[java]
[java] C:\jenkins\workspace\royale-asjs\frameworks\projects\MXRoyale\src\main\royale\mx\charts\LineChart.as(181): col: 22 Encountered this keyword within closure. Value of this will not be the same as enclosing scope.
[java]
[java] this.lineSegmentRenderer = new ClassFactory(LineRenderer);
[java] ^
[java]
[java] C:\jenkins\workspace\royale-asjs\frameworks\projects\MXRoyale\src\main\royale\mx\charts\PlotChart.as(158): col: 22 Encountered this keyword within closure. Value of this will not be the same as enclosing scope.
[java]
[java] this.fill = fill;
[java] ^
[java]
[java] C:\jenkins\workspace\royale-asjs\frameworks\projects\MXRoyale\src\main\royale\mx\charts\PlotChart.as(159): col: 22 Encountered this keyword within closure. Value of this will not be the same as enclosing scope.
[java]
[java] this.itemRenderer = skin;
[java] ^
[java]
[java] C:\jenkins\workspace\royale-asjs\frameworks\projects\MXRoyale\src\main\royale\mx\charts\PlotChart.as(160): col: 22 Encountered this keyword within closure. Value of this will not be the same as enclosing scope.
[java]
[java] this.radius = radius
[java] ^
[java]
[java] C:\jenkins\workspace\royale-asjs\frameworks\projects\MXRoyale\src\main\royale\mx\charts\styles\HaloDefaults.as(213): col: 6 Encountered this keyword within closure. Value of this will not be the same as enclosing scope.
[java]
[java] this.fill = defaultFill;
[java] ^
[java]
[java] C:\jenkins\workspace\royale-asjs\frameworks\projects\MXRoyale\src\main\royale\mx\charts\styles\HaloDefaults.as(214): col: 6 Encountered this keyword within closure. Value of this will not be the same as enclosing scope.
[java]
[java] this.areaFill = defaultFill;
[java] ^
[java]
[java] C:\jenkins\workspace\royale-asjs\frameworks\projects\MXRoyale\src\main\royale\mx\charts\styles\HaloDefaults.as(215): col: 6 Encountered this keyword within closure. Value of this will not be the same as enclosing scope.
[java]
[java] this.areaStroke = emptyStroke;
[java] ^
[java]
[java] C:\jenkins\workspace\royale-asjs\frameworks\projects\MXRoyale\src\main\royale\mx\charts\styles\HaloDefaults.as(216): col: 6 Encountered this keyword within closure. Value of this will not be the same as enclosing scope.
[java]
[java] this.lineStroke = defaultStroke;
[java] ^
[java]
[java] C:\jenkins\workspace\royale-asjs\frameworks\projects\MXRoyale\src\main\royale\mx\utils\ObjectUtil.as(715): col: 34 Use of the instanceof operator. The instanceof operator is deprecated, use the is operator instead.
[java]
[java] isDict = value instanceof Map || value instanceof WeakMap;
[java] ^
[java]
[java] C:\jenkins\workspace\royale-asjs\frameworks\projects\MXRoyale\src\main\royale\mx\utils\ObjectUtil.as(715): col: 58 Use of the instanceof operator. The instanceof operator is deprecated, use the is operator instead.
[java]
[java] isDict = value instanceof Map || value instanceof WeakMap;
[java] ^
[java]
[java] C:\jenkins\workspace\royale-asjs\frameworks\projects\MXRoyale\src\main\royale\mx\utils\ObjectUtil.as(1447): col: 32 Use of the instanceof operator. The instanceof operator is deprecated, use the is operator instead.
[java]
[java] var isDict:Boolean = (obj instanceof Map || obj instanceof WeakMap);
[java] ^
[java]
[java] C:\jenkins\workspace\royale-asjs\frameworks\projects\MXRoyale\src\main\royale\mx\utils\ObjectUtil.as(1447): col: 54 Use of the instanceof operator. The instanceof operator is deprecated, use the is operator instead.
[java]
[java] var isDict:Boolean = (obj instanceof Map || obj instanceof WeakMap);
[java] ^
[java]
[java] C:\jenkins\workspace\royale-asjs\frameworks\projects\MXRoyale\src\main\royale\mx\utils\ObjectUtil.as(1449): col: 17 Use of the instanceof operator. The instanceof operator is deprecated, use the is operator instead.
[java]
[java] if (obj instanceof WeakMap) throw new Error('WeakMap cannot be enumerated, use Map instead');
[java] ^
[java]
[java] C:\jenkins\workspace\royale-asjs\frameworks\projects\Network\src\main\royale\org\apache\royale\net\remoting\amf\AMFBinaryData.as(823): col: 7 Use of the instanceof operator. The instanceof operator is deprecated, use the is operator instead.
[java]
[java] if (value instanceof Function) {
[java] ^
[java]
[java] C:\jenkins\workspace\royale-asjs\frameworks\projects\SparkRoyale\src\main\royale\spark\skins\spark\FormItemSkin.mxml(169): col: 30 Data binding will not be able to detect assignments to 'x'.
[java]
[java] <s:Group x="{contentGroup.x + contentGroup.contentWidth + 4}" y="{contentGroup.y}"
[java] ^
[java]
[java] C:\jenkins\workspace\royale-asjs\frameworks\projects\SparkRoyale\src\main\royale\spark\skins\spark\FormItemSkin.mxml(169): col: 83 Data binding will not be able to detect assignments to 'y'.
[java]
[java] <s:Group x="{contentGroup.x + contentGroup.contentWidth + 4}" y="{contentGroup.y}"
[java] ^
[java]
[java] C:\jenkins\workspace\royale-asjs\frameworks\projects\Storage\src\main\royale\org\apache\royale\storage\file\DataInputStream.as(73): col: 24 Encountered this keyword within closure. Value of this will not be the same as enclosing scope.
[java]
[java] streamEvent.data = this.result;
[java] ^
[java]
[java] C:\jenkins\workspace\royale-asjs\frameworks\projects\Storage\src\main\royale\org\apache\royale\storage\providers\AndroidExternalStorageProvider.as(106): col: 24 Encountered this keyword within closure. Value of this will not be the same as enclosing scope.
[java]
[java] newEvent.data = this.result;
[java] ^
[java]
[java] C:\jenkins\workspace\royale-asjs\frameworks\projects\Storage\src\main\royale\org\apache\royale\storage\providers\WebStorageProvider.as(105): col: 24 Encountered this keyword within closure. Value of this will not be the same as enclosing scope.
[java]
[java] newEvent.data = this.result;
[java] ^
[java]
[java] 145.8722253 seconds
[java] Picked up JAVA_TOOL_OPTIONS: -Dfile.encoding=UTF-8 -Xms384m -Xmx2g
[java] Java Result: 3
BUILD FAILED
<http://apacheroyaleci2.westus2.cloudapp.azure.com:8080/job/Royale_ASDoc_Example/646/artifact/examples/royale/ASDoc/build.xml>:49: The following error occurred while executing this line:
<http://apacheroyaleci2.westus2.cloudapp.azure.com:8080/job/Royale_ASDoc_Example/646/artifact/examples/royale/ASDoc/build.xml>:109: condition satisfied
Total time: 4 minutes 6 seconds
Picked up JAVA_TOOL_OPTIONS: -Dfile.encoding=UTF-8 -Xms384m -Xmx2g
Build step 'Invoke Ant' marked build as failure
Skipped archiving because build is not successful
Build failed in Jenkins: Royale_ASDoc_Example #645
Posted by ap...@gmail.com.
See <http://apacheroyaleci2.westus2.cloudapp.azure.com:8080/job/Royale_ASDoc_Example/645/display/redirect?page=changes>
Changes:
[yishayjobs] We need this method in spectrum
------------------------------------------
[...truncated 5.14 KB...]
[mxmlc] 14
[mxmlc] -output=<http://apacheroyaleci2.westus2.cloudapp.azure.com:8080/job/Royale_ASDoc_Example/645/artifact/examples/royale/ASDoc/bin-debug/ASDoc.swf>
[mxmlc] --
[mxmlc] <http://apacheroyaleci2.westus2.cloudapp.azure.com:8080/job/Royale_ASDoc_Example/645/artifact/examples/royale/ASDoc/src/main/royale/ASDoc.mxml>
[mxmlc] Loading configuration: C:\jenkins\workspace\royale-asjs\frameworks\royale-config.xml
[mxmlc] Loading configuration: <http://apacheroyaleci2.westus2.cloudapp.azure.com:8080/job/Royale_ASDoc_Example/645/artifact/examples/royale/ASDoc/src/main/config/compile-app-config.xml>
[mxmlc]
[mxmlc] 131246 bytes written to C:\jenkins\workspace\Royale_ASDoc_Example\examples\royale\ASDoc\bin-debug\ASDoc.swf in 19.255 seconds
[mxmlc] The project 'ASDoc' has been successfully compiled.
[mxmlc] 34.7863933 seconds
[mxmlc] Picked up JAVA_TOOL_OPTIONS: -Dfile.encoding=UTF-8 -Xms384m -Xmx2g
build_example.check-air:
build_example.wrapper:
[copy] Copying 1 file to <http://apacheroyaleci2.westus2.cloudapp.azure.com:8080/job/Royale_ASDoc_Example/645/artifact/examples/royale/ASDoc/bin-debug>
[copy] Copied 1 empty directory to 1 empty directory under <http://apacheroyaleci2.westus2.cloudapp.azure.com:8080/job/Royale_ASDoc_Example/645/artifact/examples/royale/ASDoc/bin-debug/history>
[copy] Copying 2 files to <http://apacheroyaleci2.westus2.cloudapp.azure.com:8080/job/Royale_ASDoc_Example/645/artifact/examples/royale/ASDoc/bin-debug>
build_example.check-resources:
build_example.copy-resources:
[copy] Copying 1 file to <http://apacheroyaleci2.westus2.cloudapp.azure.com:8080/job/Royale_ASDoc_Example/645/artifact/examples/royale/ASDoc/bin-debug>
build_example.compile-js-release:
[mxmlc] MXMLJSC
[mxmlc] -load-config+=<http://apacheroyaleci2.westus2.cloudapp.azure.com:8080/job/Royale_ASDoc_Example/645/artifact/examples/royale/ASDoc/src/main/config/compile-app-config.xml>
[mxmlc] -js-dynamic-access-unknown-members=true
[mxmlc] +playerglobal.version=11.7
[mxmlc] +env.PLAYERGLOBAL_HOME=C:\adobe\flash
[mxmlc] -compiler.debug=false
[mxmlc] +royalelib=C:\jenkins\workspace\royale-asjs/frameworks/
[mxmlc] -closure-lib=C:\jenkins\workspace\royale-asjs/js/lib/google/closure-library
[mxmlc] +configname=royale
[mxmlc] -swf-version
[mxmlc] 14
[mxmlc] -output=<http://apacheroyaleci2.westus2.cloudapp.azure.com:8080/job/Royale_ASDoc_Example/645/artifact/examples/royale/ASDoc/bin-release/ASDoc.swf>
[mxmlc] --
[mxmlc] <http://apacheroyaleci2.westus2.cloudapp.azure.com:8080/job/Royale_ASDoc_Example/645/artifact/examples/royale/ASDoc/src/main/royale/ASDoc.mxml>
[mxmlc] Loading configuration: C:\jenkins\workspace\royale-asjs\frameworks\royale-config.xml
[mxmlc] Loading configuration: <http://apacheroyaleci2.westus2.cloudapp.azure.com:8080/job/Royale_ASDoc_Example/645/artifact/examples/royale/ASDoc/src/main/config/compile-app-config.xml>
[mxmlc]
[mxmlc] 66503 bytes written to C:\jenkins\workspace\Royale_ASDoc_Example\examples\royale\ASDoc\bin-release\ASDoc.swf in 11.636 seconds
[mxmlc] Feb 19, 2020 4:26:53 PM com.google.javascript.jscomp.LoggerErrorManager printSummary
[mxmlc] INFO: 0 error(s), 0 warning(s), 97.3% typed
[mxmlc] The project 'ASDoc' has been successfully compiled and optimized.
[mxmlc] 57.4102108 seconds
[mxmlc] Picked up JAVA_TOOL_OPTIONS: -Dfile.encoding=UTF-8 -Xms384m -Xmx2g
build_example.check-air:
build_example.copy-app-xml:
main:
json:
[echo] ROYALE_COMPILER_HOME: C:\jenkins\workspace\royale-asjs/js
[java] C:\jenkins\workspace\royale-asjs\frameworks\projects\Core\src\main\royale\org\apache\royale\utils\object\defineSimpleProperty.as(36): col: 12 Encountered this keyword within closure. Value of this will not be the same as enclosing scope.
[java]
[java] return this[privateProp];
[java] ^
[java]
[java] C:\jenkins\workspace\royale-asjs\frameworks\projects\Core\src\main\royale\org\apache\royale\utils\object\defineSimpleProperty.as(39): col: 5 Encountered this keyword within closure. Value of this will not be the same as enclosing scope.
[java]
[java] this[privateProp] = val;
[java] ^
[java]
[java] C:\jenkins\workspace\royale-asjs\frameworks\projects\GoogleMaps\src\main\royale\org\apache\royale\maps\google\beads\GoogleMapView.as(114): col: 6 Encountered this keyword within closure. Value of this will not be the same as enclosing scope.
[java]
[java] (this['mapView'] as GoogleMapView).finishInitialization();
[java] ^
[java]
[java] C:\jenkins\workspace\royale-asjs\frameworks\projects\Jewel\src\main\royale\JewelClasses.as(84): col: 13 Definition org.apache.royale.jewel.beads.views.CheckBoxView could not be found.
[java]
[java] import org.apache.royale.jewel.beads.views.CheckBoxView; CheckBoxView;
[java] ^
[java]
[java] C:\jenkins\workspace\royale-asjs\frameworks\projects\Jewel\src\main\royale\JewelClasses.as(84): col: 63 Access of possibly undefined property CheckBoxView.
[java]
[java] import org.apache.royale.jewel.beads.views.CheckBoxView; CheckBoxView;
[java] ^
[java]
[java] C:\jenkins\workspace\royale-asjs\frameworks\projects\Language\src\main\royale\org\apache\royale\utils\Language.as(148): col: 17 Use of the instanceof operator. The instanceof operator is deprecated, use the is operator instead.
[java]
[java] if (leftOperand instanceof rightOperand)
[java] ^
[java]
[java] C:\jenkins\workspace\royale-asjs\frameworks\projects\Language\src\main\royale\org\apache\royale\utils\Language.as(721): col: 36 Use of the instanceof operator. The instanceof operator is deprecated, use the is operator instead.
[java]
[java] var ret:Boolean = base && v[Language.SYNTH_TAG_FIELD] instanceof langSynthType['_types'][typeName];
[java] ^
[java]
[java] C:\jenkins\workspace\royale-asjs\frameworks\projects\MXRoyale\src\main\royale\mx\charts\AreaChart.as(231): col: 21 Encountered this keyword within closure. Value of this will not be the same as enclosing scope.
[java]
[java] this.areaFill = fill;
[java] ^
[java]
[java] C:\jenkins\workspace\royale-asjs\frameworks\projects\MXRoyale\src\main\royale\mx\charts\AreaChart.as(232): col: 21 Encountered this keyword within closure. Value of this will not be the same as enclosing scope.
[java]
[java] this.fill = fill;
[java] ^
[java]
[java] C:\jenkins\workspace\royale-asjs\frameworks\projects\MXRoyale\src\main\royale\mx\charts\CandlestickChart.as(231): col: 22 Encountered this keyword within closure. Value of this will not be the same as enclosing scope.
[java]
[java] this.boxStroke = boxStroke;
[java] ^
[java]
[java] C:\jenkins\workspace\royale-asjs\frameworks\projects\MXRoyale\src\main\royale\mx\charts\CandlestickChart.as(232): col: 22 Encountered this keyword within closure. Value of this will not be the same as enclosing scope.
[java]
[java] this.declineFill = declineFill;
[java] ^
[java]
[java] C:\jenkins\workspace\royale-asjs\frameworks\projects\MXRoyale\src\main\royale\mx\charts\HLOCChart.as(228): col: 22 Encountered this keyword within closure. Value of this will not be the same as enclosing scope.
[java]
[java] this.closeTickStroke = tickStroke;
[java] ^
[java]
[java] C:\jenkins\workspace\royale-asjs\frameworks\projects\MXRoyale\src\main\royale\mx\charts\HLOCChart.as(229): col: 22 Encountered this keyword within closure. Value of this will not be the same as enclosing scope.
[java]
[java] this.openTickStroke = tickStroke;
[java] ^
[java]
[java] C:\jenkins\workspace\royale-asjs\frameworks\projects\MXRoyale\src\main\royale\mx\charts\HLOCChart.as(230): col: 22 Encountered this keyword within closure. Value of this will not be the same as enclosing scope.
[java]
[java] this.stroke = stroke;
[java] ^
[java]
[java] C:\jenkins\workspace\royale-asjs\frameworks\projects\MXRoyale\src\main\royale\mx\charts\HLOCChart.as(231): col: 22 Encountered this keyword within closure. Value of this will not be the same as enclosing scope.
[java]
[java] this.hlocColor = stroke.color;
[java] ^
[java]
[java] C:\jenkins\workspace\royale-asjs\frameworks\projects\MXRoyale\src\main\royale\mx\charts\LineChart.as(179): col: 22 Encountered this keyword within closure. Value of this will not be the same as enclosing scope.
[java]
[java] this.lineStroke = stroke;
[java] ^
[java]
[java] C:\jenkins\workspace\royale-asjs\frameworks\projects\MXRoyale\src\main\royale\mx\charts\LineChart.as(180): col: 22 Encountered this keyword within closure. Value of this will not be the same as enclosing scope.
[java]
[java] this.stroke = stroke;
[java] ^
[java]
[java] C:\jenkins\workspace\royale-asjs\frameworks\projects\MXRoyale\src\main\royale\mx\charts\LineChart.as(181): col: 22 Encountered this keyword within closure. Value of this will not be the same as enclosing scope.
[java]
[java] this.lineSegmentRenderer = new ClassFactory(LineRenderer);
[java] ^
[java]
[java] C:\jenkins\workspace\royale-asjs\frameworks\projects\MXRoyale\src\main\royale\mx\charts\PlotChart.as(158): col: 22 Encountered this keyword within closure. Value of this will not be the same as enclosing scope.
[java]
[java] this.fill = fill;
[java] ^
[java]
[java] C:\jenkins\workspace\royale-asjs\frameworks\projects\MXRoyale\src\main\royale\mx\charts\PlotChart.as(159): col: 22 Encountered this keyword within closure. Value of this will not be the same as enclosing scope.
[java]
[java] this.itemRenderer = skin;
[java] ^
[java]
[java] C:\jenkins\workspace\royale-asjs\frameworks\projects\MXRoyale\src\main\royale\mx\charts\PlotChart.as(160): col: 22 Encountered this keyword within closure. Value of this will not be the same as enclosing scope.
[java]
[java] this.radius = radius
[java] ^
[java]
[java] C:\jenkins\workspace\royale-asjs\frameworks\projects\MXRoyale\src\main\royale\mx\charts\styles\HaloDefaults.as(213): col: 6 Encountered this keyword within closure. Value of this will not be the same as enclosing scope.
[java]
[java] this.fill = defaultFill;
[java] ^
[java]
[java] C:\jenkins\workspace\royale-asjs\frameworks\projects\MXRoyale\src\main\royale\mx\charts\styles\HaloDefaults.as(214): col: 6 Encountered this keyword within closure. Value of this will not be the same as enclosing scope.
[java]
[java] this.areaFill = defaultFill;
[java] ^
[java]
[java] C:\jenkins\workspace\royale-asjs\frameworks\projects\MXRoyale\src\main\royale\mx\charts\styles\HaloDefaults.as(215): col: 6 Encountered this keyword within closure. Value of this will not be the same as enclosing scope.
[java]
[java] this.areaStroke = emptyStroke;
[java] ^
[java]
[java] C:\jenkins\workspace\royale-asjs\frameworks\projects\MXRoyale\src\main\royale\mx\charts\styles\HaloDefaults.as(216): col: 6 Encountered this keyword within closure. Value of this will not be the same as enclosing scope.
[java]
[java] this.lineStroke = defaultStroke;
[java] ^
[java]
[java] C:\jenkins\workspace\royale-asjs\frameworks\projects\MXRoyale\src\main\royale\mx\utils\ObjectUtil.as(715): col: 34 Use of the instanceof operator. The instanceof operator is deprecated, use the is operator instead.
[java]
[java] isDict = value instanceof Map || value instanceof WeakMap;
[java] ^
[java]
[java] C:\jenkins\workspace\royale-asjs\frameworks\projects\MXRoyale\src\main\royale\mx\utils\ObjectUtil.as(715): col: 58 Use of the instanceof operator. The instanceof operator is deprecated, use the is operator instead.
[java]
[java] isDict = value instanceof Map || value instanceof WeakMap;
[java] ^
[java]
[java] C:\jenkins\workspace\royale-asjs\frameworks\projects\MXRoyale\src\main\royale\mx\utils\ObjectUtil.as(1447): col: 32 Use of the instanceof operator. The instanceof operator is deprecated, use the is operator instead.
[java]
[java] var isDict:Boolean = (obj instanceof Map || obj instanceof WeakMap);
[java] ^
[java]
[java] C:\jenkins\workspace\royale-asjs\frameworks\projects\MXRoyale\src\main\royale\mx\utils\ObjectUtil.as(1447): col: 54 Use of the instanceof operator. The instanceof operator is deprecated, use the is operator instead.
[java]
[java] var isDict:Boolean = (obj instanceof Map || obj instanceof WeakMap);
[java] ^
[java]
[java] C:\jenkins\workspace\royale-asjs\frameworks\projects\MXRoyale\src\main\royale\mx\utils\ObjectUtil.as(1449): col: 17 Use of the instanceof operator. The instanceof operator is deprecated, use the is operator instead.
[java]
[java] if (obj instanceof WeakMap) throw new Error('WeakMap cannot be enumerated, use Map instead');
[java] ^
[java]
[java] C:\jenkins\workspace\royale-asjs\frameworks\projects\Network\src\main\royale\org\apache\royale\net\remoting\amf\AMFBinaryData.as(823): col: 7 Use of the instanceof operator. The instanceof operator is deprecated, use the is operator instead.
[java]
[java] if (value instanceof Function) {
[java] ^
[java]
[java] C:\jenkins\workspace\royale-asjs\frameworks\projects\SparkRoyale\src\main\royale\spark\skins\spark\FormItemSkin.mxml(169): col: 30 Data binding will not be able to detect assignments to 'x'.
[java]
[java] <s:Group x="{contentGroup.x + contentGroup.contentWidth + 4}" y="{contentGroup.y}"
[java] ^
[java]
[java] C:\jenkins\workspace\royale-asjs\frameworks\projects\SparkRoyale\src\main\royale\spark\skins\spark\FormItemSkin.mxml(169): col: 83 Data binding will not be able to detect assignments to 'y'.
[java]
[java] <s:Group x="{contentGroup.x + contentGroup.contentWidth + 4}" y="{contentGroup.y}"
[java] ^
[java]
[java] C:\jenkins\workspace\royale-asjs\frameworks\projects\Storage\src\main\royale\org\apache\royale\storage\file\DataInputStream.as(73): col: 24 Encountered this keyword within closure. Value of this will not be the same as enclosing scope.
[java]
[java] streamEvent.data = this.result;
[java] ^
[java]
[java] C:\jenkins\workspace\royale-asjs\frameworks\projects\Storage\src\main\royale\org\apache\royale\storage\providers\AndroidExternalStorageProvider.as(106): col: 24 Encountered this keyword within closure. Value of this will not be the same as enclosing scope.
[java]
[java] newEvent.data = this.result;
[java] ^
[java]
[java] C:\jenkins\workspace\royale-asjs\frameworks\projects\Storage\src\main\royale\org\apache\royale\storage\providers\WebStorageProvider.as(105): col: 24 Encountered this keyword within closure. Value of this will not be the same as enclosing scope.
[java]
[java] newEvent.data = this.result;
[java] ^
[java]
[java] 149.5528601 seconds
[java] Picked up JAVA_TOOL_OPTIONS: -Dfile.encoding=UTF-8 -Xms384m -Xmx2g
[java] Java Result: 3
BUILD FAILED
<http://apacheroyaleci2.westus2.cloudapp.azure.com:8080/job/Royale_ASDoc_Example/645/artifact/examples/royale/ASDoc/build.xml>:49: The following error occurred while executing this line:
<http://apacheroyaleci2.westus2.cloudapp.azure.com:8080/job/Royale_ASDoc_Example/645/artifact/examples/royale/ASDoc/build.xml>:109: condition satisfied
Total time: 4 minutes 5 seconds
Picked up JAVA_TOOL_OPTIONS: -Dfile.encoding=UTF-8 -Xms384m -Xmx2g
Build step 'Invoke Ant' marked build as failure
Skipped archiving because build is not successful
Build failed in Jenkins: Royale_ASDoc_Example #644
Posted by ap...@gmail.com.
See <http://apacheroyaleci2.westus2.cloudapp.azure.com:8080/job/Royale_ASDoc_Example/644/display/redirect?page=changes>
Changes:
[carlosrovira] jewel-buttonbar: fix IE11 issue in layout
------------------------------------------
[...truncated 6.38 KB...]
[mxmlc] 14
[mxmlc] -output=<http://apacheroyaleci2.westus2.cloudapp.azure.com:8080/job/Royale_ASDoc_Example/644/artifact/examples/royale/ASDoc/bin-debug/ASDoc.swf>
[mxmlc] --
[mxmlc] <http://apacheroyaleci2.westus2.cloudapp.azure.com:8080/job/Royale_ASDoc_Example/644/artifact/examples/royale/ASDoc/src/main/royale/ASDoc.mxml>
[mxmlc] Loading configuration: C:\jenkins\workspace\royale-asjs\frameworks\royale-config.xml
[mxmlc] Loading configuration: <http://apacheroyaleci2.westus2.cloudapp.azure.com:8080/job/Royale_ASDoc_Example/644/artifact/examples/royale/ASDoc/src/main/config/compile-app-config.xml>
[mxmlc]
[mxmlc] 131245 bytes written to C:\jenkins\workspace\Royale_ASDoc_Example\examples\royale\ASDoc\bin-debug\ASDoc.swf in 15.061 seconds
[mxmlc] The project 'ASDoc' has been successfully compiled.
[mxmlc] 34.8767824 seconds
[mxmlc] Picked up JAVA_TOOL_OPTIONS: -Dfile.encoding=UTF-8 -Xms384m -Xmx2g
build_example.check-air:
build_example.wrapper:
[copy] Copying 1 file to <http://apacheroyaleci2.westus2.cloudapp.azure.com:8080/job/Royale_ASDoc_Example/644/artifact/examples/royale/ASDoc/bin-debug>
[copy] Copied 1 empty directory to 1 empty directory under <http://apacheroyaleci2.westus2.cloudapp.azure.com:8080/job/Royale_ASDoc_Example/644/artifact/examples/royale/ASDoc/bin-debug/history>
[copy] Copying 2 files to <http://apacheroyaleci2.westus2.cloudapp.azure.com:8080/job/Royale_ASDoc_Example/644/artifact/examples/royale/ASDoc/bin-debug>
build_example.check-resources:
build_example.copy-resources:
[copy] Copying 1 file to <http://apacheroyaleci2.westus2.cloudapp.azure.com:8080/job/Royale_ASDoc_Example/644/artifact/examples/royale/ASDoc/bin-debug>
build_example.compile-js-release:
[mxmlc] MXMLJSC
[mxmlc] -load-config+=<http://apacheroyaleci2.westus2.cloudapp.azure.com:8080/job/Royale_ASDoc_Example/644/artifact/examples/royale/ASDoc/src/main/config/compile-app-config.xml>
[mxmlc] -js-dynamic-access-unknown-members=true
[mxmlc] +playerglobal.version=11.7
[mxmlc] +env.PLAYERGLOBAL_HOME=C:\adobe\flash
[mxmlc] -compiler.debug=false
[mxmlc] +royalelib=C:\jenkins\workspace\royale-asjs/frameworks/
[mxmlc] -closure-lib=C:\jenkins\workspace\royale-asjs/js/lib/google/closure-library
[mxmlc] +configname=royale
[mxmlc] -swf-version
[mxmlc] 14
[mxmlc] -output=<http://apacheroyaleci2.westus2.cloudapp.azure.com:8080/job/Royale_ASDoc_Example/644/artifact/examples/royale/ASDoc/bin-release/ASDoc.swf>
[mxmlc] --
[mxmlc] <http://apacheroyaleci2.westus2.cloudapp.azure.com:8080/job/Royale_ASDoc_Example/644/artifact/examples/royale/ASDoc/src/main/royale/ASDoc.mxml>
[mxmlc] Loading configuration: C:\jenkins\workspace\royale-asjs\frameworks\royale-config.xml
[mxmlc] Loading configuration: <http://apacheroyaleci2.westus2.cloudapp.azure.com:8080/job/Royale_ASDoc_Example/644/artifact/examples/royale/ASDoc/src/main/config/compile-app-config.xml>
[mxmlc]
[mxmlc] 66493 bytes written to C:\jenkins\workspace\Royale_ASDoc_Example\examples\royale\ASDoc\bin-release\ASDoc.swf in 8.676 seconds
[mxmlc] Feb 19, 2020 3:09:13 PM com.google.javascript.jscomp.LoggerErrorManager printSummary
[mxmlc] INFO: 0 error(s), 0 warning(s), 97.3% typed
[mxmlc] The project 'ASDoc' has been successfully compiled and optimized.
[mxmlc] 67.7658204 seconds
[mxmlc] Picked up JAVA_TOOL_OPTIONS: -Dfile.encoding=UTF-8 -Xms384m -Xmx2g
build_example.check-air:
build_example.copy-app-xml:
main:
json:
[echo] ROYALE_COMPILER_HOME: C:\jenkins\workspace\royale-asjs/js
[java] C:\jenkins\workspace\royale-asjs\frameworks\projects\Core\src\main\royale\org\apache\royale\utils\object\defineSimpleProperty.as(36): col: 12 Encountered this keyword within closure. Value of this will not be the same as enclosing scope.
[java]
[java] return this[privateProp];
[java] ^
[java]
[java] C:\jenkins\workspace\royale-asjs\frameworks\projects\Core\src\main\royale\org\apache\royale\utils\object\defineSimpleProperty.as(39): col: 5 Encountered this keyword within closure. Value of this will not be the same as enclosing scope.
[java]
[java] this[privateProp] = val;
[java] ^
[java]
[java] C:\jenkins\workspace\royale-asjs\frameworks\projects\GoogleMaps\src\main\royale\org\apache\royale\maps\google\beads\GoogleMapView.as(114): col: 6 Encountered this keyword within closure. Value of this will not be the same as enclosing scope.
[java]
[java] (this['mapView'] as GoogleMapView).finishInitialization();
[java] ^
[java]
[java] C:\jenkins\workspace\royale-asjs\frameworks\projects\Jewel\src\main\royale\JewelClasses.as(84): col: 13 Definition org.apache.royale.jewel.beads.views.CheckBoxView could not be found.
[java]
[java] import org.apache.royale.jewel.beads.views.CheckBoxView; CheckBoxView;
[java] ^
[java]
[java] C:\jenkins\workspace\royale-asjs\frameworks\projects\Jewel\src\main\royale\JewelClasses.as(84): col: 63 Access of possibly undefined property CheckBoxView.
[java]
[java] import org.apache.royale.jewel.beads.views.CheckBoxView; CheckBoxView;
[java] ^
[java]
[java] C:\jenkins\workspace\royale-asjs\frameworks\projects\Language\src\main\royale\org\apache\royale\utils\Language.as(148): col: 17 Use of the instanceof operator. The instanceof operator is deprecated, use the is operator instead.
[java]
[java] if (leftOperand instanceof rightOperand)
[java] ^
[java]
[java] C:\jenkins\workspace\royale-asjs\frameworks\projects\Language\src\main\royale\org\apache\royale\utils\Language.as(721): col: 36 Use of the instanceof operator. The instanceof operator is deprecated, use the is operator instead.
[java]
[java] var ret:Boolean = base && v[Language.SYNTH_TAG_FIELD] instanceof langSynthType['_types'][typeName];
[java] ^
[java]
[java] C:\jenkins\workspace\royale-asjs\frameworks\projects\MXRoyale\src\main\royale\mx\charts\AreaChart.as(231): col: 21 Encountered this keyword within closure. Value of this will not be the same as enclosing scope.
[java]
[java] this.areaFill = fill;
[java] ^
[java]
[java] C:\jenkins\workspace\royale-asjs\frameworks\projects\MXRoyale\src\main\royale\mx\charts\AreaChart.as(232): col: 21 Encountered this keyword within closure. Value of this will not be the same as enclosing scope.
[java]
[java] this.fill = fill;
[java] ^
[java]
[java] C:\jenkins\workspace\royale-asjs\frameworks\projects\MXRoyale\src\main\royale\mx\charts\CandlestickChart.as(231): col: 22 Encountered this keyword within closure. Value of this will not be the same as enclosing scope.
[java]
[java] this.boxStroke = boxStroke;
[java] ^
[java]
[java] C:\jenkins\workspace\royale-asjs\frameworks\projects\MXRoyale\src\main\royale\mx\charts\CandlestickChart.as(232): col: 22 Encountered this keyword within closure. Value of this will not be the same as enclosing scope.
[java]
[java] this.declineFill = declineFill;
[java] ^
[java]
[java] C:\jenkins\workspace\royale-asjs\frameworks\projects\MXRoyale\src\main\royale\mx\charts\HLOCChart.as(228): col: 22 Encountered this keyword within closure. Value of this will not be the same as enclosing scope.
[java]
[java] this.closeTickStroke = tickStroke;
[java] ^
[java]
[java] C:\jenkins\workspace\royale-asjs\frameworks\projects\MXRoyale\src\main\royale\mx\charts\HLOCChart.as(229): col: 22 Encountered this keyword within closure. Value of this will not be the same as enclosing scope.
[java]
[java] this.openTickStroke = tickStroke;
[java] ^
[java]
[java] C:\jenkins\workspace\royale-asjs\frameworks\projects\MXRoyale\src\main\royale\mx\charts\HLOCChart.as(230): col: 22 Encountered this keyword within closure. Value of this will not be the same as enclosing scope.
[java]
[java] this.stroke = stroke;
[java] ^
[java]
[java] C:\jenkins\workspace\royale-asjs\frameworks\projects\MXRoyale\src\main\royale\mx\charts\HLOCChart.as(231): col: 22 Encountered this keyword within closure. Value of this will not be the same as enclosing scope.
[java]
[java] this.hlocColor = stroke.color;
[java] ^
[java]
[java] C:\jenkins\workspace\royale-asjs\frameworks\projects\MXRoyale\src\main\royale\mx\charts\LineChart.as(179): col: 22 Encountered this keyword within closure. Value of this will not be the same as enclosing scope.
[java]
[java] this.lineStroke = stroke;
[java] ^
[java]
[java] C:\jenkins\workspace\royale-asjs\frameworks\projects\MXRoyale\src\main\royale\mx\charts\LineChart.as(180): col: 22 Encountered this keyword within closure. Value of this will not be the same as enclosing scope.
[java]
[java] this.stroke = stroke;
[java] ^
[java]
[java] C:\jenkins\workspace\royale-asjs\frameworks\projects\MXRoyale\src\main\royale\mx\charts\LineChart.as(181): col: 22 Encountered this keyword within closure. Value of this will not be the same as enclosing scope.
[java]
[java] this.lineSegmentRenderer = new ClassFactory(LineRenderer);
[java] ^
[java]
[java] C:\jenkins\workspace\royale-asjs\frameworks\projects\MXRoyale\src\main\royale\mx\charts\PlotChart.as(158): col: 22 Encountered this keyword within closure. Value of this will not be the same as enclosing scope.
[java]
[java] this.fill = fill;
[java] ^
[java]
[java] C:\jenkins\workspace\royale-asjs\frameworks\projects\MXRoyale\src\main\royale\mx\charts\PlotChart.as(159): col: 22 Encountered this keyword within closure. Value of this will not be the same as enclosing scope.
[java]
[java] this.itemRenderer = skin;
[java] ^
[java]
[java] C:\jenkins\workspace\royale-asjs\frameworks\projects\MXRoyale\src\main\royale\mx\charts\PlotChart.as(160): col: 22 Encountered this keyword within closure. Value of this will not be the same as enclosing scope.
[java]
[java] this.radius = radius
[java] ^
[java]
[java] C:\jenkins\workspace\royale-asjs\frameworks\projects\MXRoyale\src\main\royale\mx\charts\styles\HaloDefaults.as(213): col: 6 Encountered this keyword within closure. Value of this will not be the same as enclosing scope.
[java]
[java] this.fill = defaultFill;
[java] ^
[java]
[java] C:\jenkins\workspace\royale-asjs\frameworks\projects\MXRoyale\src\main\royale\mx\charts\styles\HaloDefaults.as(214): col: 6 Encountered this keyword within closure. Value of this will not be the same as enclosing scope.
[java]
[java] this.areaFill = defaultFill;
[java] ^
[java]
[java] C:\jenkins\workspace\royale-asjs\frameworks\projects\MXRoyale\src\main\royale\mx\charts\styles\HaloDefaults.as(215): col: 6 Encountered this keyword within closure. Value of this will not be the same as enclosing scope.
[java]
[java] this.areaStroke = emptyStroke;
[java] ^
[java]
[java] C:\jenkins\workspace\royale-asjs\frameworks\projects\MXRoyale\src\main\royale\mx\charts\styles\HaloDefaults.as(216): col: 6 Encountered this keyword within closure. Value of this will not be the same as enclosing scope.
[java]
[java] this.lineStroke = defaultStroke;
[java] ^
[java]
[java] C:\jenkins\workspace\royale-asjs\frameworks\projects\MXRoyale\src\main\royale\mx\utils\ObjectUtil.as(715): col: 34 Use of the instanceof operator. The instanceof operator is deprecated, use the is operator instead.
[java]
[java] isDict = value instanceof Map || value instanceof WeakMap;
[java] ^
[java]
[java] C:\jenkins\workspace\royale-asjs\frameworks\projects\MXRoyale\src\main\royale\mx\utils\ObjectUtil.as(715): col: 58 Use of the instanceof operator. The instanceof operator is deprecated, use the is operator instead.
[java]
[java] isDict = value instanceof Map || value instanceof WeakMap;
[java] ^
[java]
[java] C:\jenkins\workspace\royale-asjs\frameworks\projects\MXRoyale\src\main\royale\mx\utils\ObjectUtil.as(1447): col: 32 Use of the instanceof operator. The instanceof operator is deprecated, use the is operator instead.
[java]
[java] var isDict:Boolean = (obj instanceof Map || obj instanceof WeakMap);
[java] ^
[java]
[java] C:\jenkins\workspace\royale-asjs\frameworks\projects\MXRoyale\src\main\royale\mx\utils\ObjectUtil.as(1447): col: 54 Use of the instanceof operator. The instanceof operator is deprecated, use the is operator instead.
[java]
[java] var isDict:Boolean = (obj instanceof Map || obj instanceof WeakMap);
[java] ^
[java]
[java] C:\jenkins\workspace\royale-asjs\frameworks\projects\MXRoyale\src\main\royale\mx\utils\ObjectUtil.as(1449): col: 17 Use of the instanceof operator. The instanceof operator is deprecated, use the is operator instead.
[java]
[java] if (obj instanceof WeakMap) throw new Error('WeakMap cannot be enumerated, use Map instead');
[java] ^
[java]
[java] C:\jenkins\workspace\royale-asjs\frameworks\projects\Network\src\main\royale\org\apache\royale\net\remoting\amf\AMFBinaryData.as(823): col: 7 Use of the instanceof operator. The instanceof operator is deprecated, use the is operator instead.
[java]
[java] if (value instanceof Function) {
[java] ^
[java]
[java] C:\jenkins\workspace\royale-asjs\frameworks\projects\SparkRoyale\src\main\royale\spark\skins\spark\FormItemSkin.mxml(169): col: 30 Data binding will not be able to detect assignments to 'x'.
[java]
[java] <s:Group x="{contentGroup.x + contentGroup.contentWidth + 4}" y="{contentGroup.y}"
[java] ^
[java]
[java] C:\jenkins\workspace\royale-asjs\frameworks\projects\SparkRoyale\src\main\royale\spark\skins\spark\FormItemSkin.mxml(169): col: 83 Data binding will not be able to detect assignments to 'y'.
[java]
[java] <s:Group x="{contentGroup.x + contentGroup.contentWidth + 4}" y="{contentGroup.y}"
[java] ^
[java]
[java] C:\jenkins\workspace\royale-asjs\frameworks\projects\Storage\src\main\royale\org\apache\royale\storage\file\DataInputStream.as(73): col: 24 Encountered this keyword within closure. Value of this will not be the same as enclosing scope.
[java]
[java] streamEvent.data = this.result;
[java] ^
[java] 183.9781219 seconds
[java]
[java] C:\jenkins\workspace\royale-asjs\frameworks\projects\Storage\src\main\royale\org\apache\royale\storage\providers\AndroidExternalStorageProvider.as(106): col: 24 Encountered this keyword within closure. Value of this will not be the same as enclosing scope.
[java]
[java] newEvent.data = this.result;
[java] ^
[java]
[java] C:\jenkins\workspace\royale-asjs\frameworks\projects\Storage\src\main\royale\org\apache\royale\storage\providers\WebStorageProvider.as(105): col: 24 Encountered this keyword within closure. Value of this will not be the same as enclosing scope.
[java]
[java] newEvent.data = this.result;
[java] ^
[java]
[java] Picked up JAVA_TOOL_OPTIONS: -Dfile.encoding=UTF-8 -Xms384m -Xmx2g
[java] Java Result: 3
BUILD FAILED
<http://apacheroyaleci2.westus2.cloudapp.azure.com:8080/job/Royale_ASDoc_Example/644/artifact/examples/royale/ASDoc/build.xml>:49: The following error occurred while executing this line:
<http://apacheroyaleci2.westus2.cloudapp.azure.com:8080/job/Royale_ASDoc_Example/644/artifact/examples/royale/ASDoc/build.xml>:109: condition satisfied
Total time: 4 minutes 50 seconds
Picked up JAVA_TOOL_OPTIONS: -Dfile.encoding=UTF-8 -Xms384m -Xmx2g
Build step 'Invoke Ant' marked build as failure
Skipped archiving because build is not successful
Build failed in Jenkins: Royale_ASDoc_Example #643
Posted by ap...@gmail.com.
See <http://apacheroyaleci2.westus2.cloudapp.azure.com:8080/job/Royale_ASDoc_Example/643/display/redirect?page=changes>
Changes:
[carlosrovira] jewel-datagrid: fix datagrid layout when there's no dataprovider or is
------------------------------------------
[...truncated 5.17 KB...]
[mxmlc] 14
[mxmlc] -output=<http://apacheroyaleci2.westus2.cloudapp.azure.com:8080/job/Royale_ASDoc_Example/643/artifact/examples/royale/ASDoc/bin-debug/ASDoc.swf>
[mxmlc] --
[mxmlc] <http://apacheroyaleci2.westus2.cloudapp.azure.com:8080/job/Royale_ASDoc_Example/643/artifact/examples/royale/ASDoc/src/main/royale/ASDoc.mxml>
[mxmlc] Loading configuration: C:\jenkins\workspace\royale-asjs\frameworks\royale-config.xml
[mxmlc] Loading configuration: <http://apacheroyaleci2.westus2.cloudapp.azure.com:8080/job/Royale_ASDoc_Example/643/artifact/examples/royale/ASDoc/src/main/config/compile-app-config.xml>
[mxmlc]
[mxmlc] 131249 bytes written to C:\jenkins\workspace\Royale_ASDoc_Example\examples\royale\ASDoc\bin-debug\ASDoc.swf in 16.287 seconds
[mxmlc] The project 'ASDoc' has been successfully compiled.
[mxmlc] 29.7853141 seconds
[mxmlc] Picked up JAVA_TOOL_OPTIONS: -Dfile.encoding=UTF-8 -Xms384m -Xmx2g
build_example.check-air:
build_example.wrapper:
[copy] Copying 1 file to <http://apacheroyaleci2.westus2.cloudapp.azure.com:8080/job/Royale_ASDoc_Example/643/artifact/examples/royale/ASDoc/bin-debug>
[copy] Copied 1 empty directory to 1 empty directory under <http://apacheroyaleci2.westus2.cloudapp.azure.com:8080/job/Royale_ASDoc_Example/643/artifact/examples/royale/ASDoc/bin-debug/history>
[copy] Copying 2 files to <http://apacheroyaleci2.westus2.cloudapp.azure.com:8080/job/Royale_ASDoc_Example/643/artifact/examples/royale/ASDoc/bin-debug>
build_example.check-resources:
build_example.copy-resources:
[copy] Copying 1 file to <http://apacheroyaleci2.westus2.cloudapp.azure.com:8080/job/Royale_ASDoc_Example/643/artifact/examples/royale/ASDoc/bin-debug>
build_example.compile-js-release:
[mxmlc] MXMLJSC
[mxmlc] -load-config+=<http://apacheroyaleci2.westus2.cloudapp.azure.com:8080/job/Royale_ASDoc_Example/643/artifact/examples/royale/ASDoc/src/main/config/compile-app-config.xml>
[mxmlc] -js-dynamic-access-unknown-members=true
[mxmlc] +playerglobal.version=11.7
[mxmlc] +env.PLAYERGLOBAL_HOME=C:\adobe\flash
[mxmlc] -compiler.debug=false
[mxmlc] +royalelib=C:\jenkins\workspace\royale-asjs/frameworks/
[mxmlc] -closure-lib=C:\jenkins\workspace\royale-asjs/js/lib/google/closure-library
[mxmlc] +configname=royale
[mxmlc] -swf-version
[mxmlc] 14
[mxmlc] -output=<http://apacheroyaleci2.westus2.cloudapp.azure.com:8080/job/Royale_ASDoc_Example/643/artifact/examples/royale/ASDoc/bin-release/ASDoc.swf>
[mxmlc] --
[mxmlc] <http://apacheroyaleci2.westus2.cloudapp.azure.com:8080/job/Royale_ASDoc_Example/643/artifact/examples/royale/ASDoc/src/main/royale/ASDoc.mxml>
[mxmlc] Loading configuration: C:\jenkins\workspace\royale-asjs\frameworks\royale-config.xml
[mxmlc] Loading configuration: <http://apacheroyaleci2.westus2.cloudapp.azure.com:8080/job/Royale_ASDoc_Example/643/artifact/examples/royale/ASDoc/src/main/config/compile-app-config.xml>
[mxmlc]
[mxmlc] 66465 bytes written to C:\jenkins\workspace\Royale_ASDoc_Example\examples\royale\ASDoc\bin-release\ASDoc.swf in 16.126 seconds
[mxmlc] Feb 19, 2020 12:53:53 PM com.google.javascript.jscomp.LoggerErrorManager printSummary
[mxmlc] INFO: 0 error(s), 0 warning(s), 97.3% typed
[mxmlc] Picked up JAVA_TOOL_OPTIONS: -Dfile.encoding=UTF-8 -Xms384m -Xmx2g
[mxmlc] The project 'ASDoc' has been successfully compiled and optimized.
[mxmlc] 70.5946809 seconds
build_example.check-air:
build_example.copy-app-xml:
main:
json:
[echo] ROYALE_COMPILER_HOME: C:\jenkins\workspace\royale-asjs/js
[java] C:\jenkins\workspace\royale-asjs\frameworks\projects\Core\src\main\royale\org\apache\royale\utils\object\defineSimpleProperty.as(36): col: 12 Encountered this keyword within closure. Value of this will not be the same as enclosing scope.
[java]
[java] return this[privateProp];
[java] ^
[java]
[java] C:\jenkins\workspace\royale-asjs\frameworks\projects\Core\src\main\royale\org\apache\royale\utils\object\defineSimpleProperty.as(39): col: 5 Encountered this keyword within closure. Value of this will not be the same as enclosing scope.
[java]
[java] this[privateProp] = val;
[java] ^
[java]
[java] C:\jenkins\workspace\royale-asjs\frameworks\projects\GoogleMaps\src\main\royale\org\apache\royale\maps\google\beads\GoogleMapView.as(114): col: 6 Encountered this keyword within closure. Value of this will not be the same as enclosing scope.
[java]
[java] (this['mapView'] as GoogleMapView).finishInitialization();
[java] ^
[java]
[java] C:\jenkins\workspace\royale-asjs\frameworks\projects\Jewel\src\main\royale\JewelClasses.as(84): col: 13 Definition org.apache.royale.jewel.beads.views.CheckBoxView could not be found.
[java]
[java] import org.apache.royale.jewel.beads.views.CheckBoxView; CheckBoxView;
[java] ^
[java]
[java] C:\jenkins\workspace\royale-asjs\frameworks\projects\Jewel\src\main\royale\JewelClasses.as(84): col: 63 Access of possibly undefined property CheckBoxView.
[java]
[java] import org.apache.royale.jewel.beads.views.CheckBoxView; CheckBoxView;
[java] ^
[java]
[java] C:\jenkins\workspace\royale-asjs\frameworks\projects\Language\src\main\royale\org\apache\royale\utils\Language.as(148): col: 17 Use of the instanceof operator. The instanceof operator is deprecated, use the is operator instead.
[java]
[java] if (leftOperand instanceof rightOperand)
[java] ^
[java]
[java] C:\jenkins\workspace\royale-asjs\frameworks\projects\Language\src\main\royale\org\apache\royale\utils\Language.as(721): col: 36 Use of the instanceof operator. The instanceof operator is deprecated, use the is operator instead.
[java]
[java] var ret:Boolean = base && v[Language.SYNTH_TAG_FIELD] instanceof langSynthType['_types'][typeName];
[java] ^
[java]
[java] C:\jenkins\workspace\royale-asjs\frameworks\projects\MXRoyale\src\main\royale\mx\charts\AreaChart.as(231): col: 21 Encountered this keyword within closure. Value of this will not be the same as enclosing scope.
[java]
[java] this.areaFill = fill;
[java] ^
[java]
[java] C:\jenkins\workspace\royale-asjs\frameworks\projects\MXRoyale\src\main\royale\mx\charts\AreaChart.as(232): col: 21 Encountered this keyword within closure. Value of this will not be the same as enclosing scope.
[java]
[java] this.fill = fill;
[java] ^
[java]
[java] C:\jenkins\workspace\royale-asjs\frameworks\projects\MXRoyale\src\main\royale\mx\charts\CandlestickChart.as(231): col: 22 Encountered this keyword within closure. Value of this will not be the same as enclosing scope.
[java]
[java] this.boxStroke = boxStroke;
[java] ^
[java]
[java] C:\jenkins\workspace\royale-asjs\frameworks\projects\MXRoyale\src\main\royale\mx\charts\CandlestickChart.as(232): col: 22 Encountered this keyword within closure. Value of this will not be the same as enclosing scope.
[java]
[java] this.declineFill = declineFill;
[java] ^
[java]
[java] C:\jenkins\workspace\royale-asjs\frameworks\projects\MXRoyale\src\main\royale\mx\charts\HLOCChart.as(228): col: 22 Encountered this keyword within closure. Value of this will not be the same as enclosing scope.
[java]
[java] this.closeTickStroke = tickStroke;
[java] ^
[java]
[java] C:\jenkins\workspace\royale-asjs\frameworks\projects\MXRoyale\src\main\royale\mx\charts\HLOCChart.as(229): col: 22 Encountered this keyword within closure. Value of this will not be the same as enclosing scope.
[java]
[java] this.openTickStroke = tickStroke;
[java] ^
[java]
[java] C:\jenkins\workspace\royale-asjs\frameworks\projects\MXRoyale\src\main\royale\mx\charts\HLOCChart.as(230): col: 22 Encountered this keyword within closure. Value of this will not be the same as enclosing scope.
[java]
[java] this.stroke = stroke;
[java] ^
[java]
[java] C:\jenkins\workspace\royale-asjs\frameworks\projects\MXRoyale\src\main\royale\mx\charts\HLOCChart.as(231): col: 22 Encountered this keyword within closure. Value of this will not be the same as enclosing scope.
[java]
[java] this.hlocColor = stroke.color;
[java] ^
[java]
[java] C:\jenkins\workspace\royale-asjs\frameworks\projects\MXRoyale\src\main\royale\mx\charts\LineChart.as(179): col: 22 Encountered this keyword within closure. Value of this will not be the same as enclosing scope.
[java]
[java] this.lineStroke = stroke;
[java] ^
[java]
[java] C:\jenkins\workspace\royale-asjs\frameworks\projects\MXRoyale\src\main\royale\mx\charts\LineChart.as(180): col: 22 Encountered this keyword within closure. Value of this will not be the same as enclosing scope.
[java]
[java] this.stroke = stroke;
[java] ^
[java]
[java] C:\jenkins\workspace\royale-asjs\frameworks\projects\MXRoyale\src\main\royale\mx\charts\LineChart.as(181): col: 22 Encountered this keyword within closure. Value of this will not be the same as enclosing scope.
[java]
[java] this.lineSegmentRenderer = new ClassFactory(LineRenderer);
[java] ^
[java]
[java] C:\jenkins\workspace\royale-asjs\frameworks\projects\MXRoyale\src\main\royale\mx\charts\PlotChart.as(158): col: 22 Encountered this keyword within closure. Value of this will not be the same as enclosing scope.
[java]
[java] this.fill = fill;
[java] ^
[java]
[java] C:\jenkins\workspace\royale-asjs\frameworks\projects\MXRoyale\src\main\royale\mx\charts\PlotChart.as(159): col: 22 Encountered this keyword within closure. Value of this will not be the same as enclosing scope.
[java]
[java] this.itemRenderer = skin;
[java] ^
[java]
[java] C:\jenkins\workspace\royale-asjs\frameworks\projects\MXRoyale\src\main\royale\mx\charts\PlotChart.as(160): col: 22 Encountered this keyword within closure. Value of this will not be the same as enclosing scope.
[java]
[java] this.radius = radius
[java] ^
[java]
[java] C:\jenkins\workspace\royale-asjs\frameworks\projects\MXRoyale\src\main\royale\mx\charts\styles\HaloDefaults.as(213): col: 6 Encountered this keyword within closure. Value of this will not be the same as enclosing scope.
[java]
[java] this.fill = defaultFill;
[java] ^
[java]
[java] C:\jenkins\workspace\royale-asjs\frameworks\projects\MXRoyale\src\main\royale\mx\charts\styles\HaloDefaults.as(214): col: 6 Encountered this keyword within closure. Value of this will not be the same as enclosing scope.
[java]
[java] this.areaFill = defaultFill;
[java] ^
[java]
[java] C:\jenkins\workspace\royale-asjs\frameworks\projects\MXRoyale\src\main\royale\mx\charts\styles\HaloDefaults.as(215): col: 6 Encountered this keyword within closure. Value of this will not be the same as enclosing scope.
[java]
[java] this.areaStroke = emptyStroke;
[java] ^
[java]
[java] C:\jenkins\workspace\royale-asjs\frameworks\projects\MXRoyale\src\main\royale\mx\charts\styles\HaloDefaults.as(216): col: 6 Encountered this keyword within closure. Value of this will not be the same as enclosing scope.
[java]
[java] this.lineStroke = defaultStroke;
[java] ^
[java]
[java] C:\jenkins\workspace\royale-asjs\frameworks\projects\MXRoyale\src\main\royale\mx\utils\ObjectUtil.as(715): col: 34 Use of the instanceof operator. The instanceof operator is deprecated, use the is operator instead.
[java]
[java] isDict = value instanceof Map || value instanceof WeakMap;
[java] ^
[java]
[java] C:\jenkins\workspace\royale-asjs\frameworks\projects\MXRoyale\src\main\royale\mx\utils\ObjectUtil.as(715): col: 58 Use of the instanceof operator. The instanceof operator is deprecated, use the is operator instead.
[java]
[java] isDict = value instanceof Map || value instanceof WeakMap;
[java] ^
[java]
[java] C:\jenkins\workspace\royale-asjs\frameworks\projects\MXRoyale\src\main\royale\mx\utils\ObjectUtil.as(1447): col: 32 Use of the instanceof operator. The instanceof operator is deprecated, use the is operator instead.
[java]
[java] var isDict:Boolean = (obj instanceof Map || obj instanceof WeakMap);
[java] ^
[java]
[java] C:\jenkins\workspace\royale-asjs\frameworks\projects\MXRoyale\src\main\royale\mx\utils\ObjectUtil.as(1447): col: 54 Use of the instanceof operator. The instanceof operator is deprecated, use the is operator instead.
[java]
[java] var isDict:Boolean = (obj instanceof Map || obj instanceof WeakMap);
[java] ^
[java]
[java] C:\jenkins\workspace\royale-asjs\frameworks\projects\MXRoyale\src\main\royale\mx\utils\ObjectUtil.as(1449): col: 17 Use of the instanceof operator. The instanceof operator is deprecated, use the is operator instead.
[java]
[java] if (obj instanceof WeakMap) throw new Error('WeakMap cannot be enumerated, use Map instead');
[java] ^
[java]
[java] C:\jenkins\workspace\royale-asjs\frameworks\projects\Network\src\main\royale\org\apache\royale\net\remoting\amf\AMFBinaryData.as(823): col: 7 Use of the instanceof operator. The instanceof operator is deprecated, use the is operator instead.
[java]
[java] if (value instanceof Function) {
[java] ^
[java]
[java] C:\jenkins\workspace\royale-asjs\frameworks\projects\SparkRoyale\src\main\royale\spark\skins\spark\FormItemSkin.mxml(169): col: 30 Data binding will not be able to detect assignments to 'x'.
[java]
[java] <s:Group x="{contentGroup.x + contentGroup.contentWidth + 4}" y="{contentGroup.y}"
[java] ^
[java]
[java] C:\jenkins\workspace\royale-asjs\frameworks\projects\SparkRoyale\src\main\royale\spark\skins\spark\FormItemSkin.mxml(169): col: 83 Data binding will not be able to detect assignments to 'y'.
[java]
[java] <s:Group x="{contentGroup.x + contentGroup.contentWidth + 4}" y="{contentGroup.y}"
[java] ^
[java]
[java] C:\jenkins\workspace\royale-asjs\frameworks\projects\Storage\src\main\royale\org\apache\royale\storage\file\DataInputStream.as(73): col: 24 Encountered this keyword within closure. Value of this will not be the same as enclosing scope.
[java]
[java] streamEvent.data = this.result;
[java] ^
[java]
[java] C:\jenkins\workspace\royale-asjs\frameworks\projects\Storage\src\main\royale\org\apache\royale\storage\providers\AndroidExternalStorageProvider.as(106): col: 24 Encountered this keyword within closure. Value of this will not be the same as enclosing scope.
[java]
[java] newEvent.data = this.result;
[java] ^
[java]
[java] C:\jenkins\workspace\royale-asjs\frameworks\projects\Storage\src\main\royale\org\apache\royale\storage\providers\WebStorageProvider.as(105): col: 24 Encountered this keyword within closure. Value of this will not be the same as enclosing scope.
[java]
[java] newEvent.data = this.result;
[java] ^
[java]
[java] 174.0396938 seconds
[java] Picked up JAVA_TOOL_OPTIONS: -Dfile.encoding=UTF-8 -Xms384m -Xmx2g
[java] Java Result: 3
BUILD FAILED
<http://apacheroyaleci2.westus2.cloudapp.azure.com:8080/job/Royale_ASDoc_Example/643/artifact/examples/royale/ASDoc/build.xml>:49: The following error occurred while executing this line:
<http://apacheroyaleci2.westus2.cloudapp.azure.com:8080/job/Royale_ASDoc_Example/643/artifact/examples/royale/ASDoc/build.xml>:109: condition satisfied
Total time: 4 minutes 37 seconds
Picked up JAVA_TOOL_OPTIONS: -Dfile.encoding=UTF-8 -Xms384m -Xmx2g
Build step 'Invoke Ant' marked build as failure
Skipped archiving because build is not successful
Build failed in Jenkins: Royale_ASDoc_Example #642
Posted by ap...@gmail.com.
See <http://apacheroyaleci2.westus2.cloudapp.azure.com:8080/job/Royale_ASDoc_Example/642/display/redirect>
Changes:
------------------------------------------
[...truncated 5.88 KB...]
[mxmlc] 14
[mxmlc] -output=<http://apacheroyaleci2.westus2.cloudapp.azure.com:8080/job/Royale_ASDoc_Example/642/artifact/examples/royale/ASDoc/bin-debug/ASDoc.swf>
[mxmlc] --
[mxmlc] <http://apacheroyaleci2.westus2.cloudapp.azure.com:8080/job/Royale_ASDoc_Example/642/artifact/examples/royale/ASDoc/src/main/royale/ASDoc.mxml>
[mxmlc] Loading configuration: C:\jenkins\workspace\royale-asjs\frameworks\royale-config.xml
[mxmlc] Loading configuration: <http://apacheroyaleci2.westus2.cloudapp.azure.com:8080/job/Royale_ASDoc_Example/642/artifact/examples/royale/ASDoc/src/main/config/compile-app-config.xml>
[mxmlc]
[mxmlc] 131247 bytes written to C:\jenkins\workspace\Royale_ASDoc_Example\examples\royale\ASDoc\bin-debug\ASDoc.swf in 9.242 seconds
[mxmlc] Picked up JAVA_TOOL_OPTIONS: -Dfile.encoding=UTF-8 -Xms384m -Xmx2g
[mxmlc] The project 'ASDoc' has been successfully compiled.
[mxmlc] 22.496813 seconds
build_example.check-air:
build_example.wrapper:
[copy] Copying 1 file to <http://apacheroyaleci2.westus2.cloudapp.azure.com:8080/job/Royale_ASDoc_Example/642/artifact/examples/royale/ASDoc/bin-debug>
[copy] Copied 1 empty directory to 1 empty directory under <http://apacheroyaleci2.westus2.cloudapp.azure.com:8080/job/Royale_ASDoc_Example/642/artifact/examples/royale/ASDoc/bin-debug/history>
[copy] Copying 2 files to <http://apacheroyaleci2.westus2.cloudapp.azure.com:8080/job/Royale_ASDoc_Example/642/artifact/examples/royale/ASDoc/bin-debug>
build_example.check-resources:
build_example.copy-resources:
[copy] Copying 1 file to <http://apacheroyaleci2.westus2.cloudapp.azure.com:8080/job/Royale_ASDoc_Example/642/artifact/examples/royale/ASDoc/bin-debug>
build_example.compile-js-release:
[mxmlc] MXMLJSC
[mxmlc] -load-config+=<http://apacheroyaleci2.westus2.cloudapp.azure.com:8080/job/Royale_ASDoc_Example/642/artifact/examples/royale/ASDoc/src/main/config/compile-app-config.xml>
[mxmlc] -js-dynamic-access-unknown-members=true
[mxmlc] +playerglobal.version=11.7
[mxmlc] +env.PLAYERGLOBAL_HOME=C:\adobe\flash
[mxmlc] -compiler.debug=false
[mxmlc] +royalelib=C:\jenkins\workspace\royale-asjs/frameworks/
[mxmlc] -closure-lib=C:\jenkins\workspace\royale-asjs/js/lib/google/closure-library
[mxmlc] +configname=royale
[mxmlc] -swf-version
[mxmlc] 14
[mxmlc] -output=<http://apacheroyaleci2.westus2.cloudapp.azure.com:8080/job/Royale_ASDoc_Example/642/artifact/examples/royale/ASDoc/bin-release/ASDoc.swf>
[mxmlc] --
[mxmlc] <http://apacheroyaleci2.westus2.cloudapp.azure.com:8080/job/Royale_ASDoc_Example/642/artifact/examples/royale/ASDoc/src/main/royale/ASDoc.mxml>
[mxmlc] Loading configuration: C:\jenkins\workspace\royale-asjs\frameworks\royale-config.xml
[mxmlc] Loading configuration: <http://apacheroyaleci2.westus2.cloudapp.azure.com:8080/job/Royale_ASDoc_Example/642/artifact/examples/royale/ASDoc/src/main/config/compile-app-config.xml>
[mxmlc]
[mxmlc] 66504 bytes written to C:\jenkins\workspace\Royale_ASDoc_Example\examples\royale\ASDoc\bin-release\ASDoc.swf in 6.548 seconds
[mxmlc] Feb 19, 2020 5:36:18 AM com.google.javascript.jscomp.LoggerErrorManager printSummary
[mxmlc] INFO: 0 error(s), 0 warning(s), 97.3% typed
[mxmlc] The project 'ASDoc' has been successfully compiled and optimized.
[mxmlc] 44.0142694 seconds
[mxmlc] Picked up JAVA_TOOL_OPTIONS: -Dfile.encoding=UTF-8 -Xms384m -Xmx2g
build_example.check-air:
build_example.copy-app-xml:
main:
json:
[echo] ROYALE_COMPILER_HOME: C:\jenkins\workspace\royale-asjs/js
[java] C:\jenkins\workspace\royale-asjs\frameworks\projects\Core\src\main\royale\org\apache\royale\utils\object\defineSimpleProperty.as(36): col: 12 Encountered this keyword within closure. Value of this will not be the same as enclosing scope.
[java]
[java] return this[privateProp];
[java] ^
[java]
[java] C:\jenkins\workspace\royale-asjs\frameworks\projects\Core\src\main\royale\org\apache\royale\utils\object\defineSimpleProperty.as(39): col: 5 Encountered this keyword within closure. Value of this will not be the same as enclosing scope.
[java]
[java] this[privateProp] = val;
[java] ^
[java]
[java] C:\jenkins\workspace\royale-asjs\frameworks\projects\GoogleMaps\src\main\royale\org\apache\royale\maps\google\beads\GoogleMapView.as(114): col: 6 Encountered this keyword within closure. Value of this will not be the same as enclosing scope.
[java]
[java] (this['mapView'] as GoogleMapView).finishInitialization();
[java] ^
[java]
[java] C:\jenkins\workspace\royale-asjs\frameworks\projects\Jewel\src\main\royale\JewelClasses.as(84): col: 13 Definition org.apache.royale.jewel.beads.views.CheckBoxView could not be found.
[java]
[java] import org.apache.royale.jewel.beads.views.CheckBoxView; CheckBoxView;
[java] ^
[java]
[java] C:\jenkins\workspace\royale-asjs\frameworks\projects\Jewel\src\main\royale\JewelClasses.as(84): col: 63 Access of possibly undefined property CheckBoxView.
[java]
[java] import org.apache.royale.jewel.beads.views.CheckBoxView; CheckBoxView;
[java] ^
[java]
[java] C:\jenkins\workspace\royale-asjs\frameworks\projects\Language\src\main\royale\org\apache\royale\utils\Language.as(148): col: 17 Use of the instanceof operator. The instanceof operator is deprecated, use the is operator instead.
[java]
[java] if (leftOperand instanceof rightOperand)
[java] ^
[java]
[java] C:\jenkins\workspace\royale-asjs\frameworks\projects\Language\src\main\royale\org\apache\royale\utils\Language.as(721): col: 36 Use of the instanceof operator. The instanceof operator is deprecated, use the is operator instead.
[java]
[java] var ret:Boolean = base && v[Language.SYNTH_TAG_FIELD] instanceof langSynthType['_types'][typeName];
[java] ^
[java]
[java] C:\jenkins\workspace\royale-asjs\frameworks\projects\MXRoyale\src\main\royale\mx\charts\AreaChart.as(231): col: 21 Encountered this keyword within closure. Value of this will not be the same as enclosing scope.
[java]
[java] this.areaFill = fill;
[java] ^
[java]
[java] C:\jenkins\workspace\royale-asjs\frameworks\projects\MXRoyale\src\main\royale\mx\charts\AreaChart.as(232): col: 21 Encountered this keyword within closure. Value of this will not be the same as enclosing scope.
[java]
[java] this.fill = fill;
[java] ^
[java]
[java] C:\jenkins\workspace\royale-asjs\frameworks\projects\MXRoyale\src\main\royale\mx\charts\CandlestickChart.as(231): col: 22 Encountered this keyword within closure. Value of this will not be the same as enclosing scope.
[java]
[java] this.boxStroke = boxStroke;
[java] ^
[java]
[java] C:\jenkins\workspace\royale-asjs\frameworks\projects\MXRoyale\src\main\royale\mx\charts\CandlestickChart.as(232): col: 22 Encountered this keyword within closure. Value of this will not be the same as enclosing scope.
[java]
[java] this.declineFill = declineFill;
[java] ^
[java]
[java] C:\jenkins\workspace\royale-asjs\frameworks\projects\MXRoyale\src\main\royale\mx\charts\HLOCChart.as(228): col: 22 Encountered this keyword within closure. Value of this will not be the same as enclosing scope.
[java]
[java] this.closeTickStroke = tickStroke;
[java] ^
[java]
[java] C:\jenkins\workspace\royale-asjs\frameworks\projects\MXRoyale\src\main\royale\mx\charts\HLOCChart.as(229): col: 22 Encountered this keyword within closure. Value of this will not be the same as enclosing scope.
[java]
[java] this.openTickStroke = tickStroke;
[java] ^
[java]
[java] C:\jenkins\workspace\royale-asjs\frameworks\projects\MXRoyale\src\main\royale\mx\charts\HLOCChart.as(230): col: 22 Encountered this keyword within closure. Value of this will not be the same as enclosing scope.
[java]
[java] this.stroke = stroke;
[java] ^
[java]
[java] C:\jenkins\workspace\royale-asjs\frameworks\projects\MXRoyale\src\main\royale\mx\charts\HLOCChart.as(231): col: 22 Encountered this keyword within closure. Value of this will not be the same as enclosing scope.
[java]
[java] this.hlocColor = stroke.color;
[java] ^
[java]
[java] C:\jenkins\workspace\royale-asjs\frameworks\projects\MXRoyale\src\main\royale\mx\charts\LineChart.as(179): col: 22 Encountered this keyword within closure. Value of this will not be the same as enclosing scope.
[java]
[java] this.lineStroke = stroke;
[java] ^
[java]
[java] C:\jenkins\workspace\royale-asjs\frameworks\projects\MXRoyale\src\main\royale\mx\charts\LineChart.as(180): col: 22 Encountered this keyword within closure. Value of this will not be the same as enclosing scope.
[java]
[java] this.stroke = stroke;
[java] ^
[java]
[java] C:\jenkins\workspace\royale-asjs\frameworks\projects\MXRoyale\src\main\royale\mx\charts\LineChart.as(181): col: 22 Encountered this keyword within closure. Value of this will not be the same as enclosing scope.
[java]
[java] this.lineSegmentRenderer = new ClassFactory(LineRenderer);
[java] ^
[java]
[java] C:\jenkins\workspace\royale-asjs\frameworks\projects\MXRoyale\src\main\royale\mx\charts\PlotChart.as(158): col: 22 Encountered this keyword within closure. Value of this will not be the same as enclosing scope.
[java]
[java] this.fill = fill;
[java] ^
[java]
[java] C:\jenkins\workspace\royale-asjs\frameworks\projects\MXRoyale\src\main\royale\mx\charts\PlotChart.as(159): col: 22 Encountered this keyword within closure. Value of this will not be the same as enclosing scope.
[java]
[java] this.itemRenderer = skin;
[java] ^
[java]
[java] C:\jenkins\workspace\royale-asjs\frameworks\projects\MXRoyale\src\main\royale\mx\charts\PlotChart.as(160): col: 22 Encountered this keyword within closure. Value of this will not be the same as enclosing scope.
[java]
[java] this.radius = radius
[java] ^
[java]
[java] C:\jenkins\workspace\royale-asjs\frameworks\projects\MXRoyale\src\main\royale\mx\charts\styles\HaloDefaults.as(213): col: 6 Encountered this keyword within closure. Value of this will not be the same as enclosing scope.
[java]
[java] this.fill = defaultFill;
[java] ^
[java]
[java] C:\jenkins\workspace\royale-asjs\frameworks\projects\MXRoyale\src\main\royale\mx\charts\styles\HaloDefaults.as(214): col: 6 Encountered this keyword within closure. Value of this will not be the same as enclosing scope.
[java]
[java] this.areaFill = defaultFill;
[java] ^
[java]
[java] C:\jenkins\workspace\royale-asjs\frameworks\projects\MXRoyale\src\main\royale\mx\charts\styles\HaloDefaults.as(215): col: 6 Encountered this keyword within closure. Value of this will not be the same as enclosing scope.
[java]
[java] this.areaStroke = emptyStroke;
[java] ^
[java]
[java] C:\jenkins\workspace\royale-asjs\frameworks\projects\MXRoyale\src\main\royale\mx\charts\styles\HaloDefaults.as(216): col: 6 Encountered this keyword within closure. Value of this will not be the same as enclosing scope.
[java]
[java] this.lineStroke = defaultStroke;
[java] ^
[java]
[java] C:\jenkins\workspace\royale-asjs\frameworks\projects\MXRoyale\src\main\royale\mx\utils\ObjectUtil.as(715): col: 34 Use of the instanceof operator. The instanceof operator is deprecated, use the is operator instead.
[java]
[java] isDict = value instanceof Map || value instanceof WeakMap;
[java] ^
[java]
[java] C:\jenkins\workspace\royale-asjs\frameworks\projects\MXRoyale\src\main\royale\mx\utils\ObjectUtil.as(715): col: 58 Use of the instanceof operator. The instanceof operator is deprecated, use the is operator instead.
[java]
[java] isDict = value instanceof Map || value instanceof WeakMap;
[java] ^
[java]
[java] C:\jenkins\workspace\royale-asjs\frameworks\projects\MXRoyale\src\main\royale\mx\utils\ObjectUtil.as(1447): col: 32 Use of the instanceof operator. The instanceof operator is deprecated, use the is operator instead.
[java]
[java] var isDict:Boolean = (obj instanceof Map || obj instanceof WeakMap);
[java] ^
[java]
[java] C:\jenkins\workspace\royale-asjs\frameworks\projects\MXRoyale\src\main\royale\mx\utils\ObjectUtil.as(1447): col: 54 Use of the instanceof operator. The instanceof operator is deprecated, use the is operator instead.
[java]
[java] var isDict:Boolean = (obj instanceof Map || obj instanceof WeakMap);
[java] ^
[java]
[java] C:\jenkins\workspace\royale-asjs\frameworks\projects\MXRoyale\src\main\royale\mx\utils\ObjectUtil.as(1449): col: 17 Use of the instanceof operator. The instanceof operator is deprecated, use the is operator instead.
[java]
[java] if (obj instanceof WeakMap) throw new Error('WeakMap cannot be enumerated, use Map instead');
[java] ^
[java]
[java] C:\jenkins\workspace\royale-asjs\frameworks\projects\Network\src\main\royale\org\apache\royale\net\remoting\amf\AMFBinaryData.as(823): col: 7 Use of the instanceof operator. The instanceof operator is deprecated, use the is operator instead.
[java]
[java] if (value instanceof Function) {
[java] ^
[java]
[java] C:\jenkins\workspace\royale-asjs\frameworks\projects\SparkRoyale\src\main\royale\spark\skins\spark\FormItemSkin.mxml(169): col: 30 Data binding will not be able to detect assignments to 'x'.
[java]
[java] <s:Group x="{contentGroup.x + contentGroup.contentWidth + 4}" y="{contentGroup.y}"
[java] ^
[java]
[java] C:\jenkins\workspace\royale-asjs\frameworks\projects\SparkRoyale\src\main\royale\spark\skins\spark\FormItemSkin.mxml(169): col: 83 Data binding will not be able to detect assignments to 'y'.
[java]
[java] <s:Group x="{contentGroup.x + contentGroup.contentWidth + 4}" y="{contentGroup.y}"
[java] ^
[java]
[java] C:\jenkins\workspace\royale-asjs\frameworks\projects\Storage\src\main\royale\org\apache\royale\storage\file\DataInputStream.as(73): col: 24 Encountered this keyword within closure. Value of this will not be the same as enclosing scope.
[java]
[java] streamEvent.data = this.result;
[java] ^
[java]
[java] C:\jenkins\workspace\royale-asjs\frameworks\projects\Storage\src\main\royale\org\apache\royale\storage\providers\AndroidExternalStorageProvider.as(106): col: 24 Encountered this keyword within closure. Value of this will not be the same as enclosing scope.
[java]
[java] newEvent.data = this.result;
[java] ^
[java]
[java] C:\jenkins\workspace\royale-asjs\frameworks\projects\Storage\src\main\royale\org\apache\royale\storage\providers\WebStorageProvider.as(105): col: 24 Encountered this keyword within closure. Value of this will not be the same as enclosing scope.
[java]
[java] newEvent.data = this.result;
[java] ^
[java]
[java] 146.0216465 seconds
[java] Picked up JAVA_TOOL_OPTIONS: -Dfile.encoding=UTF-8 -Xms384m -Xmx2g
[java] Java Result: 3
BUILD FAILED
<http://apacheroyaleci2.westus2.cloudapp.azure.com:8080/job/Royale_ASDoc_Example/642/artifact/examples/royale/ASDoc/build.xml>:49: The following error occurred while executing this line:
<http://apacheroyaleci2.westus2.cloudapp.azure.com:8080/job/Royale_ASDoc_Example/642/artifact/examples/royale/ASDoc/build.xml>:109: condition satisfied
Total time: 3 minutes 35 seconds
Picked up JAVA_TOOL_OPTIONS: -Dfile.encoding=UTF-8 -Xms384m -Xmx2g
Build step 'Invoke Ant' marked build as failure
Skipped archiving because build is not successful
Build failed in Jenkins: Royale_ASDoc_Example #641
Posted by ap...@gmail.com.
See <http://apacheroyaleci2.westus2.cloudapp.azure.com:8080/job/Royale_ASDoc_Example/641/display/redirect>
Changes:
------------------------------------------
[...truncated 5.24 KB...]
[mxmlc] 14
[mxmlc] -output=<http://apacheroyaleci2.westus2.cloudapp.azure.com:8080/job/Royale_ASDoc_Example/641/artifact/examples/royale/ASDoc/bin-debug/ASDoc.swf>
[mxmlc] --
[mxmlc] <http://apacheroyaleci2.westus2.cloudapp.azure.com:8080/job/Royale_ASDoc_Example/641/artifact/examples/royale/ASDoc/src/main/royale/ASDoc.mxml>
[mxmlc] Loading configuration: C:\jenkins\workspace\royale-asjs\frameworks\royale-config.xml
[mxmlc] Loading configuration: <http://apacheroyaleci2.westus2.cloudapp.azure.com:8080/job/Royale_ASDoc_Example/641/artifact/examples/royale/ASDoc/src/main/config/compile-app-config.xml>
[mxmlc]
[mxmlc] 131245 bytes written to C:\jenkins\workspace\Royale_ASDoc_Example\examples\royale\ASDoc\bin-debug\ASDoc.swf in 18.787 seconds
[mxmlc] Picked up JAVA_TOOL_OPTIONS: -Dfile.encoding=UTF-8 -Xms384m -Xmx2g
[mxmlc] The project 'ASDoc' has been successfully compiled.
[mxmlc] 32.5459627 seconds
build_example.check-air:
build_example.wrapper:
[copy] Copying 1 file to <http://apacheroyaleci2.westus2.cloudapp.azure.com:8080/job/Royale_ASDoc_Example/641/artifact/examples/royale/ASDoc/bin-debug>
[copy] Copied 1 empty directory to 1 empty directory under <http://apacheroyaleci2.westus2.cloudapp.azure.com:8080/job/Royale_ASDoc_Example/641/artifact/examples/royale/ASDoc/bin-debug/history>
[copy] Copying 2 files to <http://apacheroyaleci2.westus2.cloudapp.azure.com:8080/job/Royale_ASDoc_Example/641/artifact/examples/royale/ASDoc/bin-debug>
build_example.check-resources:
build_example.copy-resources:
[copy] Copying 1 file to <http://apacheroyaleci2.westus2.cloudapp.azure.com:8080/job/Royale_ASDoc_Example/641/artifact/examples/royale/ASDoc/bin-debug>
build_example.compile-js-release:
[mxmlc] MXMLJSC
[mxmlc] -load-config+=<http://apacheroyaleci2.westus2.cloudapp.azure.com:8080/job/Royale_ASDoc_Example/641/artifact/examples/royale/ASDoc/src/main/config/compile-app-config.xml>
[mxmlc] -js-dynamic-access-unknown-members=true
[mxmlc] +playerglobal.version=11.7
[mxmlc] +env.PLAYERGLOBAL_HOME=C:\adobe\flash
[mxmlc] -compiler.debug=false
[mxmlc] +royalelib=C:\jenkins\workspace\royale-asjs/frameworks/
[mxmlc] -closure-lib=C:\jenkins\workspace\royale-asjs/js/lib/google/closure-library
[mxmlc] +configname=royale
[mxmlc] -swf-version
[mxmlc] 14
[mxmlc] -output=<http://apacheroyaleci2.westus2.cloudapp.azure.com:8080/job/Royale_ASDoc_Example/641/artifact/examples/royale/ASDoc/bin-release/ASDoc.swf>
[mxmlc] --
[mxmlc] <http://apacheroyaleci2.westus2.cloudapp.azure.com:8080/job/Royale_ASDoc_Example/641/artifact/examples/royale/ASDoc/src/main/royale/ASDoc.mxml>
[mxmlc] Loading configuration: C:\jenkins\workspace\royale-asjs\frameworks\royale-config.xml
[mxmlc] Loading configuration: <http://apacheroyaleci2.westus2.cloudapp.azure.com:8080/job/Royale_ASDoc_Example/641/artifact/examples/royale/ASDoc/src/main/config/compile-app-config.xml>
[mxmlc]
[mxmlc] 66504 bytes written to C:\jenkins\workspace\Royale_ASDoc_Example\examples\royale\ASDoc\bin-release\ASDoc.swf in 8.689 seconds
[mxmlc] Feb 19, 2020 3:50:05 AM com.google.javascript.jscomp.LoggerErrorManager printSummary
[mxmlc] INFO: 0 error(s), 0 warning(s), 97.3% typed
[mxmlc] The project 'ASDoc' has been successfully compiled and optimized.
[mxmlc] 51.7810661 seconds
[mxmlc] Picked up JAVA_TOOL_OPTIONS: -Dfile.encoding=UTF-8 -Xms384m -Xmx2g
build_example.check-air:
build_example.copy-app-xml:
main:
json:
[echo] ROYALE_COMPILER_HOME: C:\jenkins\workspace\royale-asjs/js
[java] C:\jenkins\workspace\royale-asjs\frameworks\projects\Core\src\main\royale\org\apache\royale\utils\object\defineSimpleProperty.as(36): col: 12 Encountered this keyword within closure. Value of this will not be the same as enclosing scope.
[java]
[java] return this[privateProp];
[java] ^
[java]
[java] C:\jenkins\workspace\royale-asjs\frameworks\projects\Core\src\main\royale\org\apache\royale\utils\object\defineSimpleProperty.as(39): col: 5 Encountered this keyword within closure. Value of this will not be the same as enclosing scope.
[java]
[java] this[privateProp] = val;
[java] ^
[java]
[java] C:\jenkins\workspace\royale-asjs\frameworks\projects\GoogleMaps\src\main\royale\org\apache\royale\maps\google\beads\GoogleMapView.as(114): col: 6 Encountered this keyword within closure. Value of this will not be the same as enclosing scope.
[java]
[java] (this['mapView'] as GoogleMapView).finishInitialization();
[java] ^
[java]
[java] C:\jenkins\workspace\royale-asjs\frameworks\projects\Jewel\src\main\royale\JewelClasses.as(84): col: 13 Definition org.apache.royale.jewel.beads.views.CheckBoxView could not be found.
[java]
[java] import org.apache.royale.jewel.beads.views.CheckBoxView; CheckBoxView;
[java] ^
[java]
[java] C:\jenkins\workspace\royale-asjs\frameworks\projects\Jewel\src\main\royale\JewelClasses.as(84): col: 63 Access of possibly undefined property CheckBoxView.
[java]
[java] import org.apache.royale.jewel.beads.views.CheckBoxView; CheckBoxView;
[java] ^
[java]
[java] C:\jenkins\workspace\royale-asjs\frameworks\projects\Language\src\main\royale\org\apache\royale\utils\Language.as(148): col: 17 Use of the instanceof operator. The instanceof operator is deprecated, use the is operator instead.
[java]
[java] if (leftOperand instanceof rightOperand)
[java] ^
[java]
[java] C:\jenkins\workspace\royale-asjs\frameworks\projects\Language\src\main\royale\org\apache\royale\utils\Language.as(721): col: 36 Use of the instanceof operator. The instanceof operator is deprecated, use the is operator instead.
[java]
[java] var ret:Boolean = base && v[Language.SYNTH_TAG_FIELD] instanceof langSynthType['_types'][typeName];
[java] ^
[java]
[java] C:\jenkins\workspace\royale-asjs\frameworks\projects\MXRoyale\src\main\royale\mx\charts\AreaChart.as(231): col: 21 Encountered this keyword within closure. Value of this will not be the same as enclosing scope.
[java]
[java] this.areaFill = fill;
[java] ^
[java]
[java] C:\jenkins\workspace\royale-asjs\frameworks\projects\MXRoyale\src\main\royale\mx\charts\AreaChart.as(232): col: 21 Encountered this keyword within closure. Value of this will not be the same as enclosing scope.
[java]
[java] this.fill = fill;
[java] ^
[java]
[java] C:\jenkins\workspace\royale-asjs\frameworks\projects\MXRoyale\src\main\royale\mx\charts\CandlestickChart.as(231): col: 22 Encountered this keyword within closure. Value of this will not be the same as enclosing scope.
[java]
[java] this.boxStroke = boxStroke;
[java] ^
[java]
[java] C:\jenkins\workspace\royale-asjs\frameworks\projects\MXRoyale\src\main\royale\mx\charts\CandlestickChart.as(232): col: 22 Encountered this keyword within closure. Value of this will not be the same as enclosing scope.
[java]
[java] this.declineFill = declineFill;
[java] ^
[java]
[java] C:\jenkins\workspace\royale-asjs\frameworks\projects\MXRoyale\src\main\royale\mx\charts\HLOCChart.as(228): col: 22 Encountered this keyword within closure. Value of this will not be the same as enclosing scope.
[java]
[java] this.closeTickStroke = tickStroke;
[java] ^
[java]
[java] C:\jenkins\workspace\royale-asjs\frameworks\projects\MXRoyale\src\main\royale\mx\charts\HLOCChart.as(229): col: 22 Encountered this keyword within closure. Value of this will not be the same as enclosing scope.
[java]
[java] this.openTickStroke = tickStroke;
[java] ^
[java]
[java] C:\jenkins\workspace\royale-asjs\frameworks\projects\MXRoyale\src\main\royale\mx\charts\HLOCChart.as(230): col: 22 Encountered this keyword within closure. Value of this will not be the same as enclosing scope.
[java]
[java] this.stroke = stroke;
[java] ^
[java]
[java] C:\jenkins\workspace\royale-asjs\frameworks\projects\MXRoyale\src\main\royale\mx\charts\HLOCChart.as(231): col: 22 Encountered this keyword within closure. Value of this will not be the same as enclosing scope.
[java]
[java] this.hlocColor = stroke.color;
[java] ^
[java]
[java] C:\jenkins\workspace\royale-asjs\frameworks\projects\MXRoyale\src\main\royale\mx\charts\LineChart.as(179): col: 22 Encountered this keyword within closure. Value of this will not be the same as enclosing scope.
[java]
[java] this.lineStroke = stroke;
[java] ^
[java]
[java] C:\jenkins\workspace\royale-asjs\frameworks\projects\MXRoyale\src\main\royale\mx\charts\LineChart.as(180): col: 22 Encountered this keyword within closure. Value of this will not be the same as enclosing scope.
[java]
[java] this.stroke = stroke;
[java] ^
[java]
[java] C:\jenkins\workspace\royale-asjs\frameworks\projects\MXRoyale\src\main\royale\mx\charts\LineChart.as(181): col: 22 Encountered this keyword within closure. Value of this will not be the same as enclosing scope.
[java]
[java] this.lineSegmentRenderer = new ClassFactory(LineRenderer);
[java] ^
[java]
[java] C:\jenkins\workspace\royale-asjs\frameworks\projects\MXRoyale\src\main\royale\mx\charts\PlotChart.as(158): col: 22 Encountered this keyword within closure. Value of this will not be the same as enclosing scope.
[java]
[java] this.fill = fill;
[java] ^
[java]
[java] C:\jenkins\workspace\royale-asjs\frameworks\projects\MXRoyale\src\main\royale\mx\charts\PlotChart.as(159): col: 22 Encountered this keyword within closure. Value of this will not be the same as enclosing scope.
[java]
[java] this.itemRenderer = skin;
[java] ^
[java]
[java] C:\jenkins\workspace\royale-asjs\frameworks\projects\MXRoyale\src\main\royale\mx\charts\PlotChart.as(160): col: 22 Encountered this keyword within closure. Value of this will not be the same as enclosing scope.
[java]
[java] this.radius = radius
[java] ^
[java]
[java] C:\jenkins\workspace\royale-asjs\frameworks\projects\MXRoyale\src\main\royale\mx\charts\styles\HaloDefaults.as(213): col: 6 Encountered this keyword within closure. Value of this will not be the same as enclosing scope.
[java]
[java] this.fill = defaultFill;
[java] ^
[java]
[java] C:\jenkins\workspace\royale-asjs\frameworks\projects\MXRoyale\src\main\royale\mx\charts\styles\HaloDefaults.as(214): col: 6 Encountered this keyword within closure. Value of this will not be the same as enclosing scope.
[java]
[java] this.areaFill = defaultFill;
[java] ^
[java]
[java] C:\jenkins\workspace\royale-asjs\frameworks\projects\MXRoyale\src\main\royale\mx\charts\styles\HaloDefaults.as(215): col: 6 Encountered this keyword within closure. Value of this will not be the same as enclosing scope.
[java]
[java] this.areaStroke = emptyStroke;
[java] ^
[java]
[java] C:\jenkins\workspace\royale-asjs\frameworks\projects\MXRoyale\src\main\royale\mx\charts\styles\HaloDefaults.as(216): col: 6 Encountered this keyword within closure. Value of this will not be the same as enclosing scope.
[java]
[java] this.lineStroke = defaultStroke;
[java] ^
[java]
[java] C:\jenkins\workspace\royale-asjs\frameworks\projects\MXRoyale\src\main\royale\mx\utils\ObjectUtil.as(715): col: 34 Use of the instanceof operator. The instanceof operator is deprecated, use the is operator instead.
[java]
[java] isDict = value instanceof Map || value instanceof WeakMap;
[java] ^
[java]
[java] C:\jenkins\workspace\royale-asjs\frameworks\projects\MXRoyale\src\main\royale\mx\utils\ObjectUtil.as(715): col: 58 Use of the instanceof operator. The instanceof operator is deprecated, use the is operator instead.
[java]
[java] isDict = value instanceof Map || value instanceof WeakMap;
[java] ^
[java]
[java] C:\jenkins\workspace\royale-asjs\frameworks\projects\MXRoyale\src\main\royale\mx\utils\ObjectUtil.as(1447): col: 32 Use of the instanceof operator. The instanceof operator is deprecated, use the is operator instead.
[java]
[java] var isDict:Boolean = (obj instanceof Map || obj instanceof WeakMap);
[java] ^
[java]
[java] C:\jenkins\workspace\royale-asjs\frameworks\projects\MXRoyale\src\main\royale\mx\utils\ObjectUtil.as(1447): col: 54 Use of the instanceof operator. The instanceof operator is deprecated, use the is operator instead.
[java]
[java] var isDict:Boolean = (obj instanceof Map || obj instanceof WeakMap);
[java] ^
[java]
[java] C:\jenkins\workspace\royale-asjs\frameworks\projects\MXRoyale\src\main\royale\mx\utils\ObjectUtil.as(1449): col: 17 Use of the instanceof operator. The instanceof operator is deprecated, use the is operator instead.
[java]
[java] if (obj instanceof WeakMap) throw new Error('WeakMap cannot be enumerated, use Map instead');
[java] ^
[java]
[java] C:\jenkins\workspace\royale-asjs\frameworks\projects\Network\src\main\royale\org\apache\royale\net\remoting\amf\AMFBinaryData.as(823): col: 7 Use of the instanceof operator. The instanceof operator is deprecated, use the is operator instead.
[java]
[java] if (value instanceof Function) {
[java] ^
[java]
[java] C:\jenkins\workspace\royale-asjs\frameworks\projects\SparkRoyale\src\main\royale\spark\skins\spark\FormItemSkin.mxml(169): col: 30 Data binding will not be able to detect assignments to 'x'.
[java]
[java] <s:Group x="{contentGroup.x + contentGroup.contentWidth + 4}" y="{contentGroup.y}"
[java] ^
[java]
[java] C:\jenkins\workspace\royale-asjs\frameworks\projects\SparkRoyale\src\main\royale\spark\skins\spark\FormItemSkin.mxml(169): col: 83 Data binding will not be able to detect assignments to 'y'.
[java]
[java] <s:Group x="{contentGroup.x + contentGroup.contentWidth + 4}" y="{contentGroup.y}"
[java] ^
[java]
[java] C:\jenkins\workspace\royale-asjs\frameworks\projects\Storage\src\main\royale\org\apache\royale\storage\file\DataInputStream.as(73): col: 24 Encountered this keyword within closure. Value of this will not be the same as enclosing scope.
[java]
[java] streamEvent.data = this.result;
[java] ^
[java]
[java] C:\jenkins\workspace\royale-asjs\frameworks\projects\Storage\src\main\royale\org\apache\royale\storage\providers\AndroidExternalStorageProvider.as(106): col: 24 Encountered this keyword within closure. Value of this will not be the same as enclosing scope.
[java]
[java] newEvent.data = this.result;
[java] ^
[java]
[java] C:\jenkins\workspace\royale-asjs\frameworks\projects\Storage\src\main\royale\org\apache\royale\storage\providers\WebStorageProvider.as(105): col: 24 Encountered this keyword within closure. Value of this will not be the same as enclosing scope.
[java]
[java] newEvent.data = this.result;
[java] ^
[java]
[java] 131.8532941 seconds
[java] Picked up JAVA_TOOL_OPTIONS: -Dfile.encoding=UTF-8 -Xms384m -Xmx2g
[java] Java Result: 3
BUILD FAILED
<http://apacheroyaleci2.westus2.cloudapp.azure.com:8080/job/Royale_ASDoc_Example/641/artifact/examples/royale/ASDoc/build.xml>:49: The following error occurred while executing this line:
<http://apacheroyaleci2.westus2.cloudapp.azure.com:8080/job/Royale_ASDoc_Example/641/artifact/examples/royale/ASDoc/build.xml>:109: condition satisfied
Total time: 3 minutes 39 seconds
Picked up JAVA_TOOL_OPTIONS: -Dfile.encoding=UTF-8 -Xms384m -Xmx2g
Build step 'Invoke Ant' marked build as failure
Skipped archiving because build is not successful
Build failed in Jenkins: Royale_ASDoc_Example #640
Posted by ap...@gmail.com.
See <http://apacheroyaleci2.westus2.cloudapp.azure.com:8080/job/Royale_ASDoc_Example/640/display/redirect>
Changes:
------------------------------------------
[...truncated 6.52 KB...]
[mxmlc] 14
[mxmlc] -output=<http://apacheroyaleci2.westus2.cloudapp.azure.com:8080/job/Royale_ASDoc_Example/640/artifact/examples/royale/ASDoc/bin-debug/ASDoc.swf>
[mxmlc] --
[mxmlc] <http://apacheroyaleci2.westus2.cloudapp.azure.com:8080/job/Royale_ASDoc_Example/640/artifact/examples/royale/ASDoc/src/main/royale/ASDoc.mxml>
[mxmlc] Loading configuration: C:\jenkins\workspace\royale-asjs\frameworks\royale-config.xml
[mxmlc] Loading configuration: <http://apacheroyaleci2.westus2.cloudapp.azure.com:8080/job/Royale_ASDoc_Example/640/artifact/examples/royale/ASDoc/src/main/config/compile-app-config.xml>
[mxmlc]
[mxmlc] 131245 bytes written to C:\jenkins\workspace\Royale_ASDoc_Example\examples\royale\ASDoc\bin-debug\ASDoc.swf in 10.050 seconds
[mxmlc] The project 'ASDoc' has been successfully compiled.
[mxmlc] 23.1947494 seconds
[mxmlc] Picked up JAVA_TOOL_OPTIONS: -Dfile.encoding=UTF-8 -Xms384m -Xmx2g
build_example.check-air:
build_example.wrapper:
[copy] Copying 1 file to <http://apacheroyaleci2.westus2.cloudapp.azure.com:8080/job/Royale_ASDoc_Example/640/artifact/examples/royale/ASDoc/bin-debug>
[copy] Copied 1 empty directory to 1 empty directory under <http://apacheroyaleci2.westus2.cloudapp.azure.com:8080/job/Royale_ASDoc_Example/640/artifact/examples/royale/ASDoc/bin-debug/history>
[copy] Copying 2 files to <http://apacheroyaleci2.westus2.cloudapp.azure.com:8080/job/Royale_ASDoc_Example/640/artifact/examples/royale/ASDoc/bin-debug>
build_example.check-resources:
build_example.copy-resources:
[copy] Copying 1 file to <http://apacheroyaleci2.westus2.cloudapp.azure.com:8080/job/Royale_ASDoc_Example/640/artifact/examples/royale/ASDoc/bin-debug>
build_example.compile-js-release:
[mxmlc] MXMLJSC
[mxmlc] -load-config+=<http://apacheroyaleci2.westus2.cloudapp.azure.com:8080/job/Royale_ASDoc_Example/640/artifact/examples/royale/ASDoc/src/main/config/compile-app-config.xml>
[mxmlc] -js-dynamic-access-unknown-members=true
[mxmlc] +playerglobal.version=11.7
[mxmlc] +env.PLAYERGLOBAL_HOME=C:\adobe\flash
[mxmlc] -compiler.debug=false
[mxmlc] +royalelib=C:\jenkins\workspace\royale-asjs/frameworks/
[mxmlc] -closure-lib=C:\jenkins\workspace\royale-asjs/js/lib/google/closure-library
[mxmlc] +configname=royale
[mxmlc] -swf-version
[mxmlc] 14
[mxmlc] -output=<http://apacheroyaleci2.westus2.cloudapp.azure.com:8080/job/Royale_ASDoc_Example/640/artifact/examples/royale/ASDoc/bin-release/ASDoc.swf>
[mxmlc] --
[mxmlc] <http://apacheroyaleci2.westus2.cloudapp.azure.com:8080/job/Royale_ASDoc_Example/640/artifact/examples/royale/ASDoc/src/main/royale/ASDoc.mxml>
[mxmlc] Loading configuration: C:\jenkins\workspace\royale-asjs\frameworks\royale-config.xml
[mxmlc] Loading configuration: <http://apacheroyaleci2.westus2.cloudapp.azure.com:8080/job/Royale_ASDoc_Example/640/artifact/examples/royale/ASDoc/src/main/config/compile-app-config.xml>
[mxmlc]
[mxmlc] 66504 bytes written to C:\jenkins\workspace\Royale_ASDoc_Example\examples\royale\ASDoc\bin-release\ASDoc.swf in 7.377 seconds
[mxmlc] Feb 18, 2020 1:25:57 PM com.google.javascript.jscomp.LoggerErrorManager printSummary
[mxmlc] INFO: 0 error(s), 0 warning(s), 97.3% typed
[mxmlc] The project 'ASDoc' has been successfully compiled and optimized.
[mxmlc] 34.357656 seconds
[mxmlc] Picked up JAVA_TOOL_OPTIONS: -Dfile.encoding=UTF-8 -Xms384m -Xmx2g
build_example.check-air:
build_example.copy-app-xml:
main:
json:
[echo] ROYALE_COMPILER_HOME: C:\jenkins\workspace\royale-asjs/js
[java] C:\jenkins\workspace\royale-asjs\frameworks\projects\Core\src\main\royale\org\apache\royale\utils\object\defineSimpleProperty.as(36): col: 12 Encountered this keyword within closure. Value of this will not be the same as enclosing scope.
[java]
[java] return this[privateProp];
[java] ^
[java]
[java] C:\jenkins\workspace\royale-asjs\frameworks\projects\Core\src\main\royale\org\apache\royale\utils\object\defineSimpleProperty.as(39): col: 5 Encountered this keyword within closure. Value of this will not be the same as enclosing scope.
[java]
[java] this[privateProp] = val;
[java] ^
[java]
[java] C:\jenkins\workspace\royale-asjs\frameworks\projects\GoogleMaps\src\main\royale\org\apache\royale\maps\google\beads\GoogleMapView.as(114): col: 6 Encountered this keyword within closure. Value of this will not be the same as enclosing scope.
[java]
[java] (this['mapView'] as GoogleMapView).finishInitialization();
[java] ^
[java]
[java] C:\jenkins\workspace\royale-asjs\frameworks\projects\Jewel\src\main\royale\JewelClasses.as(84): col: 13 Definition org.apache.royale.jewel.beads.views.CheckBoxView could not be found.
[java]
[java] import org.apache.royale.jewel.beads.views.CheckBoxView; CheckBoxView;
[java] ^
[java]
[java] C:\jenkins\workspace\royale-asjs\frameworks\projects\Jewel\src\main\royale\JewelClasses.as(84): col: 63 Access of possibly undefined property CheckBoxView.
[java]
[java] import org.apache.royale.jewel.beads.views.CheckBoxView; CheckBoxView;
[java] ^
[java]
[java] C:\jenkins\workspace\royale-asjs\frameworks\projects\Language\src\main\royale\org\apache\royale\utils\Language.as(148): col: 17 Use of the instanceof operator. The instanceof operator is deprecated, use the is operator instead.
[java]
[java] if (leftOperand instanceof rightOperand)
[java] ^
[java]
[java] C:\jenkins\workspace\royale-asjs\frameworks\projects\Language\src\main\royale\org\apache\royale\utils\Language.as(721): col: 36 Use of the instanceof operator. The instanceof operator is deprecated, use the is operator instead.
[java]
[java] var ret:Boolean = base && v[Language.SYNTH_TAG_FIELD] instanceof langSynthType['_types'][typeName];
[java] ^
[java]
[java] C:\jenkins\workspace\royale-asjs\frameworks\projects\MXRoyale\src\main\royale\mx\charts\AreaChart.as(231): col: 21 Encountered this keyword within closure. Value of this will not be the same as enclosing scope.
[java]
[java] this.areaFill = fill;
[java] ^
[java]
[java] C:\jenkins\workspace\royale-asjs\frameworks\projects\MXRoyale\src\main\royale\mx\charts\AreaChart.as(232): col: 21 Encountered this keyword within closure. Value of this will not be the same as enclosing scope.
[java]
[java] this.fill = fill;
[java] ^
[java]
[java] C:\jenkins\workspace\royale-asjs\frameworks\projects\MXRoyale\src\main\royale\mx\charts\CandlestickChart.as(231): col: 22 Encountered this keyword within closure. Value of this will not be the same as enclosing scope.
[java]
[java] this.boxStroke = boxStroke;
[java] ^
[java]
[java] C:\jenkins\workspace\royale-asjs\frameworks\projects\MXRoyale\src\main\royale\mx\charts\CandlestickChart.as(232): col: 22 Encountered this keyword within closure. Value of this will not be the same as enclosing scope.
[java]
[java] this.declineFill = declineFill;
[java] ^
[java]
[java] C:\jenkins\workspace\royale-asjs\frameworks\projects\MXRoyale\src\main\royale\mx\charts\HLOCChart.as(228): col: 22 Encountered this keyword within closure. Value of this will not be the same as enclosing scope.
[java]
[java] this.closeTickStroke = tickStroke;
[java] ^
[java]
[java] C:\jenkins\workspace\royale-asjs\frameworks\projects\MXRoyale\src\main\royale\mx\charts\HLOCChart.as(229): col: 22 Encountered this keyword within closure. Value of this will not be the same as enclosing scope.
[java]
[java] this.openTickStroke = tickStroke;
[java] ^
[java]
[java] C:\jenkins\workspace\royale-asjs\frameworks\projects\MXRoyale\src\main\royale\mx\charts\HLOCChart.as(230): col: 22 Encountered this keyword within closure. Value of this will not be the same as enclosing scope.
[java]
[java] this.stroke = stroke;
[java] ^
[java]
[java] C:\jenkins\workspace\royale-asjs\frameworks\projects\MXRoyale\src\main\royale\mx\charts\HLOCChart.as(231): col: 22 Encountered this keyword within closure. Value of this will not be the same as enclosing scope.
[java]
[java] this.hlocColor = stroke.color;
[java] ^
[java]
[java] C:\jenkins\workspace\royale-asjs\frameworks\projects\MXRoyale\src\main\royale\mx\charts\LineChart.as(179): col: 22 Encountered this keyword within closure. Value of this will not be the same as enclosing scope.
[java]
[java] this.lineStroke = stroke;
[java] ^
[java]
[java] C:\jenkins\workspace\royale-asjs\frameworks\projects\MXRoyale\src\main\royale\mx\charts\LineChart.as(180): col: 22 Encountered this keyword within closure. Value of this will not be the same as enclosing scope.
[java]
[java] this.stroke = stroke;
[java] ^
[java]
[java] C:\jenkins\workspace\royale-asjs\frameworks\projects\MXRoyale\src\main\royale\mx\charts\LineChart.as(181): col: 22 Encountered this keyword within closure. Value of this will not be the same as enclosing scope.
[java]
[java] this.lineSegmentRenderer = new ClassFactory(LineRenderer);
[java] ^
[java]
[java] C:\jenkins\workspace\royale-asjs\frameworks\projects\MXRoyale\src\main\royale\mx\charts\PlotChart.as(158): col: 22 Encountered this keyword within closure. Value of this will not be the same as enclosing scope.
[java]
[java] this.fill = fill;
[java] ^
[java]
[java] C:\jenkins\workspace\royale-asjs\frameworks\projects\MXRoyale\src\main\royale\mx\charts\PlotChart.as(159): col: 22 Encountered this keyword within closure. Value of this will not be the same as enclosing scope.
[java]
[java] this.itemRenderer = skin;
[java] ^
[java]
[java] C:\jenkins\workspace\royale-asjs\frameworks\projects\MXRoyale\src\main\royale\mx\charts\PlotChart.as(160): col: 22 Encountered this keyword within closure. Value of this will not be the same as enclosing scope.
[java]
[java] this.radius = radius
[java] ^
[java]
[java] C:\jenkins\workspace\royale-asjs\frameworks\projects\MXRoyale\src\main\royale\mx\charts\styles\HaloDefaults.as(213): col: 6 Encountered this keyword within closure. Value of this will not be the same as enclosing scope.
[java]
[java] this.fill = defaultFill;
[java] ^
[java]
[java] C:\jenkins\workspace\royale-asjs\frameworks\projects\MXRoyale\src\main\royale\mx\charts\styles\HaloDefaults.as(214): col: 6 Encountered this keyword within closure. Value of this will not be the same as enclosing scope.
[java]
[java] this.areaFill = defaultFill;
[java] ^
[java]
[java] C:\jenkins\workspace\royale-asjs\frameworks\projects\MXRoyale\src\main\royale\mx\charts\styles\HaloDefaults.as(215): col: 6 Encountered this keyword within closure. Value of this will not be the same as enclosing scope.
[java]
[java] this.areaStroke = emptyStroke;
[java] ^
[java]
[java] C:\jenkins\workspace\royale-asjs\frameworks\projects\MXRoyale\src\main\royale\mx\charts\styles\HaloDefaults.as(216): col: 6 Encountered this keyword within closure. Value of this will not be the same as enclosing scope.
[java]
[java] this.lineStroke = defaultStroke;
[java] ^
[java]
[java] C:\jenkins\workspace\royale-asjs\frameworks\projects\MXRoyale\src\main\royale\mx\utils\ObjectUtil.as(715): col: 34 Use of the instanceof operator. The instanceof operator is deprecated, use the is operator instead.
[java]
[java] isDict = value instanceof Map || value instanceof WeakMap;
[java] ^
[java]
[java] C:\jenkins\workspace\royale-asjs\frameworks\projects\MXRoyale\src\main\royale\mx\utils\ObjectUtil.as(715): col: 58 Use of the instanceof operator. The instanceof operator is deprecated, use the is operator instead.
[java]
[java] isDict = value instanceof Map || value instanceof WeakMap;
[java] ^
[java]
[java] C:\jenkins\workspace\royale-asjs\frameworks\projects\MXRoyale\src\main\royale\mx\utils\ObjectUtil.as(1447): col: 32 Use of the instanceof operator. The instanceof operator is deprecated, use the is operator instead.
[java]
[java] var isDict:Boolean = (obj instanceof Map || obj instanceof WeakMap);
[java] ^
[java]
[java] C:\jenkins\workspace\royale-asjs\frameworks\projects\MXRoyale\src\main\royale\mx\utils\ObjectUtil.as(1447): col: 54 Use of the instanceof operator. The instanceof operator is deprecated, use the is operator instead.
[java]
[java] var isDict:Boolean = (obj instanceof Map || obj instanceof WeakMap);
[java] ^
[java]
[java] C:\jenkins\workspace\royale-asjs\frameworks\projects\MXRoyale\src\main\royale\mx\utils\ObjectUtil.as(1449): col: 17 Use of the instanceof operator. The instanceof operator is deprecated, use the is operator instead.
[java]
[java] if (obj instanceof WeakMap) throw new Error('WeakMap cannot be enumerated, use Map instead');
[java] ^
[java]
[java] C:\jenkins\workspace\royale-asjs\frameworks\projects\Network\src\main\royale\org\apache\royale\net\remoting\amf\AMFBinaryData.as(823): col: 7 Use of the instanceof operator. The instanceof operator is deprecated, use the is operator instead.
[java]
[java] if (value instanceof Function) {
[java] ^
[java]
[java] C:\jenkins\workspace\royale-asjs\frameworks\projects\SparkRoyale\src\main\royale\spark\skins\spark\FormItemSkin.mxml(169): col: 30 Data binding will not be able to detect assignments to 'x'.
[java]
[java] <s:Group x="{contentGroup.x + contentGroup.contentWidth + 4}" y="{contentGroup.y}"
[java] ^
[java]
[java] C:\jenkins\workspace\royale-asjs\frameworks\projects\SparkRoyale\src\main\royale\spark\skins\spark\FormItemSkin.mxml(169): col: 83 Data binding will not be able to detect assignments to 'y'.
[java]
[java] <s:Group x="{contentGroup.x + contentGroup.contentWidth + 4}" y="{contentGroup.y}"
[java] ^
[java]
[java] C:\jenkins\workspace\royale-asjs\frameworks\projects\Storage\src\main\royale\org\apache\royale\storage\file\DataInputStream.as(73): col: 24 Encountered this keyword within closure. Value of this will not be the same as enclosing scope.
[java]
[java] streamEvent.data = this.result;
[java] ^
[java]
[java] C:\jenkins\workspace\royale-asjs\frameworks\projects\Storage\src\main\royale\org\apache\royale\storage\providers\AndroidExternalStorageProvider.as(106): col: 24 Encountered this keyword within closure. Value of this will not be the same as enclosing scope.
[java]
[java] newEvent.data = this.result;
[java] ^
[java]
[java] C:\jenkins\workspace\royale-asjs\frameworks\projects\Storage\src\main\royale\org\apache\royale\storage\providers\WebStorageProvider.as(105): col: 24 Encountered this keyword within closure. Value of this will not be the same as enclosing scope.
[java]
[java] newEvent.data = this.result;
[java] ^
[java]
[java] 160.728223 seconds
[java] Picked up JAVA_TOOL_OPTIONS: -Dfile.encoding=UTF-8 -Xms384m -Xmx2g
[java] Java Result: 3
BUILD FAILED
<http://apacheroyaleci2.westus2.cloudapp.azure.com:8080/job/Royale_ASDoc_Example/640/artifact/examples/royale/ASDoc/build.xml>:49: The following error occurred while executing this line:
<http://apacheroyaleci2.westus2.cloudapp.azure.com:8080/job/Royale_ASDoc_Example/640/artifact/examples/royale/ASDoc/build.xml>:109: condition satisfied
Total time: 3 minutes 41 seconds
Picked up JAVA_TOOL_OPTIONS: -Dfile.encoding=UTF-8 -Xms384m -Xmx2g
Build step 'Invoke Ant' marked build as failure
Skipped archiving because build is not successful