You are viewing a plain text version of this content. The canonical link for it is here.
Posted to dev@lucene.apache.org by Policeman Jenkins Server <je...@thetaphi.de> on 2015/06/11 20:15:41 UTC
[JENKINS] Lucene-Solr-5.x-Windows (32bit/jdk1.7.0_80) - Build #
4796 - Failure!
Build: http://jenkins.thetaphi.de/job/Lucene-Solr-5.x-Windows/4796/
Java: 32bit/jdk1.7.0_80 -client -XX:+UseSerialGC
1 tests failed.
FAILED: org.apache.solr.search.mlt.CloudMLTQParserTest.test
Error Message:
java.lang.String cannot be cast to java.util.ArrayList
Stack Trace:
java.lang.ClassCastException: java.lang.String cannot be cast to java.util.ArrayList
at __randomizedtesting.SeedInfo.seed([8F9289AE236EA803:7C6B6748D92C5FB]:0)
at org.apache.solr.search.mlt.CloudMLTQParserTest.test(CloudMLTQParserTest.java:138)
at sun.reflect.NativeMethodAccessorImpl.invoke0(Native Method)
at sun.reflect.NativeMethodAccessorImpl.invoke(NativeMethodAccessorImpl.java:57)
at sun.reflect.DelegatingMethodAccessorImpl.invoke(DelegatingMethodAccessorImpl.java:43)
at java.lang.reflect.Method.invoke(Method.java:606)
at com.carrotsearch.randomizedtesting.RandomizedRunner.invoke(RandomizedRunner.java:1627)
at com.carrotsearch.randomizedtesting.RandomizedRunner$6.evaluate(RandomizedRunner.java:836)
at com.carrotsearch.randomizedtesting.RandomizedRunner$7.evaluate(RandomizedRunner.java:872)
at com.carrotsearch.randomizedtesting.RandomizedRunner$8.evaluate(RandomizedRunner.java:886)
at org.apache.solr.BaseDistributedSearchTestCase$ShardsRepeatRule$ShardsFixedStatement.callStatement(BaseDistributedSearchTestCase.java:960)
at org.apache.solr.BaseDistributedSearchTestCase$ShardsRepeatRule$ShardsStatement.evaluate(BaseDistributedSearchTestCase.java:935)
at com.carrotsearch.randomizedtesting.rules.SystemPropertiesRestoreRule$1.evaluate(SystemPropertiesRestoreRule.java:57)
at org.apache.lucene.util.TestRuleSetupTeardownChained$1.evaluate(TestRuleSetupTeardownChained.java:50)
at org.apache.lucene.util.AbstractBeforeAfterRule$1.evaluate(AbstractBeforeAfterRule.java:46)
at org.apache.lucene.util.TestRuleThreadAndTestName$1.evaluate(TestRuleThreadAndTestName.java:49)
at org.apache.lucene.util.TestRuleIgnoreAfterMaxFailures$1.evaluate(TestRuleIgnoreAfterMaxFailures.java:65)
at org.apache.lucene.util.TestRuleMarkFailure$1.evaluate(TestRuleMarkFailure.java:48)
at com.carrotsearch.randomizedtesting.rules.StatementAdapter.evaluate(StatementAdapter.java:36)
at com.carrotsearch.randomizedtesting.ThreadLeakControl$StatementRunner.run(ThreadLeakControl.java:365)
at com.carrotsearch.randomizedtesting.ThreadLeakControl.forkTimeoutingTask(ThreadLeakControl.java:798)
at com.carrotsearch.randomizedtesting.ThreadLeakControl$3.evaluate(ThreadLeakControl.java:458)
at com.carrotsearch.randomizedtesting.RandomizedRunner.runSingleTest(RandomizedRunner.java:845)
at com.carrotsearch.randomizedtesting.RandomizedRunner$3.evaluate(RandomizedRunner.java:747)
at com.carrotsearch.randomizedtesting.RandomizedRunner$4.evaluate(RandomizedRunner.java:781)
at com.carrotsearch.randomizedtesting.RandomizedRunner$5.evaluate(RandomizedRunner.java:792)
at com.carrotsearch.randomizedtesting.rules.StatementAdapter.evaluate(StatementAdapter.java:36)
at com.carrotsearch.randomizedtesting.rules.SystemPropertiesRestoreRule$1.evaluate(SystemPropertiesRestoreRule.java:57)
at org.apache.lucene.util.AbstractBeforeAfterRule$1.evaluate(AbstractBeforeAfterRule.java:46)
at com.carrotsearch.randomizedtesting.rules.StatementAdapter.evaluate(StatementAdapter.java:36)
at org.apache.lucene.util.TestRuleStoreClassName$1.evaluate(TestRuleStoreClassName.java:42)
at com.carrotsearch.randomizedtesting.rules.NoShadowingOrOverridesOnMethodsRule$1.evaluate(NoShadowingOrOverridesOnMethodsRule.java:39)
at com.carrotsearch.randomizedtesting.rules.NoShadowingOrOverridesOnMethodsRule$1.evaluate(NoShadowingOrOverridesOnMethodsRule.java:39)
at com.carrotsearch.randomizedtesting.rules.StatementAdapter.evaluate(StatementAdapter.java:36)
at com.carrotsearch.randomizedtesting.rules.StatementAdapter.evaluate(StatementAdapter.java:36)
at com.carrotsearch.randomizedtesting.rules.StatementAdapter.evaluate(StatementAdapter.java:36)
at org.apache.lucene.util.TestRuleAssertionsRequired$1.evaluate(TestRuleAssertionsRequired.java:54)
at org.apache.lucene.util.TestRuleMarkFailure$1.evaluate(TestRuleMarkFailure.java:48)
at org.apache.lucene.util.TestRuleIgnoreAfterMaxFailures$1.evaluate(TestRuleIgnoreAfterMaxFailures.java:65)
at org.apache.lucene.util.TestRuleIgnoreTestSuites$1.evaluate(TestRuleIgnoreTestSuites.java:55)
at com.carrotsearch.randomizedtesting.rules.StatementAdapter.evaluate(StatementAdapter.java:36)
at com.carrotsearch.randomizedtesting.ThreadLeakControl$StatementRunner.run(ThreadLeakControl.java:365)
at java.lang.Thread.run(Thread.java:745)
Build Log:
[...truncated 9933 lines...]
[junit4] Suite: org.apache.solr.search.mlt.CloudMLTQParserTest
[junit4] 2> Creating dataDir: C:\Users\JenkinsSlave\workspace\Lucene-Solr-5.x-Windows\solr\build\solr-core\test\J1\temp\solr.search.mlt.CloudMLTQParserTest_8F9289AE236EA803-001\init-core-data-001
[junit4] 2> 285147 INFO (SUITE-CloudMLTQParserTest-seed#[8F9289AE236EA803]-worker) [ ] o.a.s.SolrTestCaseJ4 Randomized ssl (false) and clientAuth (true)
[junit4] 2> 285148 INFO (SUITE-CloudMLTQParserTest-seed#[8F9289AE236EA803]-worker) [ ] o.a.s.BaseDistributedSearchTestCase Setting hostContext system property: /r_h/
[junit4] 2> 285153 INFO (TEST-CloudMLTQParserTest.testInvalidDocument-seed#[8F9289AE236EA803]) [ ] o.a.s.c.ZkTestServer STARTING ZK TEST SERVER
[junit4] 2> 285154 INFO (Thread-448) [ ] o.a.s.c.ZkTestServer client port:0.0.0.0/0.0.0.0:0
[junit4] 2> 285154 INFO (Thread-448) [ ] o.a.s.c.ZkTestServer Starting server
[junit4] 2> 285260 INFO (TEST-CloudMLTQParserTest.testInvalidDocument-seed#[8F9289AE236EA803]) [ ] o.a.s.c.ZkTestServer start zk server on port:63060
[junit4] 2> 285288 INFO (TEST-CloudMLTQParserTest.testInvalidDocument-seed#[8F9289AE236EA803]) [ ] o.a.s.c.AbstractZkTestCase put C:\Users\JenkinsSlave\workspace\Lucene-Solr-5.x-Windows\solr\core\src\test-files\solr\collection1\conf\solrconfig.xml to /configs/conf1/solrconfig.xml
[junit4] 2> 285294 INFO (TEST-CloudMLTQParserTest.testInvalidDocument-seed#[8F9289AE236EA803]) [ ] o.a.s.c.AbstractZkTestCase put C:\Users\JenkinsSlave\workspace\Lucene-Solr-5.x-Windows\solr\core\src\test-files\solr\collection1\conf\schema.xml to /configs/conf1/schema.xml
[junit4] 2> 285298 INFO (TEST-CloudMLTQParserTest.testInvalidDocument-seed#[8F9289AE236EA803]) [ ] o.a.s.c.AbstractZkTestCase put C:\Users\JenkinsSlave\workspace\Lucene-Solr-5.x-Windows\solr\core\src\test-files\solr\collection1\conf\solrconfig.snippet.randomindexconfig.xml to /configs/conf1/solrconfig.snippet.randomindexconfig.xml
[junit4] 2> 285301 INFO (TEST-CloudMLTQParserTest.testInvalidDocument-seed#[8F9289AE236EA803]) [ ] o.a.s.c.AbstractZkTestCase put C:\Users\JenkinsSlave\workspace\Lucene-Solr-5.x-Windows\solr\core\src\test-files\solr\collection1\conf\stopwords.txt to /configs/conf1/stopwords.txt
[junit4] 2> 285305 INFO (TEST-CloudMLTQParserTest.testInvalidDocument-seed#[8F9289AE236EA803]) [ ] o.a.s.c.AbstractZkTestCase put C:\Users\JenkinsSlave\workspace\Lucene-Solr-5.x-Windows\solr\core\src\test-files\solr\collection1\conf\protwords.txt to /configs/conf1/protwords.txt
[junit4] 2> 285308 INFO (TEST-CloudMLTQParserTest.testInvalidDocument-seed#[8F9289AE236EA803]) [ ] o.a.s.c.AbstractZkTestCase put C:\Users\JenkinsSlave\workspace\Lucene-Solr-5.x-Windows\solr\core\src\test-files\solr\collection1\conf\currency.xml to /configs/conf1/currency.xml
[junit4] 2> 285314 INFO (TEST-CloudMLTQParserTest.testInvalidDocument-seed#[8F9289AE236EA803]) [ ] o.a.s.c.AbstractZkTestCase put C:\Users\JenkinsSlave\workspace\Lucene-Solr-5.x-Windows\solr\core\src\test-files\solr\collection1\conf\enumsConfig.xml to /configs/conf1/enumsConfig.xml
[junit4] 2> 285318 INFO (TEST-CloudMLTQParserTest.testInvalidDocument-seed#[8F9289AE236EA803]) [ ] o.a.s.c.AbstractZkTestCase put C:\Users\JenkinsSlave\workspace\Lucene-Solr-5.x-Windows\solr\core\src\test-files\solr\collection1\conf\open-exchange-rates.json to /configs/conf1/open-exchange-rates.json
[junit4] 2> 285323 INFO (TEST-CloudMLTQParserTest.testInvalidDocument-seed#[8F9289AE236EA803]) [ ] o.a.s.c.AbstractZkTestCase put C:\Users\JenkinsSlave\workspace\Lucene-Solr-5.x-Windows\solr\core\src\test-files\solr\collection1\conf\mapping-ISOLatin1Accent.txt to /configs/conf1/mapping-ISOLatin1Accent.txt
[junit4] 2> 285327 INFO (TEST-CloudMLTQParserTest.testInvalidDocument-seed#[8F9289AE236EA803]) [ ] o.a.s.c.AbstractZkTestCase put C:\Users\JenkinsSlave\workspace\Lucene-Solr-5.x-Windows\solr\core\src\test-files\solr\collection1\conf\old_synonyms.txt to /configs/conf1/old_synonyms.txt
[junit4] 2> 285330 INFO (TEST-CloudMLTQParserTest.testInvalidDocument-seed#[8F9289AE236EA803]) [ ] o.a.s.c.AbstractZkTestCase put C:\Users\JenkinsSlave\workspace\Lucene-Solr-5.x-Windows\solr\core\src\test-files\solr\collection1\conf\synonyms.txt to /configs/conf1/synonyms.txt
[junit4] 2> 285749 INFO (TEST-CloudMLTQParserTest.testInvalidDocument-seed#[8F9289AE236EA803]) [ ] o.a.s.SolrTestCaseJ4 Writing core.properties file to C:\Users\JenkinsSlave\workspace\Lucene-Solr-5.x-Windows\solr\build\solr-core\test\J1\temp\solr.search.mlt.CloudMLTQParserTest_8F9289AE236EA803-001\control-001\cores\collection1
[junit4] 2> 285754 INFO (TEST-CloudMLTQParserTest.testInvalidDocument-seed#[8F9289AE236EA803]) [ ] o.e.j.s.Server jetty-9.2.11.v20150529
[junit4] 2> 285759 INFO (TEST-CloudMLTQParserTest.testInvalidDocument-seed#[8F9289AE236EA803]) [ ] o.e.j.s.h.ContextHandler Started o.e.j.s.ServletContextHandler@8b6bf6{/r_h,null,AVAILABLE}
[junit4] 2> 285760 INFO (TEST-CloudMLTQParserTest.testInvalidDocument-seed#[8F9289AE236EA803]) [ ] o.e.j.s.ServerConnector Started ServerConnector@15d10e4{HTTP/1.1}{127.0.0.1:63067}
[junit4] 2> 285760 INFO (TEST-CloudMLTQParserTest.testInvalidDocument-seed#[8F9289AE236EA803]) [ ] o.e.j.s.Server Started @290012ms
[junit4] 2> 285760 INFO (TEST-CloudMLTQParserTest.testInvalidDocument-seed#[8F9289AE236EA803]) [ ] o.a.s.c.s.e.JettySolrRunner Jetty properties: {hostContext=/r_h, solr.data.dir=C:\Users\JenkinsSlave\workspace\Lucene-Solr-5.x-Windows\solr\build\solr-core\test\J1\temp\solr.search.mlt.CloudMLTQParserTest_8F9289AE236EA803-001\tempDir-001/control/data, hostPort=63067, coreRootDirectory=C:\Users\JenkinsSlave\workspace\Lucene-Solr-5.x-Windows\solr\build\solr-core\test\J1\temp\solr.search.mlt.CloudMLTQParserTest_8F9289AE236EA803-001\control-001\cores}
[junit4] 2> 285761 INFO (TEST-CloudMLTQParserTest.testInvalidDocument-seed#[8F9289AE236EA803]) [ ] o.a.s.s.SolrDispatchFilter SolrDispatchFilter.init()sun.misc.Launcher$AppClassLoader@c21495
[junit4] 2> 285761 INFO (TEST-CloudMLTQParserTest.testInvalidDocument-seed#[8F9289AE236EA803]) [ ] o.a.s.c.SolrResourceLoader new SolrResourceLoader for directory: 'C:\Users\JenkinsSlave\workspace\Lucene-Solr-5.x-Windows\solr\build\solr-core\test\J1\temp\solr.search.mlt.CloudMLTQParserTest_8F9289AE236EA803-001\control-001\'
[junit4] 2> 285802 INFO (TEST-CloudMLTQParserTest.testInvalidDocument-seed#[8F9289AE236EA803]) [ ] o.a.s.c.SolrXmlConfig Loading container configuration from C:\Users\JenkinsSlave\workspace\Lucene-Solr-5.x-Windows\solr\build\solr-core\test\J1\temp\solr.search.mlt.CloudMLTQParserTest_8F9289AE236EA803-001\control-001\solr.xml
[junit4] 2> 285852 INFO (TEST-CloudMLTQParserTest.testInvalidDocument-seed#[8F9289AE236EA803]) [ ] o.a.s.c.CoresLocator Config-defined core root directory: C:\Users\JenkinsSlave\workspace\Lucene-Solr-5.x-Windows\solr\build\solr-core\test\J1\temp\solr.search.mlt.CloudMLTQParserTest_8F9289AE236EA803-001\control-001\cores
[junit4] 2> 285852 INFO (TEST-CloudMLTQParserTest.testInvalidDocument-seed#[8F9289AE236EA803]) [ ] o.a.s.c.CoreContainer New CoreContainer 13580669
[junit4] 2> 285852 INFO (TEST-CloudMLTQParserTest.testInvalidDocument-seed#[8F9289AE236EA803]) [ ] o.a.s.c.CoreContainer Loading cores into CoreContainer [instanceDir=C:\Users\JenkinsSlave\workspace\Lucene-Solr-5.x-Windows\solr\build\solr-core\test\J1\temp\solr.search.mlt.CloudMLTQParserTest_8F9289AE236EA803-001\control-001\]
[junit4] 2> 285853 INFO (TEST-CloudMLTQParserTest.testInvalidDocument-seed#[8F9289AE236EA803]) [ ] o.a.s.c.CoreContainer loading shared library: C:\Users\JenkinsSlave\workspace\Lucene-Solr-5.x-Windows\solr\build\solr-core\test\J1\temp\solr.search.mlt.CloudMLTQParserTest_8F9289AE236EA803-001\control-001\lib
[junit4] 2> 285853 WARN (TEST-CloudMLTQParserTest.testInvalidDocument-seed#[8F9289AE236EA803]) [ ] o.a.s.c.SolrResourceLoader Can't find (or read) directory to add to classloader: lib (resolved as: C:\Users\JenkinsSlave\workspace\Lucene-Solr-5.x-Windows\solr\build\solr-core\test\J1\temp\solr.search.mlt.CloudMLTQParserTest_8F9289AE236EA803-001\control-001\lib).
[junit4] 2> 285868 INFO (TEST-CloudMLTQParserTest.testInvalidDocument-seed#[8F9289AE236EA803]) [ ] o.a.s.h.c.HttpShardHandlerFactory created with socketTimeout : 90000,urlScheme : ,connTimeout : 15000,maxConnectionsPerHost : 20,maxConnections : 10000,corePoolSize : 0,maximumPoolSize : 2147483647,maxThreadIdleTime : 5,sizeOfQueue : -1,fairnessPolicy : false,useRetries : false,
[junit4] 2> 285873 INFO (TEST-CloudMLTQParserTest.testInvalidDocument-seed#[8F9289AE236EA803]) [ ] o.a.s.u.UpdateShardHandler Creating UpdateShardHandler HTTP client with params: socketTimeout=340000&connTimeout=45000&retry=true
[junit4] 2> 285874 INFO (TEST-CloudMLTQParserTest.testInvalidDocument-seed#[8F9289AE236EA803]) [ ] o.a.s.l.LogWatcher SLF4J impl is org.slf4j.impl.Log4jLoggerFactory
[junit4] 2> 285874 INFO (TEST-CloudMLTQParserTest.testInvalidDocument-seed#[8F9289AE236EA803]) [ ] o.a.s.l.LogWatcher Registering Log Listener [Log4j (org.slf4j.impl.Log4jLoggerFactory)]
[junit4] 2> 285874 INFO (TEST-CloudMLTQParserTest.testInvalidDocument-seed#[8F9289AE236EA803]) [ ] o.a.s.c.ZkContainer Zookeeper client=127.0.0.1:63060/solr
[junit4] 2> 285874 INFO (TEST-CloudMLTQParserTest.testInvalidDocument-seed#[8F9289AE236EA803]) [ ] o.a.s.c.ZkController zkHost includes chroot
[junit4] 2> 285914 INFO (TEST-CloudMLTQParserTest.testInvalidDocument-seed#[8F9289AE236EA803]) [n:127.0.0.1:63067_r_h ] o.a.s.c.ZkController Register node as live in ZooKeeper:/live_nodes/127.0.0.1:63067_r_h
[junit4] 2> 285923 INFO (TEST-CloudMLTQParserTest.testInvalidDocument-seed#[8F9289AE236EA803]) [n:127.0.0.1:63067_r_h ] o.a.s.c.Overseer Overseer (id=null) closing
[junit4] 2> 285926 INFO (TEST-CloudMLTQParserTest.testInvalidDocument-seed#[8F9289AE236EA803]) [n:127.0.0.1:63067_r_h ] o.a.s.c.OverseerElectionContext I am going to be the leader 127.0.0.1:63067_r_h
[junit4] 2> 285930 INFO (TEST-CloudMLTQParserTest.testInvalidDocument-seed#[8F9289AE236EA803]) [n:127.0.0.1:63067_r_h ] o.a.s.c.Overseer Overseer (id=93981479496122371-127.0.0.1:63067_r_h-n_0000000000) starting
[junit4] 2> 285950 INFO (TEST-CloudMLTQParserTest.testInvalidDocument-seed#[8F9289AE236EA803]) [n:127.0.0.1:63067_r_h ] o.a.s.c.OverseerAutoReplicaFailoverThread Starting OverseerAutoReplicaFailoverThread autoReplicaFailoverWorkLoopDelay=10000 autoReplicaFailoverWaitAfterExpiration=30000 autoReplicaFailoverBadNodeExpiration=60000
[junit4] 2> 285962 INFO (OverseerCollectionProcessor-93981479496122371-127.0.0.1:63067_r_h-n_0000000000) [n:127.0.0.1:63067_r_h ] o.a.s.c.OverseerCollectionProcessor Process current queue of collection creations
[junit4] 2> 285972 INFO (OverseerStateUpdate-93981479496122371-127.0.0.1:63067_r_h-n_0000000000) [n:127.0.0.1:63067_r_h ] o.a.s.c.Overseer Starting to work on the main queue
[junit4] 2> 285977 INFO (TEST-CloudMLTQParserTest.testInvalidDocument-seed#[8F9289AE236EA803]) [n:127.0.0.1:63067_r_h ] o.a.s.c.CoreContainer No authentication plugin used.
[junit4] 2> 285978 INFO (TEST-CloudMLTQParserTest.testInvalidDocument-seed#[8F9289AE236EA803]) [n:127.0.0.1:63067_r_h ] o.a.s.c.CoreContainer Security conf doesn't exist. Skipping setup for authorization module.
[junit4] 2> 285980 INFO (TEST-CloudMLTQParserTest.testInvalidDocument-seed#[8F9289AE236EA803]) [n:127.0.0.1:63067_r_h ] o.a.s.c.CoresLocator Looking for core definitions underneath C:\Users\JenkinsSlave\workspace\Lucene-Solr-5.x-Windows\solr\build\solr-core\test\J1\temp\solr.search.mlt.CloudMLTQParserTest_8F9289AE236EA803-001\control-001\cores
[junit4] 2> 285982 INFO (TEST-CloudMLTQParserTest.testInvalidDocument-seed#[8F9289AE236EA803]) [n:127.0.0.1:63067_r_h ] o.a.s.c.SolrCore Created CoreDescriptor: {schema=schema.xml, instanceDir=C:\Users\JenkinsSlave\workspace\Lucene-Solr-5.x-Windows\solr\build\solr-core\test\J1\temp\solr.search.mlt.CloudMLTQParserTest_8F9289AE236EA803-001\control-001\cores\collection1, name=collection1, shard=, coreNodeName=, absoluteInstDir=C:\Users\JenkinsSlave\workspace\Lucene-Solr-5.x-Windows\solr\build\solr-core\test\J1\temp\solr.search.mlt.CloudMLTQParserTest_8F9289AE236EA803-001\control-001\cores\collection1\, config=solrconfig.xml, loadOnStartup=true, collection=control_collection, dataDir=data\, transient=false}
[junit4] 2> 285982 INFO (TEST-CloudMLTQParserTest.testInvalidDocument-seed#[8F9289AE236EA803]) [n:127.0.0.1:63067_r_h ] o.a.s.c.CoresLocator Found core collection1 in C:\Users\JenkinsSlave\workspace\Lucene-Solr-5.x-Windows\solr\build\solr-core\test\J1\temp\solr.search.mlt.CloudMLTQParserTest_8F9289AE236EA803-001\control-001\cores\collection1\
[junit4] 2> 285982 INFO (TEST-CloudMLTQParserTest.testInvalidDocument-seed#[8F9289AE236EA803]) [n:127.0.0.1:63067_r_h ] o.a.s.c.CoresLocator Found 1 core definitions
[junit4] 2> 285984 INFO (coreLoadExecutor-590-thread-1-processing-n:127.0.0.1:63067_r_h) [n:127.0.0.1:63067_r_h c:control_collection x:collection1] o.a.s.c.ZkController publishing state=down
[junit4] 2> 285984 INFO (TEST-CloudMLTQParserTest.testInvalidDocument-seed#[8F9289AE236EA803]) [n:127.0.0.1:63067_r_h ] o.a.s.s.SolrDispatchFilter user.dir=C:\Users\JenkinsSlave\workspace\Lucene-Solr-5.x-Windows\solr\build\solr-core\test\J1
[junit4] 2> 285984 INFO (TEST-CloudMLTQParserTest.testInvalidDocument-seed#[8F9289AE236EA803]) [n:127.0.0.1:63067_r_h ] o.a.s.s.SolrDispatchFilter SolrDispatchFilter.init() done
[junit4] 2> 285984 INFO (coreLoadExecutor-590-thread-1-processing-n:127.0.0.1:63067_r_h) [n:127.0.0.1:63067_r_h c:control_collection x:collection1] o.a.s.c.ZkController numShards not found on descriptor - reading it from system property
[junit4] 2> 285985 INFO (coreLoadExecutor-590-thread-1-processing-n:127.0.0.1:63067_r_h) [n:127.0.0.1:63067_r_h c:control_collection x:collection1] o.a.s.c.ZkController look for our core node name
[junit4] 2> 285985 INFO (zkCallback-195-thread-1-processing-n:127.0.0.1:63067_r_h) [n:127.0.0.1:63067_r_h ] o.a.s.c.DistributedQueue NodeChildrenChanged fired on path /overseer/queue state SyncConnected
[junit4] 2> 285987 INFO (OverseerStateUpdate-93981479496122371-127.0.0.1:63067_r_h-n_0000000000) [n:127.0.0.1:63067_r_h ] o.a.s.c.Overseer processMessage: queueSize: 1, message = {
[junit4] 2> "collection":"control_collection",
[junit4] 2> "roles":null,
[junit4] 2> "state":"down",
[junit4] 2> "shard":null,
[junit4] 2> "numShards":"1",
[junit4] 2> "node_name":"127.0.0.1:63067_r_h",
[junit4] 2> "base_url":"http://127.0.0.1:63067/r_h",
[junit4] 2> "operation":"state",
[junit4] 2> "core":"collection1"} current state version: 0
[junit4] 2> 285988 INFO (OverseerStateUpdate-93981479496122371-127.0.0.1:63067_r_h-n_0000000000) [n:127.0.0.1:63067_r_h ] o.a.s.c.o.ReplicaMutator Update state numShards=1 message={
[junit4] 2> "collection":"control_collection",
[junit4] 2> "roles":null,
[junit4] 2> "state":"down",
[junit4] 2> "shard":null,
[junit4] 2> "numShards":"1",
[junit4] 2> "node_name":"127.0.0.1:63067_r_h",
[junit4] 2> "base_url":"http://127.0.0.1:63067/r_h",
[junit4] 2> "operation":"state",
[junit4] 2> "core":"collection1"}
[junit4] 2> 285989 INFO (OverseerStateUpdate-93981479496122371-127.0.0.1:63067_r_h-n_0000000000) [n:127.0.0.1:63067_r_h ] o.a.s.c.o.ClusterStateMutator building a new cName: control_collection
[junit4] 2> 285989 INFO (OverseerStateUpdate-93981479496122371-127.0.0.1:63067_r_h-n_0000000000) [n:127.0.0.1:63067_r_h ] o.a.s.c.o.ReplicaMutator Assigning new node to shard shard=shard1
[junit4] 2> 287035 INFO (coreLoadExecutor-590-thread-1-processing-n:127.0.0.1:63067_r_h) [n:127.0.0.1:63067_r_h c:control_collection x:collection1] o.a.s.c.ZkController waiting to find shard id in clusterstate for collection1
[junit4] 2> 287035 INFO (coreLoadExecutor-590-thread-1-processing-n:127.0.0.1:63067_r_h) [n:127.0.0.1:63067_r_h c:control_collection x:collection1] o.a.s.c.ZkController Check for collection zkNode:control_collection
[junit4] 2> 287036 INFO (coreLoadExecutor-590-thread-1-processing-n:127.0.0.1:63067_r_h) [n:127.0.0.1:63067_r_h c:control_collection x:collection1] o.a.s.c.ZkController Collection zkNode exists
[junit4] 2> 287037 INFO (coreLoadExecutor-590-thread-1-processing-n:127.0.0.1:63067_r_h) [n:127.0.0.1:63067_r_h c:control_collection x:collection1] o.a.s.c.SolrResourceLoader new SolrResourceLoader for directory: 'C:\Users\JenkinsSlave\workspace\Lucene-Solr-5.x-Windows\solr\build\solr-core\test\J1\temp\solr.search.mlt.CloudMLTQParserTest_8F9289AE236EA803-001\control-001\cores\collection1\'
[junit4] 2> 287071 INFO (coreLoadExecutor-590-thread-1-processing-n:127.0.0.1:63067_r_h) [n:127.0.0.1:63067_r_h c:control_collection x:collection1] o.a.s.c.Config loaded config solrconfig.xml with version 0
[junit4] 2> 287086 INFO (coreLoadExecutor-590-thread-1-processing-n:127.0.0.1:63067_r_h) [n:127.0.0.1:63067_r_h c:control_collection x:collection1] o.a.s.c.SolrConfig current version of requestparams : -1
[junit4] 2> 287112 INFO (coreLoadExecutor-590-thread-1-processing-n:127.0.0.1:63067_r_h) [n:127.0.0.1:63067_r_h c:control_collection x:collection1] o.a.s.c.SolrConfig Using Lucene MatchVersion: 5.3.0
[junit4] 2> 287184 INFO (coreLoadExecutor-590-thread-1-processing-n:127.0.0.1:63067_r_h) [n:127.0.0.1:63067_r_h c:control_collection x:collection1] o.a.s.c.Config Loaded SolrConfig: solrconfig.xml
[junit4] 2> 287187 INFO (coreLoadExecutor-590-thread-1-processing-n:127.0.0.1:63067_r_h) [n:127.0.0.1:63067_r_h c:control_collection x:collection1] o.a.s.s.IndexSchema Reading Solr Schema from /configs/conf1/schema.xml
[junit4] 2> 287196 INFO (coreLoadExecutor-590-thread-1-processing-n:127.0.0.1:63067_r_h) [n:127.0.0.1:63067_r_h c:control_collection x:collection1] o.a.s.s.IndexSchema [collection1] Schema name=test
[junit4] 2> 287578 INFO (coreLoadExecutor-590-thread-1-processing-n:127.0.0.1:63067_r_h) [n:127.0.0.1:63067_r_h c:control_collection x:collection1] o.a.s.s.OpenExchangeRatesOrgProvider Initialized with rates=open-exchange-rates.json, refreshInterval=1440.
[junit4] 2> 287592 INFO (coreLoadExecutor-590-thread-1-processing-n:127.0.0.1:63067_r_h) [n:127.0.0.1:63067_r_h c:control_collection x:collection1] o.a.s.s.IndexSchema default search field in schema is text
[junit4] 2> 287595 INFO (coreLoadExecutor-590-thread-1-processing-n:127.0.0.1:63067_r_h) [n:127.0.0.1:63067_r_h c:control_collection x:collection1] o.a.s.s.IndexSchema unique key field: id
[junit4] 2> 287612 INFO (coreLoadExecutor-590-thread-1-processing-n:127.0.0.1:63067_r_h) [n:127.0.0.1:63067_r_h c:control_collection x:collection1] o.a.s.s.FileExchangeRateProvider Reloading exchange rates from file currency.xml
[junit4] 2> 287617 INFO (coreLoadExecutor-590-thread-1-processing-n:127.0.0.1:63067_r_h) [n:127.0.0.1:63067_r_h c:control_collection x:collection1] o.a.s.s.FileExchangeRateProvider Reloading exchange rates from file currency.xml
[junit4] 2> 287622 INFO (coreLoadExecutor-590-thread-1-processing-n:127.0.0.1:63067_r_h) [n:127.0.0.1:63067_r_h c:control_collection x:collection1] o.a.s.s.OpenExchangeRatesOrgProvider Reloading exchange rates from open-exchange-rates.json
[junit4] 2> 287623 WARN (coreLoadExecutor-590-thread-1-processing-n:127.0.0.1:63067_r_h) [n:127.0.0.1:63067_r_h c:control_collection x:collection1] o.a.s.s.OpenExchangeRatesOrgProvider Unknown key IMPORTANT NOTE
[junit4] 2> 287624 WARN (coreLoadExecutor-590-thread-1-processing-n:127.0.0.1:63067_r_h) [n:127.0.0.1:63067_r_h c:control_collection x:collection1] o.a.s.s.OpenExchangeRatesOrgProvider Expected key, got STRING
[junit4] 2> 287624 INFO (coreLoadExecutor-590-thread-1-processing-n:127.0.0.1:63067_r_h) [n:127.0.0.1:63067_r_h c:control_collection x:collection1] o.a.s.s.OpenExchangeRatesOrgProvider Reloading exchange rates from open-exchange-rates.json
[junit4] 2> 287625 WARN (coreLoadExecutor-590-thread-1-processing-n:127.0.0.1:63067_r_h) [n:127.0.0.1:63067_r_h c:control_collection x:collection1] o.a.s.s.OpenExchangeRatesOrgProvider Unknown key IMPORTANT NOTE
[junit4] 2> 287625 WARN (coreLoadExecutor-590-thread-1-processing-n:127.0.0.1:63067_r_h) [n:127.0.0.1:63067_r_h c:control_collection x:collection1] o.a.s.s.OpenExchangeRatesOrgProvider Expected key, got STRING
[junit4] 2> 287625 INFO (coreLoadExecutor-590-thread-1-processing-n:127.0.0.1:63067_r_h) [n:127.0.0.1:63067_r_h c:control_collection x:collection1] o.a.s.c.CoreContainer Creating SolrCore 'collection1' using configuration from collection control_collection
[junit4] 2> 287626 INFO (coreLoadExecutor-590-thread-1-processing-n:127.0.0.1:63067_r_h) [n:127.0.0.1:63067_r_h c:control_collection s:shard1 r:core_node1 x:collection1] o.a.s.c.SolrCore org.apache.solr.core.MockDirectoryFactory
[junit4] 2> 287626 INFO (coreLoadExecutor-590-thread-1-processing-n:127.0.0.1:63067_r_h) [n:127.0.0.1:63067_r_h c:control_collection s:shard1 r:core_node1 x:collection1] o.a.s.c.SolrCore [[collection1] ] Opening new SolrCore at [C:\Users\JenkinsSlave\workspace\Lucene-Solr-5.x-Windows\solr\build\solr-core\test\J1\temp\solr.search.mlt.CloudMLTQParserTest_8F9289AE236EA803-001\control-001\cores\collection1\], dataDir=[null]
[junit4] 2> 287626 INFO (coreLoadExecutor-590-thread-1-processing-n:127.0.0.1:63067_r_h) [n:127.0.0.1:63067_r_h c:control_collection s:shard1 r:core_node1 x:collection1] o.a.s.c.JmxMonitoredMap JMX monitoring is enabled. Adding Solr mbeans to JMX Server: com.sun.jmx.mbeanserver.JmxMBeanServer@cd47cb
[junit4] 2> 287627 INFO (coreLoadExecutor-590-thread-1-processing-n:127.0.0.1:63067_r_h) [n:127.0.0.1:63067_r_h c:control_collection s:shard1 r:core_node1 x:collection1] o.a.s.c.CachingDirectoryFactory return new directory for C:\Users\JenkinsSlave\workspace\Lucene-Solr-5.x-Windows\solr\build\solr-core\test\J1\temp\solr.search.mlt.CloudMLTQParserTest_8F9289AE236EA803-001\control-001\cores\collection1\data\
[junit4] 2> 287627 INFO (coreLoadExecutor-590-thread-1-processing-n:127.0.0.1:63067_r_h) [n:127.0.0.1:63067_r_h c:control_collection s:shard1 r:core_node1 x:collection1] o.a.s.c.SolrCore New index directory detected: old=null new=C:\Users\JenkinsSlave\workspace\Lucene-Solr-5.x-Windows\solr\build\solr-core\test\J1\temp\solr.search.mlt.CloudMLTQParserTest_8F9289AE236EA803-001\control-001\cores\collection1\data\index/
[junit4] 2> 287627 WARN (coreLoadExecutor-590-thread-1-processing-n:127.0.0.1:63067_r_h) [n:127.0.0.1:63067_r_h c:control_collection s:shard1 r:core_node1 x:collection1] o.a.s.c.SolrCore [collection1] Solr index directory 'C:\Users\JenkinsSlave\workspace\Lucene-Solr-5.x-Windows\solr\build\solr-core\test\J1\temp\solr.search.mlt.CloudMLTQParserTest_8F9289AE236EA803-001\control-001\cores\collection1\data\index' doesn't exist. Creating new index...
[junit4] 2> 287627 INFO (coreLoadExecutor-590-thread-1-processing-n:127.0.0.1:63067_r_h) [n:127.0.0.1:63067_r_h c:control_collection s:shard1 r:core_node1 x:collection1] o.a.s.c.CachingDirectoryFactory return new directory for C:\Users\JenkinsSlave\workspace\Lucene-Solr-5.x-Windows\solr\build\solr-core\test\J1\temp\solr.search.mlt.CloudMLTQParserTest_8F9289AE236EA803-001\control-001\cores\collection1\data\index
[junit4] 2> 287628 INFO (coreLoadExecutor-590-thread-1-processing-n:127.0.0.1:63067_r_h) [n:127.0.0.1:63067_r_h c:control_collection s:shard1 r:core_node1 x:collection1] o.a.s.u.RandomMergePolicy RandomMergePolicy wrapping class org.apache.lucene.index.LogDocMergePolicy: [LogDocMergePolicy: minMergeSize=1000, mergeFactor=23, maxMergeSize=9223372036854775807, maxMergeSizeForForcedMerge=9223372036854775807, calibrateSizeByDeletes=true, maxMergeDocs=2147483647, maxCFSSegmentSizeMB=8.796093022207999E12, noCFSRatio=0.7135984129163875]
[junit4] 2> 287628 INFO (coreLoadExecutor-590-thread-1-processing-n:127.0.0.1:63067_r_h) [n:127.0.0.1:63067_r_h c:control_collection s:shard1 r:core_node1 x:collection1] o.a.s.c.SolrCore SolrDeletionPolicy.onCommit: commits: num=1
[junit4] 2> commit{dir=MockDirectoryWrapper(RAMDirectory@731b34 lockFactory=org.apache.lucene.store.SingleInstanceLockFactory@ff1f43),segFN=segments_1,generation=1}
[junit4] 2> 287628 INFO (coreLoadExecutor-590-thread-1-processing-n:127.0.0.1:63067_r_h) [n:127.0.0.1:63067_r_h c:control_collection s:shard1 r:core_node1 x:collection1] o.a.s.c.SolrCore newest commit generation = 1
[junit4] 2> 287629 INFO (OldIndexDirectoryCleanupThreadForCore-collection1) [n:127.0.0.1:63067_r_h c:control_collection s:shard1 r:core_node1 x:collection1] o.a.s.c.SolrCore Looking for old index directories to cleanup for core collection1 in C:\Users\JenkinsSlave\workspace\Lucene-Solr-5.x-Windows\solr\build\solr-core\test\J1\temp\solr.search.mlt.CloudMLTQParserTest_8F9289AE236EA803-001\control-001\cores\collection1\data\
[junit4] 2> 287631 WARN (OldIndexDirectoryCleanupThreadForCore-collection1) [n:127.0.0.1:63067_r_h c:control_collection s:shard1 r:core_node1 x:collection1] o.a.s.c.DirectoryFactory C:\Users\JenkinsSlave\workspace\Lucene-Solr-5.x-Windows\solr\build\solr-core\test\J1\temp\solr.search.mlt.CloudMLTQParserTest_8F9289AE236EA803-001\control-001\cores\collection1\data\ does not point to a valid data directory; skipping clean-up of old index directories.
[junit4] 2> 287636 INFO (coreLoadExecutor-590-thread-1-processing-n:127.0.0.1:63067_r_h) [n:127.0.0.1:63067_r_h c:control_collection s:shard1 r:core_node1 x:collection1] o.a.s.u.p.UpdateRequestProcessorChain creating updateRequestProcessorChain "dedupe"
[junit4] 2> 287636 INFO (coreLoadExecutor-590-thread-1-processing-n:127.0.0.1:63067_r_h) [n:127.0.0.1:63067_r_h c:control_collection s:shard1 r:core_node1 x:collection1] o.a.s.u.p.UpdateRequestProcessorChain inserting DistributedUpdateProcessorFactory into updateRequestProcessorChain "dedupe"
[junit4] 2> 287637 INFO (coreLoadExecutor-590-thread-1-processing-n:127.0.0.1:63067_r_h) [n:127.0.0.1:63067_r_h c:control_collection s:shard1 r:core_node1 x:collection1] o.a.s.u.p.UpdateRequestProcessorChain creating updateRequestProcessorChain "dedupe-allfields"
[junit4] 2> 287637 INFO (coreLoadExecutor-590-thread-1-processing-n:127.0.0.1:63067_r_h) [n:127.0.0.1:63067_r_h c:control_collection s:shard1 r:core_node1 x:collection1] o.a.s.u.p.UpdateRequestProcessorChain inserting DistributedUpdateProcessorFactory into updateRequestProcessorChain "dedupe-allfields"
[junit4] 2> 287637 INFO (coreLoadExecutor-590-thread-1-processing-n:127.0.0.1:63067_r_h) [n:127.0.0.1:63067_r_h c:control_collection s:shard1 r:core_node1 x:collection1] o.a.s.u.p.UpdateRequestProcessorChain creating updateRequestProcessorChain "stored_sig"
[junit4] 2> 287640 INFO (coreLoadExecutor-590-thread-1-processing-n:127.0.0.1:63067_r_h) [n:127.0.0.1:63067_r_h c:control_collection s:shard1 r:core_node1 x:collection1] o.a.s.u.p.UpdateRequestProcessorChain inserting DistributedUpdateProcessorFactory into updateRequestProcessorChain "stored_sig"
[junit4] 2> 287640 INFO (coreLoadExecutor-590-thread-1-processing-n:127.0.0.1:63067_r_h) [n:127.0.0.1:63067_r_h c:control_collection s:shard1 r:core_node1 x:collection1] o.a.s.u.p.UpdateRequestProcessorChain creating updateRequestProcessorChain "uniq-fields"
[junit4] 2> 287640 INFO (coreLoadExecutor-590-thread-1-processing-n:127.0.0.1:63067_r_h) [n:127.0.0.1:63067_r_h c:control_collection s:shard1 r:core_node1 x:collection1] o.a.s.u.p.UpdateRequestProcessorChain inserting DistributedUpdateProcessorFactory into updateRequestProcessorChain "uniq-fields"
[junit4] 2> 287640 INFO (coreLoadExecutor-590-thread-1-processing-n:127.0.0.1:63067_r_h) [n:127.0.0.1:63067_r_h c:control_collection s:shard1 r:core_node1 x:collection1] o.a.s.u.p.UpdateRequestProcessorChain creating updateRequestProcessorChain "distrib-dup-test-chain-explicit"
[junit4] 2> 287641 INFO (coreLoadExecutor-590-thread-1-processing-n:127.0.0.1:63067_r_h) [n:127.0.0.1:63067_r_h c:control_collection s:shard1 r:core_node1 x:collection1] o.a.s.u.p.UpdateRequestProcessorChain creating updateRequestProcessorChain "distrib-dup-test-chain-implicit"
[junit4] 2> 287641 INFO (coreLoadExecutor-590-thread-1-processing-n:127.0.0.1:63067_r_h) [n:127.0.0.1:63067_r_h c:control_collection s:shard1 r:core_node1 x:collection1] o.a.s.u.p.UpdateRequestProcessorChain inserting DistributedUpdateProcessorFactory into updateRequestProcessorChain "distrib-dup-test-chain-implicit"
[junit4] 2> 287641 INFO (coreLoadExecutor-590-thread-1-processing-n:127.0.0.1:63067_r_h) [n:127.0.0.1:63067_r_h c:control_collection s:shard1 r:core_node1 x:collection1] o.a.s.c.SolrCore no updateRequestProcessorChain defined as default, creating implicit default
[junit4] 2> 287655 INFO (coreLoadExecutor-590-thread-1-processing-n:127.0.0.1:63067_r_h) [n:127.0.0.1:63067_r_h c:control_collection s:shard1 r:core_node1 x:collection1] o.a.s.h.l.XMLLoader xsltCacheLifetimeSeconds=60
[junit4] 2> 287657 INFO (coreLoadExecutor-590-thread-1-processing-n:127.0.0.1:63067_r_h) [n:127.0.0.1:63067_r_h c:control_collection s:shard1 r:core_node1 x:collection1] o.a.s.h.l.XMLLoader xsltCacheLifetimeSeconds=60
[junit4] 2> 287660 INFO (coreLoadExecutor-590-thread-1-processing-n:127.0.0.1:63067_r_h) [n:127.0.0.1:63067_r_h c:control_collection s:shard1 r:core_node1 x:collection1] o.a.s.h.l.XMLLoader xsltCacheLifetimeSeconds=60
[junit4] 2> 287662 INFO (coreLoadExecutor-590-thread-1-processing-n:127.0.0.1:63067_r_h) [n:127.0.0.1:63067_r_h c:control_collection s:shard1 r:core_node1 x:collection1] o.a.s.h.l.XMLLoader xsltCacheLifetimeSeconds=60
[junit4] 2> 287671 INFO (coreLoadExecutor-590-thread-1-processing-n:127.0.0.1:63067_r_h) [n:127.0.0.1:63067_r_h c:control_collection s:shard1 r:core_node1 x:collection1] o.a.s.c.PluginBag requestHandler : 'lazy' created with startup=lazy
[junit4] 2> 287674 INFO (coreLoadExecutor-590-thread-1-processing-n:127.0.0.1:63067_r_h) [n:127.0.0.1:63067_r_h c:control_collection s:shard1 r:core_node1 x:collection1] o.a.s.c.RequestHandlers Registered paths: mock,/config,/admin/system,mltrh,standard,/admin/mbeans,/schema,/update/json/docs,/admin/ping,lazy,/admin/logging,/search-facet-invariants,/admin/plugins,/admin/file,/admin/segments,/debug/dump,/admin/luke,/update,/update/csv,spellCheckCompRH1,spellCheckCompRH,spellCheckWithWordbreak_Direct,spellCheckWithWordbreak,/replication,spellCheckCompRH_Direct,dismax,/get,/update/json,tvrh,/admin/threads,/search-facet-def,/terms,/admin/properties,/mlt,defaults
[junit4] 2> 287676 WARN (coreLoadExecutor-590-thread-1-processing-n:127.0.0.1:63067_r_h) [n:127.0.0.1:63067_r_h c:control_collection s:shard1 r:core_node1 x:collection1] o.a.s.c.SolrCore solrconfig.xml uses deprecated <admin/gettableFiles>, Please update your config to use the ShowFileRequestHandler.
[junit4] 2> 287678 INFO (coreLoadExecutor-590-thread-1-processing-n:127.0.0.1:63067_r_h) [n:127.0.0.1:63067_r_h c:control_collection s:shard1 r:core_node1 x:collection1] o.a.s.c.SolrCore Using default statsCache cache: org.apache.solr.search.stats.LocalStatsCache
[junit4] 2> 287680 INFO (coreLoadExecutor-590-thread-1-processing-n:127.0.0.1:63067_r_h) [n:127.0.0.1:63067_r_h c:control_collection s:shard1 r:core_node1 x:collection1] o.a.s.u.UpdateHandler Using UpdateLog implementation: org.apache.solr.update.UpdateLog
[junit4] 2> 287680 INFO (coreLoadExecutor-590-thread-1-processing-n:127.0.0.1:63067_r_h) [n:127.0.0.1:63067_r_h c:control_collection s:shard1 r:core_node1 x:collection1] o.a.s.u.UpdateLog Initializing UpdateLog: dataDir= defaultSyncLevel=FLUSH numRecordsToKeep=100 maxNumLogsToKeep=10 numVersionBuckets=65536
[junit4] 2> 287682 INFO (coreLoadExecutor-590-thread-1-processing-n:127.0.0.1:63067_r_h) [n:127.0.0.1:63067_r_h c:control_collection s:shard1 r:core_node1 x:collection1] o.a.s.c.SolrCore Hard AutoCommit: disabled
[junit4] 2> 287682 INFO (coreLoadExecutor-590-thread-1-processing-n:127.0.0.1:63067_r_h) [n:127.0.0.1:63067_r_h c:control_collection s:shard1 r:core_node1 x:collection1] o.a.s.c.SolrCore Soft AutoCommit: disabled
[junit4] 2> 287682 INFO (coreLoadExecutor-590-thread-1-processing-n:127.0.0.1:63067_r_h) [n:127.0.0.1:63067_r_h c:control_collection s:shard1 r:core_node1 x:collection1] o.a.s.u.RandomMergePolicy RandomMergePolicy wrapping class org.apache.lucene.index.LogDocMergePolicy: [LogDocMergePolicy: minMergeSize=1000, mergeFactor=31, maxMergeSize=9223372036854775807, maxMergeSizeForForcedMerge=9223372036854775807, calibrateSizeByDeletes=false, maxMergeDocs=2147483647, maxCFSSegmentSizeMB=8.796093022207999E12, noCFSRatio=0.6944782968138459]
[junit4] 2> 287683 INFO (coreLoadExecutor-590-thread-1-processing-n:127.0.0.1:63067_r_h) [n:127.0.0.1:63067_r_h c:control_collection s:shard1 r:core_node1 x:collection1] o.a.s.c.SolrCore SolrDeletionPolicy.onInit: commits: num=1
[junit4] 2> commit{dir=MockDirectoryWrapper(RAMDirectory@731b34 lockFactory=org.apache.lucene.store.SingleInstanceLockFactory@ff1f43),segFN=segments_1,generation=1}
[junit4] 2> 287683 INFO (coreLoadExecutor-590-thread-1-processing-n:127.0.0.1:63067_r_h) [n:127.0.0.1:63067_r_h c:control_collection s:shard1 r:core_node1 x:collection1] o.a.s.c.SolrCore newest commit generation = 1
[junit4] 2> 287683 INFO (coreLoadExecutor-590-thread-1-processing-n:127.0.0.1:63067_r_h) [n:127.0.0.1:63067_r_h c:control_collection s:shard1 r:core_node1 x:collection1] o.a.s.s.SolrIndexSearcher Opening Searcher@32f489[collection1] main
[junit4] 2> 287685 INFO (coreLoadExecutor-590-thread-1-processing-n:127.0.0.1:63067_r_h) [n:127.0.0.1:63067_r_h c:control_collection s:shard1 r:core_node1 x:collection1] o.a.s.r.RestManager Initializing RestManager with initArgs: {storageIO=org.apache.solr.rest.ManagedResourceStorage$InMemoryStorageIO}
[junit4] 2> 287685 INFO (coreLoadExecutor-590-thread-1-processing-n:127.0.0.1:63067_r_h) [n:127.0.0.1:63067_r_h c:control_collection s:shard1 r:core_node1 x:collection1] o.a.s.r.ManagedResourceStorage Reading _rest_managed.json using InMemoryStorage
[junit4] 2> 287687 INFO (coreLoadExecutor-590-thread-1-processing-n:127.0.0.1:63067_r_h) [n:127.0.0.1:63067_r_h c:control_collection s:shard1 r:core_node1 x:collection1] o.a.s.r.RestManager Initializing 0 registered ManagedResources
[junit4] 2> 287687 INFO (coreLoadExecutor-590-thread-1-processing-n:127.0.0.1:63067_r_h) [n:127.0.0.1:63067_r_h c:control_collection s:shard1 r:core_node1 x:collection1] o.a.s.h.c.SpellCheckComponent Initializing spell checkers
[junit4] 2> 287701 INFO (coreLoadExecutor-590-thread-1-processing-n:127.0.0.1:63067_r_h) [n:127.0.0.1:63067_r_h c:control_collection s:shard1 r:core_node1 x:collection1] o.a.s.s.DirectSolrSpellChecker init: {name=direct,classname=DirectSolrSpellChecker,field=lowerfilt,minQueryLength=3}
[junit4] 2> 287802 INFO (coreLoadExecutor-590-thread-1-processing-n:127.0.0.1:63067_r_h) [n:127.0.0.1:63067_r_h c:control_collection s:shard1 r:core_node1 x:collection1] o.a.s.h.ReplicationHandler Commits will be reserved for 10000
[junit4] 2> 287803 INFO (searcherExecutor-591-thread-1-processing-c:control_collection s:shard1 r:core_node1 n:127.0.0.1:63067_r_h x:collection1) [n:127.0.0.1:63067_r_h c:control_collection s:shard1 r:core_node1 x:collection1] o.a.s.h.c.SpellCheckComponent Loading spell index for spellchecker: default
[junit4] 2> 287803 INFO (searcherExecutor-591-thread-1-processing-c:control_collection s:shard1 r:core_node1 n:127.0.0.1:63067_r_h x:collection1) [n:127.0.0.1:63067_r_h c:control_collection s:shard1 r:core_node1 x:collection1] o.a.s.h.c.SpellCheckComponent Loading spell index for spellchecker: direct
[junit4] 2> 287804 INFO (searcherExecutor-591-thread-1-processing-c:control_collection s:shard1 r:core_node1 n:127.0.0.1:63067_r_h x:collection1) [n:127.0.0.1:63067_r_h c:control_collection s:shard1 r:core_node1 x:collection1] o.a.s.h.c.SpellCheckComponent Loading spell index for spellchecker: wordbreak
[junit4] 2> 287804 INFO (searcherExecutor-591-thread-1-processing-c:control_collection s:shard1 r:core_node1 n:127.0.0.1:63067_r_h x:collection1) [n:127.0.0.1:63067_r_h c:control_collection s:shard1 r:core_node1 x:collection1] o.a.s.h.c.SpellCheckComponent Loading spell index for spellchecker: multipleFields
[junit4] 2> 287804 INFO (coreLoadExecutor-590-thread-1-processing-n:127.0.0.1:63067_r_h) [n:127.0.0.1:63067_r_h c:control_collection s:shard1 r:core_node1 x:collection1] o.a.s.u.UpdateLog Looking up max value of version field to seed version buckets
[junit4] 2> 287804 INFO (coreLoadExecutor-590-thread-1-processing-n:127.0.0.1:63067_r_h) [n:127.0.0.1:63067_r_h c:control_collection s:shard1 r:core_node1 x:collection1] o.a.s.u.VersionInfo Refreshing highest value of _version_ for 65536 version buckets from index
[junit4] 2> 287804 INFO (coreLoadExecutor-590-thread-1-processing-n:127.0.0.1:63067_r_h) [n:127.0.0.1:63067_r_h c:control_collection s:shard1 r:core_node1 x:collection1] o.a.s.u.VersionInfo No terms found for _version_, cannot seed version bucket highest value from index
[junit4] 2> 287804 INFO (coreLoadExecutor-590-thread-1-processing-n:127.0.0.1:63067_r_h) [n:127.0.0.1:63067_r_h c:control_collection s:shard1 r:core_node1 x:collection1] o.a.s.u.UpdateLog Could not find max version in index or recent updates, using new clock 1503703674711441408
[junit4] 2> 287804 INFO (searcherExecutor-591-thread-1-processing-c:control_collection s:shard1 r:core_node1 n:127.0.0.1:63067_r_h x:collection1) [n:127.0.0.1:63067_r_h c:control_collection s:shard1 r:core_node1 x:collection1] o.a.s.h.c.SpellCheckComponent Loading spell index for spellchecker: jarowinkler
[junit4] 2> 287805 INFO (searcherExecutor-591-thread-1-processing-c:control_collection s:shard1 r:core_node1 n:127.0.0.1:63067_r_h x:collection1) [n:127.0.0.1:63067_r_h c:control_collection s:shard1 r:core_node1 x:collection1] o.a.s.h.c.SpellCheckComponent Loading spell index for spellchecker: external
[junit4] 2> 287806 INFO (searcherExecutor-591-thread-1-processing-c:control_collection s:shard1 r:core_node1 n:127.0.0.1:63067_r_h x:collection1) [n:127.0.0.1:63067_r_h c:control_collection s:shard1 r:core_node1 x:collection1] o.a.s.h.c.SpellCheckComponent Loading spell index for spellchecker: freq
[junit4] 2> 287806 INFO (coreLoadExecutor-590-thread-1-processing-n:127.0.0.1:63067_r_h) [n:127.0.0.1:63067_r_h c:control_collection s:shard1 r:core_node1 x:collection1] o.a.s.u.UpdateLog Took 2 ms to seed version buckets with highest version 1503703674711441408
[junit4] 2> 287807 INFO (coreLoadExecutor-590-thread-1-processing-n:127.0.0.1:63067_r_h) [n:127.0.0.1:63067_r_h c:control_collection s:shard1 r:core_node1 x:collection1] o.a.s.c.ZkController watch zkdir /configs/conf1
[junit4] 2> 287806 INFO (searcherExecutor-591-thread-1-processing-c:control_collection s:shard1 r:core_node1 n:127.0.0.1:63067_r_h x:collection1) [n:127.0.0.1:63067_r_h c:control_collection s:shard1 r:core_node1 x:collection1] o.a.s.h.c.SpellCheckComponent Loading spell index for spellchecker: fqcn
[junit4] 2> 287807 INFO (searcherExecutor-591-thread-1-processing-c:control_collection s:shard1 r:core_node1 n:127.0.0.1:63067_r_h x:collection1) [n:127.0.0.1:63067_r_h c:control_collection s:shard1 r:core_node1 x:collection1] o.a.s.h.c.SpellCheckComponent Loading spell index for spellchecker: perDict
[junit4] 2> 287808 INFO (coreLoadExecutor-590-thread-1-processing-n:127.0.0.1:63067_r_h) [n:127.0.0.1:63067_r_h c:control_collection s:shard1 r:core_node1 x:collection1] o.a.s.c.CoreContainer registering core: collection1
[junit4] 2> 287809 INFO (searcherExecutor-591-thread-1-processing-c:control_collection s:shard1 r:core_node1 n:127.0.0.1:63067_r_h x:collection1) [n:127.0.0.1:63067_r_h c:control_collection s:shard1 r:core_node1 x:collection1] o.a.s.c.SolrCore [collection1] Registered new searcher Searcher@32f489[collection1] main{ExitableDirectoryReader(UninvertingDirectoryReader())}
[junit4] 2> 287809 INFO (coreZkRegister-584-thread-1-processing-c:control_collection s:shard1 r:core_node1 n:127.0.0.1:63067_r_h x:collection1) [n:127.0.0.1:63067_r_h c:control_collection s:shard1 r:core_node1 x:collection1] o.a.s.c.ZkController Register replica - core:collection1 address:http://127.0.0.1:63067/r_h collection:control_collection shard:shard1
[junit4] 2> 287819 INFO (coreZkRegister-584-thread-1-processing-c:control_collection s:shard1 r:core_node1 n:127.0.0.1:63067_r_h x:collection1) [n:127.0.0.1:63067_r_h c:control_collection s:shard1 r:core_node1 x:collection1] o.a.s.c.ShardLeaderElectionContext Running the leader process for shard shard1
[junit4] 2> 287821 INFO (zkCallback-195-thread-1-processing-n:127.0.0.1:63067_r_h) [n:127.0.0.1:63067_r_h ] o.a.s.c.DistributedQueue NodeChildrenChanged fired on path /overseer/queue state SyncConnected
[junit4] 2> 287822 INFO (coreZkRegister-584-thread-1-processing-c:control_collection s:shard1 r:core_node1 n:127.0.0.1:63067_r_h x:collection1) [n:127.0.0.1:63067_r_h c:control_collection s:shard1 r:core_node1 x:collection1] o.a.s.c.ShardLeaderElectionContext Enough replicas found to continue.
[junit4] 2> 287822 INFO (coreZkRegister-584-thread-1-processing-c:control_collection s:shard1 r:core_node1 n:127.0.0.1:63067_r_h x:collection1) [n:127.0.0.1:63067_r_h c:control_collection s:shard1 r:core_node1 x:collection1] o.a.s.c.ShardLeaderElectionContext I may be the new leader - try and sync
[junit4] 2> 287823 INFO (coreZkRegister-584-thread-1-processing-c:control_collection s:shard1 r:core_node1 n:127.0.0.1:63067_r_h x:collection1) [n:127.0.0.1:63067_r_h c:control_collection s:shard1 r:core_node1 x:collection1] o.a.s.c.SyncStrategy Sync replicas to http://127.0.0.1:63067/r_h/collection1/
[junit4] 2> 287823 INFO (coreZkRegister-584-thread-1-processing-c:control_collection s:shard1 r:core_node1 n:127.0.0.1:63067_r_h x:collection1) [n:127.0.0.1:63067_r_h c:control_collection s:shard1 r:core_node1 x:collection1] o.a.s.c.SyncStrategy Sync Success - now sync replicas to me
[junit4] 2> 287823 INFO (coreZkRegister-584-thread-1-processing-c:control_collection s:shard1 r:core_node1 n:127.0.0.1:63067_r_h x:collection1) [n:127.0.0.1:63067_r_h c:control_collection s:shard1 r:core_node1 x:collection1] o.a.s.c.SyncStrategy http://127.0.0.1:63067/r_h/collection1/ has no replicas
[junit4] 2> 287823 INFO (coreZkRegister-584-thread-1-processing-c:control_collection s:shard1 r:core_node1 n:127.0.0.1:63067_r_h x:collection1) [n:127.0.0.1:63067_r_h c:control_collection s:shard1 r:core_node1 x:collection1] o.a.s.c.ShardLeaderElectionContext I am the new leader: http://127.0.0.1:63067/r_h/collection1/ shard1
[junit4] 2> 287823 INFO (OverseerStateUpdate-93981479496122371-127.0.0.1:63067_r_h-n_0000000000) [n:127.0.0.1:63067_r_h ] o.a.s.c.Overseer processMessage: queueSize: 1, message = {
[junit4] 2> "operation":"leader",
[junit4] 2> "shard":"shard1",
[junit4] 2> "collection":"control_collection"} current state version: 1
[junit4] 2> 287832 INFO (OverseerStateUpdate-93981479496122371-127.0.0.1:63067_r_h-n_0000000000) [n:127.0.0.1:63067_r_h ] o.a.s.c.Overseer processMessage: queueSize: 1, message = {
[junit4] 2> "operation":"leader",
[junit4] 2> "shard":"shard1",
[junit4] 2> "collection":"control_collection",
[junit4] 2> "base_url":"http://127.0.0.1:63067/r_h",
[junit4] 2> "core":"collection1",
[junit4] 2> "state":"active"} current state version: 2
[junit4] 2> 287835 INFO (zkCallback-195-thread-1-processing-n:127.0.0.1:63067_r_h) [n:127.0.0.1:63067_r_h ] o.a.s.c.DistributedQueue NodeChildrenChanged fired on path /overseer/queue state SyncConnected
[junit4] 2> 287885 INFO (coreZkRegister-584-thread-1-processing-c:control_collection s:shard1 r:core_node1 n:127.0.0.1:63067_r_h x:collection1) [n:127.0.0.1:63067_r_h c:control_collection s:shard1 r:core_node1 x:collection1] o.a.s.c.ZkController We are http://127.0.0.1:63067/r_h/collection1/ and leader is http://127.0.0.1:63067/r_h/collection1/
[junit4] 2> 287885 INFO (coreZkRegister-584-thread-1-processing-c:control_collection s:shard1 r:core_node1 n:127.0.0.1:63067_r_h x:collection1) [n:127.0.0.1:63067_r_h c:control_collection s:shard1 r:core_node1 x:collection1] o.a.s.c.ZkController No LogReplay needed for core=collection1 baseURL=http://127.0.0.1:63067/r_h
[junit4] 2> 287885 INFO (coreZkRegister-584-thread-1-processing-c:control_collection s:shard1 r:core_node1 n:127.0.0.1:63067_r_h x:collection1) [n:127.0.0.1:63067_r_h c:control_collection s:shard1 r:core_node1 x:collection1] o.a.s.c.ZkController I am the leader, no recovery necessary
[junit4] 2> 287886 INFO (coreZkRegister-584-thread-1-processing-c:control_collection s:shard1 r:core_node1 n:127.0.0.1:63067_r_h x:collection1) [n:127.0.0.1:63067_r_h c:control_collection s:shard1 r:core_node1 x:collection1] o.a.s.c.ZkController publishing state=active
[junit4] 2> 287886 INFO (coreZkRegister-584-thread-1-processing-c:control_collection s:shard1 r:core_node1 n:127.0.0.1:63067_r_h x:collection1) [n:127.0.0.1:63067_r_h c:control_collection s:shard1 r:core_node1 x:collection1] o.a.s.c.ZkController numShards not found on descriptor - reading it from system property
[junit4] 2> 287888 INFO (zkCallback-195-thread-1-processing-n:127.0.0.1:63067_r_h) [n:127.0.0.1:63067_r_h ] o.a.s.c.DistributedQueue NodeChildrenChanged fired on path /overseer/queue state SyncConnected
[junit4] 2> 287889 INFO (OverseerStateUpdate-93981479496122371-127.0.0.1:63067_r_h-n_0000000000) [n:127.0.0.1:63067_r_h ] o.a.s.c.Overseer processMessage: queueSize: 1, message = {
[junit4] 2> "collection":"control_collection",
[junit4] 2> "roles":null,
[junit4] 2> "state":"active",
[junit4] 2> "shard":"shard1",
[junit4] 2> "core_node_name":"core_node1",
[junit4] 2> "numShards":"1",
[junit4] 2> "node_name":"127.0.0.1:63067_r_h",
[junit4] 2> "base_url":"http://127.0.0.1:63067/r_h",
[junit4] 2> "operation":"state",
[junit4] 2> "core":"collection1"} current state version: 3
[junit4] 2> 287890 INFO (OverseerStateUpdate-93981479496122371-127.0.0.1:63067_r_h-n_0000000000) [n:127.0.0.1:63067_r_h ] o.a.s.c.o.ReplicaMutator Update state numShards=1 message={
[junit4] 2> "collection":"control_collection",
[junit4] 2> "roles":null,
[junit4] 2> "state":"active",
[junit4] 2> "shard":"shard1",
[junit4] 2> "core_node_name":"core_node1",
[junit4] 2> "numShards":"1",
[junit4] 2> "node_name":"127.0.0.1:63067_r_h",
[junit4] 2> "base_url":"http://127.0.0.1:63067/r_h",
[junit4] 2> "operation":"state",
[junit4] 2> "core":"collection1"}
[junit4] 2> 288100 INFO (TEST-CloudMLTQParserTest.testInvalidDocument-seed#[8F9289AE236EA803]) [ ] o.a.s.c.ChaosMonkey monkey: init - expire sessions:false cause connection loss:false
[junit4] 2> 288492 INFO (TEST-CloudMLTQParserTest.testInvalidDocument-seed#[8F9289AE236EA803]) [ ] o.a.s.SolrTestCaseJ4 Writing core.properties file to C:\Users\JenkinsSlave\workspace\Lucene-Solr-5.x-Windows\solr\build\solr-core\test\J1\temp\solr.search.mlt.CloudMLTQParserTest_8F9289AE236EA803-001\shard-1-001\cores\collection1
[junit4] 2> 288495 INFO (TEST-CloudMLTQParserTest.testInvalidDocument-seed#[8F9289AE236EA803]) [ ] o.a.s.c.AbstractFullDistribZkTestBase create jetty 1 in directory C:\Users\JenkinsSlave\workspace\Lucene-Solr-5.x-Windows\solr\build\solr-core\test\J1\temp\solr.search.mlt.CloudMLTQParserTest_8F9289AE236EA803-001\shard-1-001
[junit4] 2> 288496 INFO (TEST-CloudMLTQParserTest.testInvalidDocument-seed#[8F9289AE236EA803]) [ ] o.e.j.s.Server jetty-9.2.11.v20150529
[junit4] 2> 288501 INFO (TEST-CloudMLTQParserTest.testInvalidDocument-seed#[8F9289AE236EA803]) [ ] o.e.j.s.h.ContextHandler Started o.e.j.s.ServletContextHandler@1e0b2e2{/r_h,null,AVAILABLE}
[junit4] 2> 288503 INFO (TEST-CloudMLTQParserTest.testInvalidDocument-seed#[8F9289AE236EA803]) [ ] o.e.j.s.ServerConnector Started ServerConnector@100428d{HTTP/1.1}{127.0.0.1:63079}
[junit4] 2> 288503 INFO (TEST-CloudMLTQParserTest.testInvalidDocument-seed#[8F9289AE236EA803]) [ ] o.e.j.s.Server Started @292755ms
[junit4] 2> 288503 INFO (TEST-CloudMLTQParserTest.testInvalidDocument-seed#[8F9289AE236EA803]) [ ] o.a.s.c.s.e.JettySolrRunner Jetty properties: {solrconfig=solrconfig.xml, coreRootDirectory=C:\Users\JenkinsSlave\workspace\Lucene-Solr-5.x-Windows\solr\build\solr-core\test\J1\temp\solr.search.mlt.CloudMLTQParserTest_8F9289AE236EA803-001\shard-1-001\cores, hostPort=63079, hostContext=/r_h, solr.data.dir=C:\Users\JenkinsSlave\workspace\Lucene-Solr-5.x-Windows\solr\build\solr-core\test\J1\temp\solr.search.mlt.CloudMLTQParserTest_8F9289AE236EA803-001\tempDir-001/jetty1}
[junit4] 2> 288504 INFO (TEST-CloudMLTQParserTest.testInvalidDocument-seed#[8F9289AE236EA803]) [ ] o.a.s.s.SolrDispatchFilter SolrDispatchFilter.init()sun.misc.Launcher$AppClassLoader@c21495
[junit4] 2> 288504 INFO (TEST-CloudMLTQParserTest.testInvalidDocument-seed#[8F9289AE236EA803]) [ ] o.a.s.c.SolrResourceLoader new SolrResourceLoader for directory: 'C:\Users\JenkinsSlave\workspace\Lucene-Solr-5.x-Windows\solr\build\solr-core\test\J1\temp\solr.search.mlt.CloudMLTQParserTest_8F9289AE236EA803-001\shard-1-001\'
[junit4] 2> 288547 INFO (TEST-CloudMLTQParserTest.testInvalidDocument-seed#[8F9289AE236EA803]) [ ] o.a.s.c.SolrXmlConfig Loading container configuration from C:\Users\JenkinsSlave\workspace\Lucene-Solr-5.x-Windows\solr\build\solr-core\test\J1\temp\solr.search.mlt.CloudMLTQParserTest_8F9289AE236EA803-001\shard-1-001\solr.xml
[junit4] 2> 288584 INFO (TEST-CloudMLTQParserTest.testInvalidDocument-seed#[8F9289AE236EA803]) [ ] o.a.s.c.CoresLocator Config-defined core root directory: C:\Users\JenkinsSlave\workspace\Lucene-Solr-5.x-Windows\solr\build\solr-core\test\J1\temp\solr.search.mlt.CloudMLTQParserTest_8F9289AE236EA803-001\shard-1-001\cores
[junit4] 2> 288584 INFO (TEST-CloudMLTQParserTest.testInvalidDocument-seed#[8F9289AE236EA803]) [ ] o.a.s.c.CoreContainer New CoreContainer 16596144
[junit4] 2> 288584 INFO (TEST-CloudMLTQParserTest.testInvalidDocument-seed#[8F9289AE236EA803]) [ ] o.a.s.c.CoreContainer Loading cores into CoreContainer [instanceDir=C:\Users\JenkinsSlave\workspace\Lucene-Solr-5.x-Windows\solr\build\solr-core\test\J1\temp\solr.search.mlt.CloudMLTQParserTest_8F9289AE236EA803-001\shard-1-001\]
[junit4] 2> 288585 INFO (TEST-CloudMLTQParserTest.testInvalidDocument-seed#[8F9289AE236EA803]) [ ] o.a.s.c.CoreContainer loading shared library: C:\Users\JenkinsSlave\workspace\Lucene-Solr-5.x-Windows\solr\build\solr-core\test\J1\temp\solr.search.mlt.CloudMLTQParserTest_8F9289AE236EA803-001\shard-1-001\lib
[junit4] 2> 288585 WARN (TEST-CloudMLTQParserTest.testInvalidDocument-seed#[8F9289AE236EA803]) [ ] o.a.s.c.SolrResourceLoader Can't find (or read) directory to add to classloader: lib (resolved as: C:\Users\JenkinsSlave\workspace\Lucene-Solr-5.x-Windows\solr\build\solr-core\test\J1\temp\solr.search.mlt.CloudMLTQParserTest_8F9289AE236EA803-001\shard-1-001\lib).
[junit4] 2> 288598 INFO (TEST-CloudMLTQParserTest.testInvalidDocument-seed#[8F9289AE236EA803]) [ ] o.a.s.h.c.HttpShardHandlerFactory created with socketTimeout : 90000,urlScheme : ,connTimeout : 15000,maxConnectionsPerHost : 20,maxConnections : 10000,corePoolSize : 0,maximumPoolSize : 2147483647,maxThreadIdleTime : 5,sizeOfQueue : -1,fairnessPolicy : false,useRetries : false,
[junit4] 2> 288600 INFO (TEST-CloudMLTQParserTest.testInvalidDocument-seed#[8F9289AE236EA803]) [ ] o.a.s.u.UpdateShardHandler Creating UpdateShardHandler HTTP client with params: socketTimeout=340000&connTimeout=45000&retry=true
[junit4] 2> 288602 INFO (TEST-CloudMLTQParserTest.testInvalidDocument-seed#[8F9289AE236EA803]) [ ] o.a.s.l.LogWatcher SLF4J impl is org.slf4j.impl.Log4jLoggerFactory
[junit4] 2> 288602 INFO (TEST-CloudMLTQParserTest.testInvalidDocument-seed#[8F9289AE236EA803]) [ ] o.a.s.l.LogWatcher Registering Log Listener [Log4j (org.slf4j.impl.Log4jLoggerFactory)]
[junit4] 2> 288603 INFO (TEST-CloudMLTQParserTest.testInvalidDocument-seed#[8F9289AE236EA803]) [ ] o.a.s.c.ZkContainer Zookeeper client=127.0.0.1:63060/solr
[junit4] 2> 288603 INFO (TEST-CloudMLTQParserTest.testInvalidDocument-seed#[8F9289AE236EA803]) [ ] o.a.s.c.ZkController zkHost includes chroot
[junit4] 2> 289681 INFO (TEST-CloudMLTQParserTest.testInvalidDocument-seed#[8F9289AE236EA803]) [n:127.0.0.1:63079_r_h ] o.a.s.c.ZkController Register node as live in ZooKeeper:/live_nodes/127.0.0.1:63079_r_h
[junit4] 2> 289687 INFO (TEST-CloudMLTQParserTest.testInvalidDocument-seed#[8F9289AE236EA803]) [n:127.0.0.1:63079_r_h ] o.a.s.c.Overseer Overseer (id=null) closing
[junit4] 2> 289690 INFO (TEST-CloudMLTQParserTest.testInvalidDocument-seed#[8F9289AE236EA803]) [n:127.0.0.1:63079_r_h ] o.a.s.c.CoreContainer No authentication plugin used.
[junit4] 2> 289691 INFO (TEST-CloudMLTQParserTest.testInvalidDocument-seed#[8F9289AE236EA803]) [n:127.0.0.1:63079_r_h ] o.a.s.c.CoreContainer Security conf doesn't exist. Skipping setup for authorization module.
[junit4] 2> 289694 INFO (TEST-CloudMLTQParserTest.testInvalidDocument-seed#[8F9289AE236EA803]) [n:127.0.0.1:63079_r_h ] o.a.s.c.CoresLocator Looking for core definitions underneath C:\Users\JenkinsSlave\workspace\Lucene-Solr-5.x-Windows\solr\build\solr-core\test\J1\temp\solr.search.mlt.CloudMLTQParserTest_8F9289AE236EA803-001\shard-1-001\cores
[junit4] 2> 289696 INFO (TEST-CloudMLTQParserTest.testInvalidDocument-seed#[8F9289AE236EA803]) [n:127.0.0.1:63079_r_h ] o.a.s.c.SolrCore Created CoreDescriptor: {collection=collection1, loadOnStartup=true, coreNodeName=, transient=false, shard=, absoluteInstDir=C:\Users\JenkinsSlave\workspace\Lucene-Solr-5.x-Windows\solr\build\solr-core\test\J1\temp\solr.search.mlt.CloudMLTQParserTest_8F9289AE236EA803-001\shard-1-001\cores\collection1\, config=solrconfig.xml, instanceDir=C:\Users\JenkinsSlave\workspace\Lucene-Solr-5.x-Windows\solr\build\solr-core\test\J1\temp\solr.search.mlt.CloudMLTQParserTest_8F9289AE236EA803-001\shard-1-001\cores\collection1, dataDir=data\, name=collection1, schema=schema.xml}
[junit4] 2> 289696 INFO (TEST-CloudMLTQParserTest.testInvalidDocument-seed#[8F9289AE236EA803]) [n:127.0.0.1:63079_r_h ] o.a.s.c.CoresLocator Found core collection1 in C:\Users\JenkinsSlave\workspace\Lucene-Solr-5.x-Windows\solr\build\solr-core\test\J1\temp\solr.search.mlt.CloudMLTQParserTest_8F9289AE236EA803-001\shard-1-001\cores\collection1\
[junit4] 2> 289696 INFO (TEST-CloudMLTQParserTest.testInvalidDocument-seed#[8F9289AE236EA803]) [n:127.0.0.1:63079_r_h ] o.a.s.c.CoresLocator Found 1 core definitions
[junit4] 2> 289698 INFO (coreLoadExecutor-601-thread-1-processing-n:127.0.0.1:63079_r_h) [n:127.0.0.1:63079_r_h c:collection1 x:collection1] o.a.s.c.ZkController publishing state=down
[junit4] 2> 289699 INFO (coreLoadExecutor-601-thread-1-processing-n:127.0.0.1:63079_r_h) [n:127.0.0.1:63079_r_h c:collection1 x:collection1] o.a.s.c.ZkController numShards not found on descriptor - reading it from system property
[junit4] 2> 289700 INFO (TEST-CloudMLTQParserTest.testInvalidDocument-seed#[8F9289AE236EA803]) [n:127.0.0.1:63079_r_h ] o.a.s.s.SolrDispatchFilter user.dir=C:\Users\JenkinsSlave\workspace\Lucene-Solr-5.x-Windows\solr\build\solr-core\test\J1
[junit4] 2> 289700 INFO (TEST-CloudMLTQParserTest.testInvalidDocument-seed#[8F9289AE236EA803]) [n:127.0.0.1:63079_r_h ] o.a.s.s.SolrDispatchFilter SolrDispatchFilter.init() done
[junit4] 2> 289700 INFO (coreLoadExecutor-601-thread-1-processing-n:127.0.0.1:63079_r_h) [n:127.0.0.1:63079_r_h c:collection1 x:collection1] o.a.s.c.ZkController look for our core node name
[junit4] 2> 289700 INFO (zkCallback-195-thread-1-processing-n:127.0.0.1:63067_r_h) [n:127.0.0.1:63067_r_h ] o.a.s.c.DistributedQueue NodeChildrenChanged fired on path /overseer/queue state SyncConnected
[junit4] 2> 289702 INFO (OverseerStateUpdate-93981479496122371-127.0.0.1:63067_r_h-n_0000000000) [n:127.0.0.1:63067_r_h ] o.a.s.c.Overseer processMessage: queueSize: 1, message = {
[junit4] 2> "collection":"collection1",
[junit4] 2> "roles":null,
[junit4] 2> "state":"down",
[junit4] 2> "shard":null,
[junit4] 2> "numShards":"2",
[junit4] 2> "node_name":"127.0.0.1:63079_r_h",
[junit4] 2> "base_url":"http://127.0.0.1:63079/r_h",
[junit4] 2> "operation":"state",
[junit4] 2> "core":"collection1"} current state version: 4
[junit4] 2> 289703 INFO (OverseerStateUpdate-93981479496122371-127.0.0.1:63067_r_h-n_0000000000) [n:127.0.0.1:63067_r_h ] o.a.s.c.o.ReplicaMutator Update state numShards=2 message={
[junit4] 2> "collection":"collection1",
[junit4] 2> "roles":null,
[junit4] 2> "state":"down",
[junit4] 2> "shard":null,
[junit4] 2> "numShards":"2",
[junit4] 2> "node_name":"127.0.0.1:63079_r_h",
[junit4] 2> "base_url":"http://127.0.0.1:63079/r_h",
[junit4] 2> "operation":"state",
[junit4] 2> "core":"collection1"}
[junit4] 2> 289703 INFO (OverseerStateUpdate-93981479496122371-127.0.0.1:63067_r_h-n_0000000000) [n:127.0.0.1:63067_r_h ] o.a.s.c.o.ClusterStateMutator building a new cName: collection1
[junit4] 2> 289703 INFO (OverseerStateUpdate-93981479496122371-127.0.0.1:63067_r_h-n_0000000000) [n:127.0.0.1:63067_r_h ] o.a.s.c.o.ReplicaMutator Assigning new node to shard shard=shard1
[junit4] 2> 290752 INFO (coreLoadExecutor-601-thread-1-processing-n:127.0.0.1:63079_r_h) [n:127.0.0.1:63079_r_h c:collection1 x:collection1] o.a.s.c.ZkController waiting to find shard id in clusterstate for collection1
[junit4] 2> 290752 INFO (coreLoadExecutor-601-thread-1-processing-n:127.0.0.1:63079_r_h) [n:127.0.0.1:63079_r_h c:collection1 x:collection1] o.a.s.c.ZkController Check for collection zkNode:collection1
[junit4] 2> 290754 INFO (coreLoadExecutor-601-thread-1-processing-n:127.0.0.1:63079_r_h) [n:127.0.0.1:63079_r_h c:collection1 x:collection1] o.a.s.c.ZkController Collection zkNode exists
[junit4] 2> 290755 INFO (coreLoadExecutor-601-thread-1-processing-n:127.0.0.1:63079_r_h) [n:127.0.0.1:63079_r_h c:collection1 x:collection1] o.a.s.c.SolrResourceLoader new SolrResourceLoader for directory: 'C:\Users\JenkinsSlave\workspace\Lucene-Solr-5.x-Windows\solr\build\solr-core\test\J1\temp\solr.search.mlt.CloudMLTQParserTest_8F9289AE236EA803-001\shard-1-001\cores\collection1\'
[junit4] 2> 290780 INFO (coreLoadExecutor-601-thread-1-processing-n:127.0.0.1:63079_r_h) [n:127.0.0.1:63079_r_h c:collection1 x:collection1] o.a.s.c.Config loaded config solrconfig.xml with version 0
[junit4] 2> 290793 INFO (coreLoadExecutor-601-thread-1-processing-n:127.0.0.1:63079_r_h) [n:127.0.0.1:63079_r_h c:collection1 x:collection1] o.a.s.c.SolrConfig current version of requestparams : -1
[junit4] 2> 290842 INFO (coreLoadExecutor-601-thread-1-processing-n:127.0.0.1:63079_r_h) [n:127.0.0.1:63079_r_h c:collection1 x:collection1] o.a.s.c.SolrConfig Using Lucene MatchVersion: 5.3.0
[junit4] 2> 290925 INFO (coreLoadExecutor-601-thread-1-processing-n:127.0.0.1:63079_r_h) [n:127.0.0.1:63079_r_h c:collection1 x:collection1] o.a.s.c.Config Loaded SolrConfig: solrconfig.xml
[junit4] 2> 290927 INFO (coreLoadExecutor-601-thread-1-processing-n:127.0.0.1:63079_r_h) [n:127.0.0.1:63079_r_h c:collection1 x:collection1] o.a.s.s.IndexSchema Reading Solr Schema from /configs/conf1/schema.xml
[junit4] 2> 290942 INFO (coreLoadExecutor-601-thread-1-processing-n:127.0.0.1:63079_r_h) [n:127.0.0.1:63079_r_h c:collection1 x:collection1] o.a.s.s.IndexSchema [collection1] Schema name=test
[junit4] 2> 291458 INFO (coreLoadExecutor-601-thread-1-processing-n:127.0.0.1:63079_r_h) [n:127.0.0.1:63079_r_h c:collection1 x:collection1] o.a.s.s.OpenExchangeRatesOrgProvider Initialized with rates=open-exchange-rates.json, refreshInterval=1440.
[junit4] 2> 291470 INFO (coreLoadExecutor-601-thread-1-processing-n:127.0.0.1:63079_r_h) [n:127.0.0.1:63079_r_h c:collection1 x:collection1] o.a.s.s.IndexSchema default search field in schema is text
[junit4] 2> 291473 INFO (coreLoadExecutor-601-thread-1-processing-n:127.0.0.1:63079_r_h) [n:127.0.0.1:63079_r_h c:collection1 x:collection1] o.a.s.s.IndexSchema unique key field: id
[junit4] 2> 291487 INFO (coreLoadExecutor-601-thread-1-processing-n:127.0.0.1:63079_r_h) [n:127.0.0.1:63079_r_h c:collection1 x:collection1] o.a.s.s.FileExchangeRateProvider Reloading exchange rates from file currency.xml
[junit4] 2> 291492 INFO (coreLoadExecutor-601-thread-1-processing-n:127.0.0.1:63079_r_h) [n:127.0.0.1:63079_r_h c:collection1 x:collection1] o.a.s.s.FileExchangeRateProvider Reloading exchange rates from file currency.xml
[junit4] 2> 291498 INFO (coreLoadExecutor-601-thread-1-processing-n:127.0.0.1:63079_r_h) [n:127.0.0.1:63079_r_h c:collection1 x:collection1] o.a.s.s.OpenExchangeRatesOrgProvider Reloading exchange rates from open-exchange-rates.json
[junit4] 2> 291499 WARN (coreLoadExecutor-601-thread-1-processing-n:127.0.0.1:63079_r_h) [n:127.0.0.1:63079_r_h c:collection1 x:collection1] o.a.s.s.OpenExchangeRatesOrgProvider Unknown key IMPORTANT NOTE
[junit4] 2> 291499 WARN (coreLoadExecutor-601-thread-1-processing-n:127.0.0.1:63079_r_h) [n:127.0.0.1:63079_r_h c:collection1 x:collection1] o.a.s.s.OpenExchangeRatesOrgProvider Expected key, got STRING
[junit4] 2> 291499 INFO (coreLoadExecutor-601-thread-1-processing-n:127.0.0.1:63079_r_h) [n:127.0.0.1:63079_r_h c:collection1 x:collection1] o.a.s.s.OpenExchangeRatesOrgProvider Reloading exchange rates from open-exchange-rates.json
[junit4] 2> 291501 WARN (coreLoadExecutor-601-thread-1-processing-n:127.0.0.1:63079_r_h) [n:127.0.0.1:63079_r_h c:collection1 x:collection1] o.a.s.s.OpenExchangeRatesOrgProvider Unknown key IMPORTANT NOTE
[junit4] 2> 291501 WARN (coreLoadExecutor-601-thread-1-processing-n:127.0.0.1:63079_r_h) [n:127.0.0.1:63079_r_h c:collection1 x:collection1] o.a.s.s.OpenExchangeRatesOrgProvider Expected key, got STRING
[junit4] 2> 291501 INFO (coreLoadExecutor-601-thread-1-processing-n:127.0.0.1:63079_r_h) [n:127.0.0.1:63079_r_h c:collection1 x:collection1] o.a.s.c.CoreContainer Creating SolrCore 'collection1' using configuration from collection collection1
[junit4] 2> 291501 INFO (coreLoadExecutor-601-thread-1-processing-n:127.0.0.1:63079_r_h) [n:127.0.0.1:63079_r_h c:collection1 s:shard1 r:core_node1 x:collection1] o.a.s.c.SolrCore org.apache.solr.core.MockDirectoryFactory
[junit4] 2> 291501 INFO (coreLoadExecutor-601-thread-1-processing-n:127.0.0.1:63079_r_h) [n:127.0.0.1:63079_r_h c:collection1 s:shard1 r:core_node1 x:collection1] o.a.s.c.SolrCore [[collection1] ] Opening new SolrCore at [C:\Users\JenkinsSlave\workspace\Lucene-Solr-5.x-Windows\solr\build\solr-core\test\J1\temp\solr.search.mlt.CloudMLTQParserTest_8F9289AE236EA803-001\shard-1-001\cores\collection1\], dataDir=[null]
[junit4] 2> 291501 INFO (coreLoadExecutor-601-thread-1-processing-n:127.0.0.1:63079_r_h) [n:127.0.0.1:63079_r_h c:collection1 s:shard1 r:core_node1 x:collection1] o.a.s.c.JmxMonitoredMap JMX monitoring is enabled. Adding Solr mbeans to JMX Server: com.sun.jmx.mbeanserver.JmxMBeanServer@cd47cb
[junit4] 2> 291502 INFO (coreLoadExecutor-601-thread-1-processing-n:127.0.0.1:63079_r_h) [n:127.0.0.1:63079_r_h c:collection1 s:shard1 r:core_node1 x:collection1] o.a.s.c.CachingDirectoryFactory return new directory for C:\Users\JenkinsSlave\workspace\Lucene-Solr-5.x-Windows\solr\build\solr-core\test\J1\temp\solr.search.mlt.CloudMLTQParserTest_8F9289AE236EA803-001\shard-1-001\cores\collection1\data\
[junit4] 2> 291502 INFO (coreLoadExecutor-601-thread-1-processing-n:127.0.0.1:63079_r_h) [n:127.0.0.1:63079_r_h c:collection1 s:shard1 r:core_node1 x:collection1] o.a.s.c.SolrCore New index directory detected: old=null new=C:\Users\JenkinsSlave\workspace\Lucene-Solr-5.x-Windows\solr\build\solr-core\test\J1\temp\solr.search.mlt.CloudMLTQParserTest_8F9289AE236EA803-001\shard-1-001\cores\collection1\data\index/
[junit4] 2> 291502 WARN (coreLoadExecutor-601-thread-1-processing-n:127.0.0.1:63079_r_h) [n:127.0.0.1:63079_r_h c:collection1 s:shard1 r:core_node1 x:collection1] o.a.s.c.SolrCore [collection1] Solr index directory 'C:\Users\JenkinsSlave\workspace\Lucene-Solr-5.x-Windows\solr\build\solr-core\test\J1\temp\solr.search.mlt.CloudMLTQParserTest_8F9289AE236EA803-001\shard-1-001\cores\collection1\data\index' doesn't exist. Creating new index...
[junit4] 2> 291503 INFO (coreLoadExecutor-601-thread-1-processing-n:127.0.0.1:63079_r_h) [n:127.0.0.1:63079_r_h c:collection1 s:shard1 r:core_node1 x:collection1] o.a.s.c.CachingDirectoryFactory return new directory for C:\Users\JenkinsSlave\workspace\Lucene-Solr-5.x-Windows\solr\build\solr-core\test\J1\temp\solr.search.mlt.CloudMLTQParserTest_8F9289AE236EA803-001\shard-1-001\cores\collection1\data\index
[junit4] 2> 291503 INFO (coreLoadExecutor-601-thread-1-processing-n:127.0.0.1:63079_r_h) [n:127.0.0.1:63079_r_h c:collection1 s:shard1 r:core_node1 x:collection1] o.a.s.u.RandomMergePolicy RandomMergePolicy wrapping class org.apache.lucene.index.LogDocMergePolicy: [LogDocMergePolicy: minMergeSize=1000, mergeFactor=23, maxMergeSize=9223372036854775807, maxMergeSizeForForcedMerge=9223372036854775807, calibrateSizeByDeletes=true, maxMergeDocs=2147483647, maxCFSSegmentSizeMB=8.796093022207999E12, noCFSRatio=0.7135984129163875]
[junit4] 2> 291504 INFO (coreLoadExecutor-601-thread-1-processing-n:127.0.0.1:63079_r_h) [n:127.0.0.1:63079_r_h c:collection1 s:shard1 r:core_node1 x:collection1] o.a.s.c.SolrCore SolrDeletionPolicy.onCommit: commits: num=1
[junit4] 2> commit{dir=MockDirectoryWrapper(RAMDirectory@2768f9 lockFactory=org.apache.lucene.store.SingleInstanceLockFactory@15cb8a4),segFN=segments_1,generation=1}
[junit4] 2> 291504 INFO (coreLoadExecutor-601-thread-1-processing-n:127.0.0.1:63079_r_h) [n:127.0.0.1:63079_r_h c:collection1 s:shard1 r:core_node1 x:collection1] o.a.s.c.SolrCore newest commit generation = 1
[junit4] 2> 291505 INFO (OldIndexDirectoryCleanupThreadForCore-collection1) [n:127.0.0.1:63079_r_h c:collection1 s:shard1 r:core_node1 x:collection1] o.a.s.c.SolrCore Looking for old index directories to cleanup for core collection1 in C:\Users\JenkinsSlave\workspace\Lucene-Solr-5.x-Windows\solr\build\solr-core\test\J1\temp\solr.search.mlt.CloudMLTQParserTest_8F9289AE236EA803-001\shard-1-001\cores\collection1\data\
[junit4] 2> 291506 WARN (OldIndexDirectoryCleanupThreadForCore-collection1) [n:127.0.0.1:63079_r_h c:collection1 s:shard1 r:core_node1 x:collection1] o.a.s.c.DirectoryFactory C:\Users\JenkinsSlave\workspace\Lucene-Solr-5.x-Windows\solr\build\solr-core\test\J1\temp\solr.search.mlt.CloudMLTQParserTest_8F9289AE236EA803-001\shard-1-001\cores\collection1\data\ does not point to a valid data directory; skipping clean-up of old index directories.
[junit4] 2> 291510 INFO (coreLoadExecutor-601-thread-1-processing-n:127.0.0.1:63079_r_h) [n:127.0.0.1:63079_r_h c:collection1 s:shard1 r:core_node1 x:collection1] o.a.s.u.p.UpdateRequestProcessorChain creating updateRequestProcessorChain "dedupe"
[junit4] 2> 291511 INFO (coreLoadExecutor-601-thread-1-processing-n:127.0.0.1:63079_r_h) [n:127.0.0.1:63079_r_h c:collection1 s:shard1 r:core_node1 x:collection1] o.a.s.u.p.UpdateRequestProcessorChain inserting DistributedUpdateProcessorFactory into updateRequestProcessorChain "dedupe"
[junit4] 2> 291511 INFO (coreLoadExecutor-601-thread-1-processing-n:127.0.0.1:63079_r_h) [n:127.0.0.1:63079_r_h c:collection1 s:shard1 r:core_node1 x:collection1] o.a.s.u.p.UpdateRequestProcessorChain creating updateRequestProcessorChain "dedupe-allfields"
[junit4] 2> 291511 INFO (coreLoadExecutor-601-thread-1-processing-n:127.0.0.1:63079_r_h) [n:127.0.0.1:63079_r_h c:collection1 s:shard1 r:core_node1 x:collection1] o.a.s.u.p.UpdateRequestProcessorChain inserting DistributedUpdateProcessorFactory into updateRequestProcessorChain "dedupe-allfields"
[junit4] 2> 291511 INFO (coreLoadExecutor-601-thread-1-processing-n:127.0.0.1:63079_r_h) [n:127.0.0.1:63079_r_h c:collection1 s:shard1 r:core_node1 x:collection1] o.a.s.u.p.UpdateRequestProcessorChain creating updateRequestProcessorChain "stored_sig"
[junit4] 2> 291511 INFO (coreLoadExecutor-601-thread-1-processing-n:127.0.0.1:63079_r_h) [n:127.0.0.1:63079_r_h c:collection1 s:shard1 r:core_node1 x:collection1] o.a.s.u.p.UpdateRequestProcessorChain inserting DistributedUpdateProcessorFactory into updateRequestProcessorChain "stored_sig"
[junit4] 2> 291511 INFO (coreLoadExecutor-601-thread-1-processing-n:127.0.0.1:63079_r_h) [n:127.0.0.1:63079_r_h c:collection1 s:shard1 r:core_node1 x:collection1] o.a.s.u.p.UpdateRequestProcessorChain creating updateRequestProcessorChain "uniq-fields"
[junit4] 2> 291512 INFO (coreLoadExecutor-601-thread-1-processing-n:127.0.0.1:63079_r_h) [n:127.0.0.1:63079_r_h c:collection1 s:shard1 r:core_node1 x:collection1] o.a.s.u.p.UpdateRequestProcessorChain inserting DistributedUpdateProcessorFactory into updateRequestProcessorChain "uniq-fields"
[junit4] 2> 291512 INFO (coreLoadExecutor-601-thread-1-processing-n:127.0.0.1:63079_r_h) [n:127.0.0.1:63079_r_h c:collection1 s:shard1 r:core_node1 x:collection1] o.a.s.u.p.UpdateRequestProcessorChain creating updateRequestProcessorChain "distrib-dup-test-chain-explicit"
[junit4] 2> 291512 INFO (coreLoadExecutor-601-thread-1-processing-n:127.0.0.1:63079_r_h) [n:127.0.0.1:63079_r_h c:collection1 s:shard1 r:core_node1 x:collection1] o.a.s.u.p.UpdateRequestProcessorChain creating updateRequestProcessorChain "distrib-dup-test-chain-implicit"
[junit4] 2> 291513 INFO (coreLoadExecutor-601-thread-1-processing-n:127.0.0.1:63079_r_h) [n:127.0.0.1:63079_r_h c:collection1 s:shard1 r:core_node1 x:collection1] o.a.s.u.p.UpdateRequestProcessorChain inserting DistributedUpdateProcessorFactory into updateRequestProcessorChain "distrib-dup-test-chain-implicit"
[junit4] 2> 291513 INFO (coreLoadExecutor-601-thread-1-processing-n:127.0.0.1:63079_r_h) [n:127.0.0.1:63079_r_h c:collection1 s:shard1 r:core_node1 x:collection1] o.a.s.c.SolrCore no updateRequestProcessorChain defined as default, creating implicit default
[junit4] 2> 291523 INFO (coreLoadExecutor-601-thread-1-processing-n:127.0.0.1:63079_r_h) [n:127.0.0.1:63079_r_h c:collection1 s:shard1 r:core_node1 x:collection1] o.a.s.h.l.XMLLoader xsltCacheLifetimeSeconds=60
[junit4] 2> 291525 INFO (coreLoadExecutor-601-thread-1-processing-n:127.0.0.1:63079_r_h) [n:127.0.0.1:63079_r_h c:collection1 s:shard1 r:core_node1 x:collection1] o.a.s.h.l.XMLLoader xsltCacheLifetimeSeconds=60
[junit4] 2> 291527 INFO (coreLoadExecutor-601-thread-1-processing-n:127.0.0.1:63079_r_h) [n:127.0.0.1:63079_r_h c:collection1 s:shard1 r:core_node1 x:collection1] o.a.s.h.l.XMLLoader xsltCacheLifetimeSeconds=60
[junit4] 2> 291530 INFO (coreLoadExecutor-601-thread-1-processing-n:127.0.0.1:63079_r_h) [n:127.0.0.1:63079_r_h c:collection1 s:shard1 r:core_node1 x:collection1] o.a.s.h.l.XMLLoader xsltCacheLifetimeSeconds=60
[junit4] 2> 291547 INFO (coreLoadExecutor-601-thread-1-processing-n:127.0.0.1:63079_r_h) [n:127.0.0.1:63079_r_h c:collection1 s:shard1 r:core_node1 x:collection1] o.a.s.c.PluginBag requestHandler : 'lazy' created with startup=lazy
[junit4] 2> 291552 INFO (coreLoadExecutor-601-thread-1-processing-n:127.0.0.1:63079_r_h) [n:127.0.0.1:63079_r_h c:collection1 s:shard1 r:core_node1 x:collection1] o.a.s.c.RequestHandlers Registered paths: mock,/config,/admin/system,mltrh,standard,/admin/mbeans,/schema,/update/json/docs,/admin/ping,lazy,/admin/logging,/search-facet-invariants,/admin/plugins,/admin/file,/admin/segments,/debug/dump,/admin/luke,/update,/update/csv,spellCheckCompRH1,spellCheckCompRH,spellCheckWithWordbreak_Direct,spellCheckWithWordbreak,/replication,spellCheckCompRH_Direct,dismax,/get,/update/json,tvrh,/admin/threads,/search-facet-def,/terms,/admin/properties,/mlt,defaults
[junit4] 2> 291554 WARN (coreLoadExecutor-601-thread-1-processing-n:127.0.0.1:63079_r_h) [n:127.0.0.1:63079_r_h c:collection1 s:shard1 r:core_node1 x:collection1] o.a.s.c.SolrCore solrconfig.xml uses deprecated <admin/gettableFiles>, Please update your config to use the ShowFileRequestHandler.
[junit4] 2> 291556 INFO (coreLoadExecutor-601-thread-1-processing-n:127.0.0.1:63079_r_h) [n:127.0.0.1:63079_r_h c:collection1 s:shard1 r:core_node1 x:collection1] o.a.s.c.SolrCore Using default statsCache cache: org.apache.solr.search.stats.LocalStatsCache
[junit4] 2> 291557 INFO (coreLoadExecutor-601-thread-1-processing-n:127.0.0.1:63079_r_h) [n:127.0.0.1:63079_r_h c:collection1 s:shard1 r:core_node1 x:collection1] o.a.s.u.UpdateHandler Using UpdateLog implementation: org.apache.solr.update.UpdateLog
[junit4] 2> 291557 INFO (coreLoadExecutor-601-thread-1-processing-n:127.0.0.1:63079_r_h) [n:127.0.0.1:63079_r_h c:collection1 s:shard1 r:core_node1 x:collection1] o.a.s.u.UpdateLog Initializing UpdateLog: dataDir= defaultSyncLevel=FLUSH numRecordsToKeep=100 maxNumLogsToKeep=10 numVersionBuckets=65536
[junit4] 2> 291559 INFO (coreLoadExecutor-601-thread-1-processing-n:127.0.0.1:63079_r_h) [n:127.0.0.1:63079_r_h c:collection1 s:shard1 r:core_node1 x:collection1] o.a.s.c.SolrCore Hard AutoCommit: disabled
[junit4] 2> 291559 INFO (coreLoadExecutor-601-thread-1-processing-n:127.0.0.1:63079_r_h) [n:127.0.0.1:63079_r_h c:collection1 s:shard1 r:core_node1 x:collection1] o.a.s.c.SolrCore Soft AutoCommit: disabled
[junit4] 2> 291560 INFO (coreLoadExecutor-601-thread-1-processing-n:127.0.0.1:63079_r_h) [n:127.0.0.1:63079_r_h c:collection1 s:shard1 r:core_node1 x:collection1] o.a.s.u.RandomMergePolicy RandomMergePolicy wrapping class org.apache.lucene.index.LogDocMergePolicy: [LogDocMergePolicy: minMergeSize=1000, mergeFactor=31, maxMergeSize=9223372036854775807, maxMergeSizeForForcedMerge=9223372036854775807, calibrateSizeByDeletes=false, maxMergeDocs=2147483647, maxCFSSegmentSizeMB=8.796093022207999E12, noCFSRatio=0.6944782968138459]
[junit4] 2> 291560 INFO (coreLoadExecutor-601-thread-1-processing-n:127.0.0.1:63079_r_h) [n:127.0.0.1:63079_r_h c:collection1 s:shard1 r:core_node1 x:collection1] o.a.s.c.SolrCore SolrDeletionPolicy.onInit: commits: num=1
[junit4] 2> commit{dir=MockDirectoryWrapper(RAMDirectory@2768f9 lockFactory=org.apache.lucene.store.SingleInstanceLockFactory@15cb8a4),segFN=segments_1,generation=1}
[junit4] 2> 291561 INFO (coreLoadExecutor-601-thread-1-processing-n:127.0.0.1:63079_r_h) [n:127.0.0.1:63079_r_h c:collection1 s:shard1 r:core_node1 x:collection1] o.a.s.c.SolrCore newest commit generation = 1
[junit4] 2> 291561 INFO (coreLoadExecutor-601-thread-1-processing-n:127.0.0.1:63079_r_h) [n:127.0.0.1:63079_r_h c:collection1 s:shard1 r:core_node1 x:collection1] o.a.s.s.SolrIndexSearcher Opening Searcher@1142d9[collection1] main
[junit4] 2> 291562 INFO (coreLoadExecutor-601-thread-1-processing-n:127.0.0.1:63079_r_h) [n:127.0.0.1:63079_r_h c:collection1 s:shard1 r:core_node1 x:collection1] o.a.s.r.RestManager Initializing RestManager with initArgs: {storageIO=org.apache.solr.rest.ManagedResourceStorage$InMemoryStorageIO}
[junit4] 2> 291562 INFO (coreLoadExecutor-601-thread-1-processing-n:127.0.0.1:63079_r_h) [n:127.0.0.1:63079_r_h c:collection1 s:shard1 r:core_node1 x:collection1] o.a.s.r.ManagedResourceStorage Reading _rest_managed.json using InMemoryStorage
[junit4] 2> 291562 INFO (coreLoadExecutor-601-thread-1-processing-n:127.0.0.1:63079_r_h) [n:127.0.0.1:63079_r_h c:collection1 s:shard1 r:core_node1 x:collection1] o.a.s.r.RestManager Initializing 0 registered ManagedResources
[junit4] 2> 291563 INFO (coreLoadExecutor-601-thread-1-processing-n:127.0.0.1:63079_r_h) [n:127.0.0.1:63079_r_h c:collection1 s:shard1 r:core_node1 x:collection1] o.a.s.h.c.SpellCheckComponent Initializing spell checkers
[junit4] 2> 291581 INFO (coreLoadExecutor-601-thread-1-processing-n:127.0.0.1:63079_r_h) [n:127.0.0.1:63079_r_h c:collection1 s:shard1 r:core_node1 x:collection1] o.a.s.s.DirectSolrSpellChecker init: {name=direct,classname=DirectSolrSpellChecker,field=lowerfilt,minQueryLength=3}
[junit4] 2> 291623 INFO (coreLoadExecutor-601-thread-1-processing-n:127.0.0.1:63079_r_h) [n:127.0.0.1:63079_r_h c:collection1 s:shard1 r:core_node1 x:collection1] o.a.s.h.ReplicationHandler Commits will be reserved for 10000
[junit4] 2> 291623 INFO (searcherExecutor-602-thread-1-processing-c:collection1 s:shard1 r:core_node1 n:127.0.0.1:63079_r_h x:collection1) [n:127.0.0.1:63079_r_h c:collection1 s:shard1 r:core_node1 x:collection1] o.a.s.h.c.SpellCheckComponent Loading spell index for spellchecker: default
[junit4] 2> 291624 INFO (searcherExecutor-602-thread-1-processing-c:collection1 s:shard1 r:core_node1 n:127.0.0.1:63079_r_h x:collection1) [n:127.0.0.1:63079_r_h c:collection1 s:shard1 r:core_node1 x:collection1] o.a.s.h.c.SpellCheckComponent Loading spell index for spellchecker: direct
[junit4] 2> 291624 INFO (searcherExecutor-602-thread-1-processing-c:collection1 s:shard1 r:core_node1 n:127.0.0.1:63079_r_h x:collection1) [n:127.0.0.1:63079_r_h c:collection1 s:shard1 r:core_node1 x:collection1] o.a.s.h.c.SpellCheckComponent Loading spell index for spellchecker: wordbreak
[junit4] 2> 291624 INFO (searcherExecutor-602-thread-1-processing-c:collection1 s:shard1 r:core_node1 n:127.0.0.1:63079_r_h x:collection1) [n:127.0.0.1:63079_r_h c:collection1 s:shard1 r:core_node1 x:collection1] o.a.s.h.c.SpellCheckComponent Loading spell index for spellchecker: multipleFields
[junit4] 2> 291624 INFO (coreLoadExecutor-601-thread-1-processing-n:127.0.0.1:63079_r_h) [n:127.0.0.1:63079_r_h c:collection1 s:shard1 r:core_node1 x:collection1] o.a.s.u.UpdateLog Looking up max value of version field to seed version buckets
[junit4] 2> 291624 INFO (coreLoadExecutor-601-thread-1-processing-n:127.0.0.1:63079_r_h) [n:127.0.0.1:63079_r_h c:collection1 s:shard1 r:core_node1 x:collection1] o.a.s.u.VersionInfo Refreshing highest value of _version_ for 65536 version buckets from index
[junit4] 2> 291624 INFO (coreLoadExecutor-601-thread-1-processing-n:127.0.0.1:63079_r_h) [n:127.0.0.1:63079_r_h c:collection1 s:shard1 r:core_node1 x:collection1] o.a.s.u.VersionInfo No terms found for _version_, cannot seed version bucket highest value from index
[junit4] 2> 291624 INFO (coreLoadExecutor-601-thread-1-processing-n:127.0.0.1:63079_r_h) [n:127.0.0.1:63079_r_h c:collection1 s:shard1 r:core_node1 x:collection1] o.a.s.u.UpdateLog Could not find max version in index or recent updates, using new clock 1503703678717001728
[junit4] 2> 291624 INFO (searcherExecutor-602-thread-1-processing-c:collection1 s:shard1 r:core_node1 n:127.0.0.1:63079_r_h x:collection1) [n:127.0.0.1:63079_r_h c:collection1 s:shard1 r:core_node1 x:collection1] o.a.s.h.c.SpellCheckComponent Loading spell index for spellchecker: jarowinkler
[junit4] 2> 291625 INFO (searcherExecutor-602-thread-1-processing-c:collection1 s:shard1 r:core_node1 n:127.0.0.1:63079_r_h x:collection1) [n:127.0.0.1:63079_r_h c:collection1 s:shard1 r:core_node1 x:collection1] o.a.s.h.c.SpellCheckComponent Loading spell index for spellchecker: external
[junit4] 2> 291625 INFO (searcherExecutor-602-thread-1-processing-c:collection1 s:shard1 r:core_node1 n:127.0.0.1:63079_r_h x:collection1) [n:127.0.0.1:63079_r_h c:collection1 s:shard1 r:core_node1 x:collection1] o.a.s.h.c.SpellCheckComponent Loading spell index for spellchecker: freq
[junit4] 2> 291627 INFO (searcherExecutor-602-thread-1-processing-c:collection1 s:shard1 r:core_node1 n:127.0.0.1:63079_r_h x:collection1) [n:127.0.0.1:63079_r_h c:collection1 s:shard1 r:core_node1 x:collection1] o.a.s.h.c.SpellCheckComponent Loading spell index for spellchecker: fqcn
[junit4] 2> 291627 INFO (coreLoadExecutor-601-thread-1-processing-n:127.0.0.1:63079_r_h) [n:127.0.0.1:63079_r_h c:collection1 s:shard1 r:core_node1 x:collection1] o.a.s.u.UpdateLog Took 3 ms to seed version buckets with highest version 1503703678717001728
[junit4] 2> 291627 INFO (coreLoadExecutor-601-thread-1-processing-n:127.0.0.1:63079_r_h) [n:127.0.0.1:63079_r_h c:collection1 s:shard1 r:core_node1 x:collection1] o.a.s.c.ZkController watch zkdir /configs/conf1
[junit4] 2> 291627 INFO (searcherExecutor-602-thread-1-processing-c:collection1 s:shard1 r:core_node1 n:127.0.0.1:63079_r_h x:collection1) [n:127.0.0.1:63079_r_h c:collection1 s:shard1 r:core_node1 x:collection1] o.a.s.h.c.SpellCheckComponent Loading spell index for spellchecker: perDict
[junit4] 2> 291628 INFO (coreLoadExecutor-601-thread-1-processing-n:127.0.0.1:63079_r_h) [n:127.0.0.1:63079_r_h c:collection1 s:shard1 r:core_node1 x:collection1] o.a.s.c.CoreContainer registering core: collection1
[junit4] 2> 291629 INFO (coreZkRegister-596-thread-1-processing-c:collection1 s:shard1 r:core_node1 n:127.0.0.1:63079_r_h x:collection1) [n:127.0.0.1:63079_r_h c:collection1 s:shard1 r:core_node1 x:collection1] o.a.s.c.ZkController Register replica - core:collection1 address:http://127.0.0.1:63079/r_h collection:collection1 shard:shard1
[junit4] 2> 291631 INFO (searcherExecutor-602-thread-1-processing-c:collection1 s:shard1 r:core_node1 n:127.0.0.1:63079_r_h x:collection1) [n:127.0.0.1:63079_r_h c:collection1 s:shard1 r:core_node1 x:collection1] o.a.s.c.SolrCore [collection1] Registered new searcher Searcher@1142d9[collection1] main{ExitableDirectoryReader(UninvertingDirectoryReader())}
[junit4] 2> 291639 INFO (coreZkRegister-596-thread-1-processing-c:collection1 s:shard1 r:core_node1 n:127.0.0.1:63079_r_h x:collection1) [n:127.0.0.1:63079_r_h c:collection1 s:shard1 r:core_node1 x:collection1] o.a.s.c.ShardLeaderElectionContext Running the leader process for shard shard1
[junit4] 2> 291642 INFO (zkCallback-195-thread-1-processing-n:127.0.0.1:63067_r_h) [n:127.0.0.1:63067_r_h ] o.a.s.c.DistributedQueue NodeChildrenChanged fired on path /overseer/queue state SyncConnected
[junit4] 2> 291642 INFO (coreZkRegister-596-thread-1-processing-c:collection1 s:shard1 r:core_node1 n:127.0.0.1:63079_r_h x:collection1) [n:127.0.0.1:63079_r_h c:collection1 s:shard1 r:core_node1 x:collection1] o.a.s.c.ShardLeaderElectionContext Enough replicas found to continue.
[junit4] 2> 291643 INFO (coreZkRegister-596-thread-1-processing-c:collection1 s:shard1 r:core_node1 n:127.0.0.1:63079_r_h x:collection1) [n:127.0.0.1:63079_r_h c:collection1 s:shard1 r:core_node1 x:collection1] o.a.s.c.ShardLeaderElectionContext I may be the new leader - try and sync
[junit4] 2> 291643 INFO (coreZkRegister-596-thread-1-processing-c:collection1 s:shard1 r:core_node1 n:127.0.0.1:63079_r_h x:collection1) [n:127.0.0.1:63079_r_h c:collection1 s:shard1 r:core_node1 x:collection1] o.a.s.c.SyncStrategy Sync replicas to http://127.0.0.1:63079/r_h/collection1/
[junit4] 2> 291643 INFO (coreZkRegister-596-thread-1-processing-c:collection1 s:shard1 r:core_node1 n:127.0.0.1:63079_r_h x:collection1) [n:127.0.0.1:63079_r_h c:collection1 s:shard1 r:core_node1 x:collection1] o.a.s.c.SyncStrategy Sync Success - now sync replicas to me
[junit4] 2> 291643 INFO (coreZkRegister-596-thread-1-processing-c:collection1 s:shard1 r:core_node1 n:127.0.0.1:63079_r_h x:collection1) [n:127.0.0.1:63079_r_h c:collection1 s:shard1 r:core_node1 x:collection1] o.a.s.c.SyncStrategy http://127.0.0.1:63079/r_h/collection1/ has no replicas
[junit4] 2> 291643 IN
[...truncated too long message...]
collection1"}
[junit4] 2> 338707 INFO (TEST-CloudMLTQParserTest.test-seed#[8F9289AE236EA803]) [n:127.0.0.1:63195_r_h c:collection1 s:shard2 r:core_node2 x:collection1] o.a.s.c.SolrCore [collection1] Closing main searcher on request.
[junit4] 2> 338710 INFO (OverseerStateUpdate-93981481846177801-127.0.0.1:63195_r_h-n_0000000002) [n:127.0.0.1:63195_r_h ] o.a.s.c.o.ZkStateWriter going to update_collection /collections/collection1/state.json version: 10
[junit4] 2> 338751 INFO (TEST-CloudMLTQParserTest.test-seed#[8F9289AE236EA803]) [n:127.0.0.1:63195_r_h c:collection1 s:shard2 r:core_node2 x:collection1] o.a.s.c.CachingDirectoryFactory Closing MockDirectoryFactory - 2 directories currently being tracked
[junit4] 2> 338751 INFO (TEST-CloudMLTQParserTest.test-seed#[8F9289AE236EA803]) [n:127.0.0.1:63195_r_h c:collection1 s:shard2 r:core_node2 x:collection1] o.a.s.c.CachingDirectoryFactory looking to close C:\Users\JenkinsSlave\workspace\Lucene-Solr-5.x-Windows\solr\build\solr-core\test\J1\..\..\..\..\..\..\..\..\..\Users\JenkinsSlave\workspace\Lucene-Solr-5.x-Windows\solr\build\solr-core\test\J1\temp\solr.search.mlt.CloudMLTQParserTest_8F9289AE236EA803-001\shard-2-002\cores\collection1\data\index [CachedDir<<refCount=0;path=C:\Users\JenkinsSlave\workspace\Lucene-Solr-5.x-Windows\solr\build\solr-core\test\J1\..\..\..\..\..\..\..\..\..\Users\JenkinsSlave\workspace\Lucene-Solr-5.x-Windows\solr\build\solr-core\test\J1\temp\solr.search.mlt.CloudMLTQParserTest_8F9289AE236EA803-001\shard-2-002\cores\collection1\data\index;done=false>>]
[junit4] 2> 338751 INFO (TEST-CloudMLTQParserTest.test-seed#[8F9289AE236EA803]) [n:127.0.0.1:63195_r_h c:collection1 s:shard2 r:core_node2 x:collection1] o.a.s.c.CachingDirectoryFactory Closing directory: C:\Users\JenkinsSlave\workspace\Lucene-Solr-5.x-Windows\solr\build\solr-core\test\J1\..\..\..\..\..\..\..\..\..\Users\JenkinsSlave\workspace\Lucene-Solr-5.x-Windows\solr\build\solr-core\test\J1\temp\solr.search.mlt.CloudMLTQParserTest_8F9289AE236EA803-001\shard-2-002\cores\collection1\data\index
[junit4] 2> 338751 INFO (TEST-CloudMLTQParserTest.test-seed#[8F9289AE236EA803]) [n:127.0.0.1:63195_r_h c:collection1 s:shard2 r:core_node2 x:collection1] o.a.s.c.CachingDirectoryFactory looking to close C:\Users\JenkinsSlave\workspace\Lucene-Solr-5.x-Windows\solr\build\solr-core\test\J1\..\..\..\..\..\..\..\..\..\Users\JenkinsSlave\workspace\Lucene-Solr-5.x-Windows\solr\build\solr-core\test\J1\temp\solr.search.mlt.CloudMLTQParserTest_8F9289AE236EA803-001\shard-2-002\cores\collection1\data\ [CachedDir<<refCount=0;path=C:\Users\JenkinsSlave\workspace\Lucene-Solr-5.x-Windows\solr\build\solr-core\test\J1\..\..\..\..\..\..\..\..\..\Users\JenkinsSlave\workspace\Lucene-Solr-5.x-Windows\solr\build\solr-core\test\J1\temp\solr.search.mlt.CloudMLTQParserTest_8F9289AE236EA803-001\shard-2-002\cores\collection1\data\;done=false>>]
[junit4] 2> 338752 INFO (TEST-CloudMLTQParserTest.test-seed#[8F9289AE236EA803]) [n:127.0.0.1:63195_r_h c:collection1 s:shard2 r:core_node2 x:collection1] o.a.s.c.CachingDirectoryFactory Closing directory: C:\Users\JenkinsSlave\workspace\Lucene-Solr-5.x-Windows\solr\build\solr-core\test\J1\..\..\..\..\..\..\..\..\..\Users\JenkinsSlave\workspace\Lucene-Solr-5.x-Windows\solr\build\solr-core\test\J1\temp\solr.search.mlt.CloudMLTQParserTest_8F9289AE236EA803-001\shard-2-002\cores\collection1\data\
[junit4] 2> 338754 INFO (TEST-CloudMLTQParserTest.test-seed#[8F9289AE236EA803]) [n:127.0.0.1:63195_r_h c:collection1 s:shard2 r:core_node2 x:collection1] o.a.s.c.Overseer Overseer (id=93981481846177801-127.0.0.1:63195_r_h-n_0000000002) closing
[junit4] 2> 338754 INFO (OverseerStateUpdate-93981481846177801-127.0.0.1:63195_r_h-n_0000000002) [n:127.0.0.1:63195_r_h ] o.a.s.c.Overseer Overseer Loop exiting : 127.0.0.1:63195_r_h
[junit4] 2> 338757 WARN (zkCallback-226-thread-1-processing-n:127.0.0.1:63195_r_h) [n:127.0.0.1:63195_r_h ] o.a.s.c.c.ZkStateReader ZooKeeper watch triggered, but Solr cannot talk to ZK
[junit4] 2> 338759 INFO (TEST-CloudMLTQParserTest.test-seed#[8F9289AE236EA803]) [ ] o.e.j.s.ServerConnector Stopped ServerConnector@43663c{HTTP/1.1}{127.0.0.1:0}
[junit4] 2> 338759 INFO (TEST-CloudMLTQParserTest.test-seed#[8F9289AE236EA803]) [ ] o.e.j.s.h.ContextHandler Stopped o.e.j.s.ServletContextHandler@159bbf7{/r_h,null,UNAVAILABLE}
[junit4] 2> 338762 INFO (TEST-CloudMLTQParserTest.test-seed#[8F9289AE236EA803]) [n:127.0.0.1:63195_r_h c:collection1 s:shard2 r:core_node2 x:collection1] o.a.s.c.ZkTestServer connecting to 127.0.0.1:63164 63164
[junit4] 2> 342143 INFO (Thread-523) [n:127.0.0.1:63112_r_h c:collection1 s:shard2 r:core_node4 x:collection1] o.a.s.c.ZkTestServer connecting to 127.0.0.1:63164 63164
[junit4] 2> 342156 WARN (Thread-523) [n:127.0.0.1:63112_r_h c:collection1 s:shard2 r:core_node4 x:collection1] o.a.s.c.ZkTestServer Watch limit violations:
[junit4] 2> Maximum concurrent create/delete watches above limit:
[junit4] 2>
[junit4] 2> 4 /solr/clusterstate.json
[junit4] 2> 4 /solr/aliases.json
[junit4] 2> 3 /solr/configs/conf1
[junit4] 2> 2 /solr/collections/collection1/state.json
[junit4] 2>
[junit4] 2> Maximum concurrent children watches above limit:
[junit4] 2>
[junit4] 2> 4 /solr/live_nodes
[junit4] 2> 3 /solr/overseer/collection-queue-work
[junit4] 2> 3 /solr/overseer/queue
[junit4] 2>
[junit4] 2> NOTE: reproduce with: ant test -Dtestcase=CloudMLTQParserTest -Dtests.method=test -Dtests.seed=8F9289AE236EA803 -Dtests.slow=true -Dtests.locale=fr -Dtests.timezone=Singapore -Dtests.asserts=true -Dtests.file.encoding=Cp1252
[junit4] ERROR 21.2s J1 | CloudMLTQParserTest.test <<<
[junit4] > Throwable #1: java.lang.ClassCastException: java.lang.String cannot be cast to java.util.ArrayList
[junit4] > at __randomizedtesting.SeedInfo.seed([8F9289AE236EA803:7C6B6748D92C5FB]:0)
[junit4] > at org.apache.solr.search.mlt.CloudMLTQParserTest.test(CloudMLTQParserTest.java:138)
[junit4] > at org.apache.solr.BaseDistributedSearchTestCase$ShardsRepeatRule$ShardsFixedStatement.callStatement(BaseDistributedSearchTestCase.java:960)
[junit4] > at org.apache.solr.BaseDistributedSearchTestCase$ShardsRepeatRule$ShardsStatement.evaluate(BaseDistributedSearchTestCase.java:935)
[junit4] > at java.lang.Thread.run(Thread.java:745)
[junit4] 2> 342172 INFO (SUITE-CloudMLTQParserTest-seed#[8F9289AE236EA803]-worker) [n:127.0.0.1:63195_r_h c:collection1 s:shard2 r:core_node2 x:collection1] o.a.s.SolrTestCaseJ4 ###deleteCore
[junit4] 2> NOTE: leaving temporary files on disk at: C:\Users\JenkinsSlave\workspace\Lucene-Solr-5.x-Windows\solr\build\solr-core\test\J1\temp\solr.search.mlt.CloudMLTQParserTest_8F9289AE236EA803-001
[junit4] 2> NOTE: test params are: codec=Asserting(Lucene50): {id=Lucene50(blocksize=128), range_facet_i_dv=PostingsFormat(name=Direct), multiDefault=Lucene50(blocksize=128), intDefault=PostingsFormat(name=Direct), range_facet_l=PostingsFormat(name=Direct), _version_=PostingsFormat(name=Direct), lowerfilt=Lucene50(blocksize=128), lowerfilt1and2=Lucene50(blocksize=128), timestamp=PostingsFormat(name=Direct), range_facet_l_dv=Lucene50(blocksize=128)}, docValues:{range_facet_i_dv=DocValuesFormat(name=Lucene50), timestamp=DocValuesFormat(name=Lucene50), range_facet_l_dv=DocValuesFormat(name=Direct)}, sim=DefaultSimilarity, locale=fr, timezone=Singapore
[junit4] 2> NOTE: Windows 7 6.1 x86/Oracle Corporation 1.7.0_80 (32-bit)/cpus=3,threads=1,free=61705512,total=142352384
[junit4] 2> NOTE: All tests run in this JVM: [TestDFRSimilarityFactory, LeaderFailoverAfterPartitionTest, RequestLoggingTest, TestMacros, TestQuerySenderListener, CurrencyFieldXmlFileTest, ConvertedLegacyTest, TestDynamicFieldResource, DirectSolrSpellCheckerTest, DistanceUnitsTest, TestSolr4Spatial2, TestCollapseQParserPlugin, TestRequestStatusCollectionAPI, UpdateRequestProcessorFactoryTest, XsltUpdateRequestHandlerTest, SolrCloudExampleTest, TestSolr4Spatial, RAMDirectoryFactoryTest, QueryEqualityTest, TestManagedSchemaFieldTypeResource, HdfsRecoveryZkTest, ShardRoutingCustomTest, DateFieldTest, TestUtils, TestConfig, TestMergePolicyConfig, PolyFieldTest, IndexBasedSpellCheckerTest, SpellPossibilityIteratorTest, DistributedMLTComponentTest, TestOrdValues, SignatureUpdateProcessorFactoryTest, AutoCommitTest, CloudMLTQParserTest]
[junit4] Completed [59/500] on J1 in 57.10s, 2 tests, 1 error <<< FAILURES!
[...truncated 1404 lines...]
BUILD FAILED
C:\Users\JenkinsSlave\workspace\Lucene-Solr-5.x-Windows\build.xml:536: The following error occurred while executing this line:
C:\Users\JenkinsSlave\workspace\Lucene-Solr-5.x-Windows\build.xml:484: The following error occurred while executing this line:
C:\Users\JenkinsSlave\workspace\Lucene-Solr-5.x-Windows\build.xml:61: The following error occurred while executing this line:
C:\Users\JenkinsSlave\workspace\Lucene-Solr-5.x-Windows\extra-targets.xml:39: The following error occurred while executing this line:
C:\Users\JenkinsSlave\workspace\Lucene-Solr-5.x-Windows\solr\build.xml:230: The following error occurred while executing this line:
C:\Users\JenkinsSlave\workspace\Lucene-Solr-5.x-Windows\solr\common-build.xml:511: The following error occurred while executing this line:
C:\Users\JenkinsSlave\workspace\Lucene-Solr-5.x-Windows\lucene\common-build.xml:1444: The following error occurred while executing this line:
C:\Users\JenkinsSlave\workspace\Lucene-Solr-5.x-Windows\lucene\common-build.xml:999: There were test failures: 500 suites, 1980 tests, 1 error, 68 ignored (34 assumptions)
Total time: 72 minutes 47 seconds
Build step 'Invoke Ant' marked build as failure
Archiving artifacts
Recording test results
Email was triggered for: Failure - Any
Sending email for trigger: Failure - Any