You are viewing a plain text version of this content. The canonical link for it is here.
Posted to builds@beam.apache.org by Apache Jenkins Server <je...@builds.apache.org> on 2023/02/21 13:48:40 UTC
Build failed in Jenkins: beam_LoadTests_Python_ParDo_Flink_Batch #1234
See <https://ci-beam.apache.org/job/beam_LoadTests_Python_ParDo_Flink_Batch/1234/display/redirect?page=changes>
Changes:
[noreply] [#24789][prism] Add testdofns for later (#25557)
[noreply] [#24789][prism] Minimum required jobservices (#25556)
[noreply] [#24789][prism] Handlers for combine, ParDo, GBK, Flatten (#25558)
[noreply] [prism] Tiny lint fixes (#25564)
[noreply] minor error handling fixes (#25555)
[noreply] [prism] Add in element manager (#25565)
------------------------------------------
Started by timer
Running as SYSTEM
[EnvInject] - Loading node environment variables.
Building remotely on apache-beam-jenkins-10 (beam) in workspace <https://ci-beam.apache.org/job/beam_LoadTests_Python_ParDo_Flink_Batch/ws/>
The recommended git tool is: NONE
No credentials specified
Wiping out workspace first.
Cloning the remote Git repository
Cloning repository https://github.com/apache/beam.git
> git init <https://ci-beam.apache.org/job/beam_LoadTests_Python_ParDo_Flink_Batch/ws/src> # timeout=10
Fetching upstream changes from https://github.com/apache/beam.git
> git --version # timeout=10
> git --version # 'git version 2.25.1'
> git fetch --tags --force --progress -- https://github.com/apache/beam.git +refs/heads/*:refs/remotes/origin/* # timeout=10
> git config remote.origin.url https://github.com/apache/beam.git # timeout=10
> git config --add remote.origin.fetch +refs/heads/*:refs/remotes/origin/* # timeout=10
> git config remote.origin.url https://github.com/apache/beam.git # timeout=10
Fetching upstream changes from https://github.com/apache/beam.git
> git fetch --tags --force --progress -- https://github.com/apache/beam.git +refs/heads/*:refs/remotes/origin/* +refs/pull/${ghprbPullId}/*:refs/remotes/origin/pr/${ghprbPullId}/* # timeout=10
> git rev-parse origin/master^{commit} # timeout=10
Checking out Revision 921bc7b94708391eb7d980cb8d9ed35c80d3aebb (origin/master)
> git config core.sparsecheckout # timeout=10
> git checkout -f 921bc7b94708391eb7d980cb8d9ed35c80d3aebb # timeout=10
Commit message: "[prism] Add in element manager (#25565)"
> git rev-list --no-walk 6e53f13871a0633718cda06012be2a6e94330735 # timeout=10
No emails were triggered.
[EnvInject] - Executing scripts and injecting environment variables after the SCM step.
[EnvInject] - Injecting as environment variables the properties content
SETUPTOOLS_USE_DISTUTILS=stdlib
SPARK_LOCAL_IP=127.0.0.1
[EnvInject] - Variables injected successfully.
[EnvInject] - Injecting environment variables from a build step.
[EnvInject] - Injecting as environment variables the properties content
CLUSTER_NAME=beam-loadtests-python-pardo-flink-batch-1234
FLINK_NUM_WORKERS=5
DETACHED_MODE=true
JOB_SERVER_IMAGE=gcr.io/apache-beam-testing/beam_portability/beam_flink1.15_job_server:latest
GCS_BUCKET=gs://beam-flink-cluster
HARNESS_IMAGES_TO_PULL=gcr.io/apache-beam-testing/beam_portability/beam_python3.7_sdk:latest
HADOOP_DOWNLOAD_URL=https://repo.maven.apache.org/maven2/org/apache/flink/flink-shaded-hadoop-2-uber/2.8.3-10.0/flink-shaded-hadoop-2-uber-2.8.3-10.0.jar
GCLOUD_ZONE=us-central1-a
FLINK_TASKMANAGER_SLOTS=1
FLINK_DOWNLOAD_URL=https://archive.apache.org/dist/flink/flink-1.15.0/flink-1.15.0-bin-scala_2.12.tgz
ARTIFACTS_DIR=gs://beam-flink-cluster/beam-loadtests-python-pardo-flink-batch-1234
[EnvInject] - Variables injected successfully.
[beam_LoadTests_Python_ParDo_Flink_Batch] $ /bin/bash -xe /tmp/jenkins8850988283472524826.sh
+ echo Setting up flink cluster
Setting up flink cluster
[beam_LoadTests_Python_ParDo_Flink_Batch] $ /bin/bash -xe /tmp/jenkins3487645400844078694.sh
+ cd <https://ci-beam.apache.org/job/beam_LoadTests_Python_ParDo_Flink_Batch/ws/src/.test-infra/dataproc>
+ ./flink_cluster.sh create
+ GCLOUD_ZONE=us-central1-a
+ DATAPROC_VERSION=preview-debian11
++ echo us-central1-a
++ sed -E 's/(-[a-z])?$//'
+ GCLOUD_REGION=us-central1
+ MASTER_NAME=beam-loadtests-python-pardo-flink-batch-1234-m
+ INIT_ACTIONS_FOLDER_NAME=init-actions
+ FLINK_INIT=gs://beam-flink-cluster/init-actions/flink.sh
+ BEAM_INIT=gs://beam-flink-cluster/init-actions/beam.sh
+ DOCKER_INIT=gs://beam-flink-cluster/init-actions/docker.sh
+ FLINK_LOCAL_PORT=8081
+ FLINK_TASKMANAGER_SLOTS=1
+ YARN_APPLICATION_MASTER=
+ create
+ upload_init_actions
+ echo 'Uploading initialization actions to GCS bucket: gs://beam-flink-cluster'
Uploading initialization actions to GCS bucket: gs://beam-flink-cluster
+ gsutil cp -r init-actions/beam.sh init-actions/docker.sh init-actions/flink.sh gs://beam-flink-cluster/init-actions
Copying file://init-actions/beam.sh [Content-Type=text/x-sh]...
/ [0 files][ 0.0 B/ 2.3 KiB] / [1 files][ 2.3 KiB/ 2.3 KiB] Copying file://init-actions/docker.sh [Content-Type=text/x-sh]...
/ [1 files][ 2.3 KiB/ 6.0 KiB] / [2 files][ 6.0 KiB/ 6.0 KiB] Copying file://init-actions/flink.sh [Content-Type=text/x-sh]...
/ [2 files][ 6.0 KiB/ 13.5 KiB] / [3 files][ 13.5 KiB/ 13.5 KiB] -
Operation completed over 3 objects/13.5 KiB.
+ create_cluster
+ local metadata=flink-snapshot-url=https://archive.apache.org/dist/flink/flink-1.15.0/flink-1.15.0-bin-scala_2.12.tgz,
+ metadata+=flink-start-yarn-session=true,
+ metadata+=flink-taskmanager-slots=1,
+ metadata+=hadoop-jar-url=https://repo.maven.apache.org/maven2/org/apache/flink/flink-shaded-hadoop-2-uber/2.8.3-10.0/flink-shaded-hadoop-2-uber-2.8.3-10.0.jar
+ [[ -n gcr.io/apache-beam-testing/beam_portability/beam_python3.7_sdk:latest ]]
+ metadata+=,beam-sdk-harness-images-to-pull=gcr.io/apache-beam-testing/beam_portability/beam_python3.7_sdk:latest
+ [[ -n gcr.io/apache-beam-testing/beam_portability/beam_flink1.15_job_server:latest ]]
+ metadata+=,beam-job-server-image=gcr.io/apache-beam-testing/beam_portability/beam_flink1.15_job_server:latest
+ local image_version=preview-debian11
+ echo 'Starting dataproc cluster. Dataproc version: preview-debian11'
Starting dataproc cluster. Dataproc version: preview-debian11
+ gcloud dataproc clusters create beam-loadtests-python-pardo-flink-batch-1234 --region=us-central1 --num-****s=5 --master-machine-type=n1-standard-2 --****-machine-type=n1-standard-2 --metadata flink-snapshot-url=https://archive.apache.org/dist/flink/flink-1.15.0/flink-1.15.0-bin-scala_2.12.tgz,flink-start-yarn-session=true,flink-taskmanager-slots=1,hadoop-jar-url=https://repo.maven.apache.org/maven2/org/apache/flink/flink-shaded-hadoop-2-uber/2.8.3-10.0/flink-shaded-hadoop-2-uber-2.8.3-10.0.jar,beam-sdk-harness-images-to-pull=gcr.io/apache-beam-testing/beam_portability/beam_python3.7_sdk:latest,beam-job-server-image=gcr.io/apache-beam-testing/beam_portability/beam_flink1.15_job_server:latest, --image-version=preview-debian11 --zone=us-central1-a --optional-components=FLINK,DOCKER --quiet
ERROR: (gcloud.dataproc.clusters.create) INVALID_ARGUMENT: Failed to resolve image version 'preview-debian11'. Accepted image versions: [2.0-centos, 1.5-debian10, 2.1-ubuntu, 1.5-centos8, 2.0-ubuntu18, 1.5-ubuntu18, 2.0-rocky8, 2.1-debian, 2.1-rocky8, 2.0-debian, 2.0-rocky, 2.0-debian10, 1.5-rocky, 1.5-centos, 2.1-ubuntu20, 1.4-ubuntu18, 1.5-ubuntu, 1.4-debian10, 1.3-ubuntu, 1.4-ubuntu, 2.0, 2.1, 2.1-rocky, 1.3, 1.3-debian10, 2.1-debian11, 1.4, 2.0-ubuntu, 1.5, 1.4-debian, 1.5-debian, 1.3-debian, 1.3-ubuntu18, 1.5-rocky8, 2.0-centos8]. See https://cloud.google.com/dataproc/docs/concepts/versioning/dataproc-versions for additional information on image versioning.
Build step 'Execute shell' marked build as failure
---------------------------------------------------------------------
To unsubscribe, e-mail: builds-unsubscribe@beam.apache.org
For additional commands, e-mail: builds-help@beam.apache.org
Jenkins build is back to normal : beam_LoadTests_Python_ParDo_Flink_Batch #1238
Posted by Apache Jenkins Server <je...@builds.apache.org>.
See <https://ci-beam.apache.org/job/beam_LoadTests_Python_ParDo_Flink_Batch/1238/display/redirect>
---------------------------------------------------------------------
To unsubscribe, e-mail: builds-unsubscribe@beam.apache.org
For additional commands, e-mail: builds-help@beam.apache.org
Build failed in Jenkins: beam_LoadTests_Python_ParDo_Flink_Batch #1237
Posted by Apache Jenkins Server <je...@builds.apache.org>.
See <https://ci-beam.apache.org/job/beam_LoadTests_Python_ParDo_Flink_Batch/1237/display/redirect>
Changes:
------------------------------------------
[...truncated 109.35 KB...]
Requirement already satisfied: numpy<1.25.0,>=1.14.3 in /home/jenkins/jenkins-slave/workspace/beam_LoadTests_Python_ParDo_Flink_Batch/src/build/gradleenv/1329484227/lib/python3.7/site-packages (from apache-beam==2.47.0.dev0) (1.21.6)
Collecting objsize<0.7.0,>=0.6.1
Using cached objsize-0.6.1-py3-none-any.whl (9.3 kB)
Collecting pymongo<4.0.0,>=3.8.0
Using cached pymongo-3.13.0-cp37-cp37m-manylinux_2_17_x86_64.manylinux2014_x86_64.whl (506 kB)
Collecting proto-plus<2,>=1.7.1
Using cached proto_plus-1.22.2-py3-none-any.whl (47 kB)
Collecting pydot<2,>=1.2.0
Using cached pydot-1.4.2-py2.py3-none-any.whl (21 kB)
Collecting python-dateutil<3,>=2.8.0
Using cached python_dateutil-2.8.2-py2.py3-none-any.whl (247 kB)
Collecting pytz>=2018.3
Using cached pytz-2022.7.1-py2.py3-none-any.whl (499 kB)
Collecting regex>=2020.6.8
Using cached regex-2022.10.31-cp37-cp37m-manylinux_2_17_x86_64.manylinux2014_x86_64.whl (757 kB)
Collecting requests<3.0.0,>=2.24.0
Using cached requests-2.28.2-py3-none-any.whl (62 kB)
Requirement already satisfied: typing-extensions>=3.7.0 in /home/jenkins/jenkins-slave/workspace/beam_LoadTests_Python_ParDo_Flink_Batch/src/build/gradleenv/1329484227/lib/python3.7/site-packages (from apache-beam==2.47.0.dev0) (4.5.0)
Collecting zstandard<1,>=0.18.0
Using cached zstandard-0.20.0-cp37-cp37m-manylinux_2_17_x86_64.manylinux2014_x86_64.whl (2.6 MB)
Collecting pyarrow<10.0.0,>=3.0.0
Using cached pyarrow-9.0.0-cp37-cp37m-manylinux_2_17_x86_64.manylinux2014_x86_64.whl (35.3 MB)
Collecting boto3>=1.9
Using cached boto3-1.26.78-py3-none-any.whl (132 kB)
Collecting freezegun>=0.3.12
Using cached freezegun-1.2.2-py3-none-any.whl (17 kB)
Collecting joblib>=1.0.1
Using cached joblib-1.2.0-py3-none-any.whl (297 kB)
Collecting mock<3.0.0,>=1.0.1
Using cached mock-2.0.0-py2.py3-none-any.whl (56 kB)
Collecting pandas<2.0.0
Using cached pandas-1.3.5-cp37-cp37m-manylinux_2_17_x86_64.manylinux2014_x86_64.whl (11.3 MB)
Collecting parameterized<0.9.0,>=0.7.1
Using cached parameterized-0.8.1-py2.py3-none-any.whl (26 kB)
Collecting pyhamcrest!=1.10.0,<2.0.0,>=1.9
Using cached PyHamcrest-1.10.1-py3-none-any.whl (48 kB)
Collecting pyyaml<7.0.0,>=3.12
Using cached PyYAML-6.0-cp37-cp37m-manylinux_2_5_x86_64.manylinux1_x86_64.manylinux_2_12_x86_64.manylinux2010_x86_64.whl (596 kB)
Collecting requests_mock<2.0,>=1.7
Using cached requests_mock-1.10.0-py2.py3-none-any.whl (28 kB)
Collecting tenacity<6.0,>=5.0.2
Using cached tenacity-5.1.5-py2.py3-none-any.whl (34 kB)
Collecting pytest<8.0,>=7.1.2
Using cached pytest-7.2.1-py3-none-any.whl (317 kB)
Collecting pytest-xdist<3,>=2.5.0
Using cached pytest_xdist-2.5.0-py3-none-any.whl (41 kB)
Collecting pytest-timeout<3,>=2.1.0
Using cached pytest_timeout-2.1.0-py3-none-any.whl (12 kB)
Collecting scikit-learn>=0.20.0
Using cached scikit_learn-1.0.2-cp37-cp37m-manylinux_2_17_x86_64.manylinux2014_x86_64.whl (24.8 MB)
Collecting sqlalchemy<2.0,>=1.3
Using cached SQLAlchemy-1.4.46-cp37-cp37m-manylinux_2_5_x86_64.manylinux1_x86_64.manylinux_2_17_x86_64.manylinux2014_x86_64.whl (1.6 MB)
Collecting psycopg2-binary<3.0.0,>=2.8.5
Using cached psycopg2_binary-2.9.5-cp37-cp37m-manylinux_2_17_x86_64.manylinux2014_x86_64.whl (3.0 MB)
Collecting testcontainers[mysql]<4.0.0,>=3.0.3
Using cached testcontainers-3.7.1-py2.py3-none-any.whl (45 kB)
Collecting cryptography>=36.0.0
Using cached cryptography-39.0.1-cp36-abi3-manylinux_2_28_x86_64.whl (4.2 MB)
Collecting hypothesis<=7.0.0,>5.0.0
Using cached hypothesis-6.68.2-py3-none-any.whl (402 kB)
Collecting azure-storage-blob>=12.3.2
Using cached azure_storage_blob-12.15.0-py3-none-any.whl (387 kB)
Collecting azure-core>=1.7.0
Using cached azure_core-1.26.3-py3-none-any.whl (174 kB)
Collecting azure-identity>=1.12.0
Using cached azure_identity-1.12.0-py3-none-any.whl (135 kB)
Collecting cachetools<5,>=3.1.0
Using cached cachetools-4.2.4-py3-none-any.whl (10 kB)
Collecting google-apitools<0.5.32,>=0.5.31
Using cached google_apitools-0.5.31-py3-none-any.whl
Collecting google-auth<3,>=1.18.0
Using cached google_auth-2.16.1-py2.py3-none-any.whl (177 kB)
Collecting google-auth-httplib2<0.2.0,>=0.1.0
Using cached google_auth_httplib2-0.1.0-py2.py3-none-any.whl (9.3 kB)
Collecting google-cloud-datastore<2,>=1.8.0
Using cached google_cloud_datastore-1.15.5-py2.py3-none-any.whl (134 kB)
Collecting google-cloud-pubsub<3,>=2.1.0
Using cached google_cloud_pubsub-2.15.0-py2.py3-none-any.whl (242 kB)
Collecting google-cloud-pubsublite<2,>=1.2.0
Using cached google_cloud_pubsublite-1.7.0-py2.py3-none-any.whl (273 kB)
Collecting google-cloud-bigquery<4,>=1.6.0
Using cached google_cloud_bigquery-3.6.0-py2.py3-none-any.whl (215 kB)
Collecting google-cloud-bigquery-storage<2.17,>=2.6.3
Using cached google_cloud_bigquery_storage-2.16.2-py2.py3-none-any.whl (185 kB)
Collecting google-cloud-core<3,>=0.28.1
Using cached google_cloud_core-2.3.2-py2.py3-none-any.whl (29 kB)
Collecting google-cloud-bigtable<2,>=0.31.1
Using cached google_cloud_bigtable-1.7.3-py2.py3-none-any.whl (268 kB)
Collecting google-cloud-spanner<4,>=3.0.0
Using cached google_cloud_spanner-3.27.1-py2.py3-none-any.whl (300 kB)
Collecting google-cloud-dlp<4,>=3.0.0
Using cached google_cloud_dlp-3.11.1-py2.py3-none-any.whl (131 kB)
Collecting google-cloud-language<2,>=1.3.0
Using cached google_cloud_language-1.3.2-py2.py3-none-any.whl (83 kB)
Collecting google-cloud-videointelligence<2,>=1.8.0
Using cached google_cloud_videointelligence-1.16.3-py2.py3-none-any.whl (183 kB)
Collecting google-cloud-vision<4,>=2
Using cached google_cloud_vision-3.3.1-py2.py3-none-any.whl (393 kB)
Collecting google-cloud-recommendations-ai<0.8.0,>=0.1.0
Using cached google_cloud_recommendations_ai-0.7.1-py2.py3-none-any.whl (148 kB)
Requirement already satisfied: six>=1.11.0 in /home/jenkins/jenkins-slave/workspace/beam_LoadTests_Python_ParDo_Flink_Batch/src/build/gradleenv/1329484227/lib/python3.7/site-packages (from azure-core>=1.7.0->apache-beam==2.47.0.dev0) (1.16.0)
Collecting msal-extensions<2.0.0,>=0.3.0
Using cached msal_extensions-1.0.0-py2.py3-none-any.whl (19 kB)
Collecting msal<2.0.0,>=1.12.0
Using cached msal-1.21.0-py2.py3-none-any.whl (89 kB)
Collecting isodate>=0.6.1
Using cached isodate-0.6.1-py2.py3-none-any.whl (41 kB)
Collecting botocore<1.30.0,>=1.29.78
Using cached botocore-1.29.78-py3-none-any.whl (10.4 MB)
Collecting jmespath<2.0.0,>=0.7.1
Using cached jmespath-1.0.1-py3-none-any.whl (20 kB)
Collecting s3transfer<0.7.0,>=0.6.0
Using cached s3transfer-0.6.0-py3-none-any.whl (79 kB)
Collecting cffi>=1.12
Using cached cffi-1.15.1-cp37-cp37m-manylinux_2_17_x86_64.manylinux2014_x86_64.whl (427 kB)
Collecting oauth2client>=1.4.12
Using cached oauth2client-4.1.3-py2.py3-none-any.whl (98 kB)
Collecting pyasn1-modules>=0.2.1
Using cached pyasn1_modules-0.2.8-py2.py3-none-any.whl (155 kB)
Collecting rsa<5,>=3.1.4
Using cached rsa-4.9-py3-none-any.whl (34 kB)
Collecting google-api-core[grpc]!=2.0.*,!=2.1.*,!=2.2.*,!=2.3.0,<3.0.0dev,>=1.31.5
Using cached google_api_core-2.11.0-py3-none-any.whl (120 kB)
Requirement already satisfied: packaging>=20.0.0 in /home/jenkins/jenkins-slave/workspace/beam_LoadTests_Python_ParDo_Flink_Batch/src/build/gradleenv/1329484227/lib/python3.7/site-packages (from google-cloud-bigquery<4,>=1.6.0->apache-beam==2.47.0.dev0) (23.0)
Collecting google-resumable-media<3.0dev,>=0.6.0
Using cached google_resumable_media-2.4.1-py2.py3-none-any.whl (77 kB)
Collecting grpc-google-iam-v1<0.13dev,>=0.12.3
Using cached grpc_google_iam_v1-0.12.6-py2.py3-none-any.whl (26 kB)
Collecting grpcio-status>=1.33.2
Using cached grpcio_status-1.51.3-py3-none-any.whl (5.1 kB)
Collecting overrides<7.0.0,>=6.0.1
Using cached overrides-6.5.0-py3-none-any.whl (17 kB)
Collecting sqlparse>=0.3.0
Using cached sqlparse-0.4.3-py3-none-any.whl (42 kB)
Collecting docopt
Using cached docopt-0.6.2-py2.py3-none-any.whl
Collecting pyparsing!=3.0.0,!=3.0.1,!=3.0.2,!=3.0.3,<4,>=2.4.2
Using cached pyparsing-3.0.9-py3-none-any.whl (98 kB)
Collecting attrs>=19.2.0
Using cached attrs-22.2.0-py3-none-any.whl (60 kB)
Collecting exceptiongroup>=1.0.0
Using cached exceptiongroup-1.1.0-py3-none-any.whl (14 kB)
Collecting sortedcontainers<3.0.0,>=2.1.0
Using cached sortedcontainers-2.4.0-py2.py3-none-any.whl (29 kB)
Collecting pbr>=0.11
Using cached pbr-5.11.1-py2.py3-none-any.whl (112 kB)
Requirement already satisfied: importlib-metadata>=0.12 in /home/jenkins/jenkins-slave/workspace/beam_LoadTests_Python_ParDo_Flink_Batch/src/build/gradleenv/1329484227/lib/python3.7/site-packages (from pytest<8.0,>=7.1.2->apache-beam==2.47.0.dev0) (2.1.3)
Requirement already satisfied: pluggy<2.0,>=0.12 in /home/jenkins/jenkins-slave/workspace/beam_LoadTests_Python_ParDo_Flink_Batch/src/build/gradleenv/1329484227/lib/python3.7/site-packages (from pytest<8.0,>=7.1.2->apache-beam==2.47.0.dev0) (1.0.0)
Collecting iniconfig
Using cached iniconfig-2.0.0-py3-none-any.whl (5.9 kB)
Collecting tomli>=1.0.0
Using cached tomli-2.0.1-py3-none-any.whl (12 kB)
Collecting execnet>=1.1
Using cached execnet-1.9.0-py2.py3-none-any.whl (39 kB)
Collecting pytest-forked
Using cached pytest_forked-1.6.0-py3-none-any.whl (4.9 kB)
Collecting urllib3<1.27,>=1.21.1
Using cached urllib3-1.26.14-py2.py3-none-any.whl (140 kB)
Collecting certifi>=2017.4.17
Using cached certifi-2022.12.7-py3-none-any.whl (155 kB)
Collecting charset-normalizer<4,>=2
Using cached charset_normalizer-3.0.1-cp37-cp37m-manylinux_2_17_x86_64.manylinux2014_x86_64.whl (170 kB)
Collecting idna<4,>=2.5
Using cached idna-3.4-py3-none-any.whl (61 kB)
Collecting scipy>=1.1.0
Using cached scipy-1.7.3-cp37-cp37m-manylinux_2_12_x86_64.manylinux2010_x86_64.whl (38.1 MB)
Collecting threadpoolctl>=2.0.0
Using cached threadpoolctl-3.1.0-py3-none-any.whl (14 kB)
Collecting greenlet!=0.4.17
Using cached greenlet-2.0.2-cp37-cp37m-manylinux_2_17_x86_64.manylinux2014_x86_64.whl (566 kB)
Collecting deprecation
Using cached deprecation-2.1.0-py2.py3-none-any.whl (11 kB)
Collecting docker>=4.0.0
Using cached docker-6.0.1-py3-none-any.whl (147 kB)
Collecting wrapt
Using cached wrapt-1.14.1-cp37-cp37m-manylinux_2_5_x86_64.manylinux1_x86_64.manylinux_2_17_x86_64.manylinux2014_x86_64.whl (75 kB)
Collecting pymysql
Using cached PyMySQL-1.0.2-py3-none-any.whl (43 kB)
Collecting pycparser
Using cached pycparser-2.21-py2.py3-none-any.whl (118 kB)
Collecting websocket-client>=0.32.0
Using cached websocket_client-1.5.1-py3-none-any.whl (55 kB)
Collecting googleapis-common-protos<2.0dev,>=1.56.2
Using cached googleapis_common_protos-1.58.0-py2.py3-none-any.whl (223 kB)
Collecting google-crc32c<2.0dev,>=1.0
Using cached google_crc32c-1.5.0-cp37-cp37m-manylinux_2_17_x86_64.manylinux2014_x86_64.whl (32 kB)
Collecting grpcio-status>=1.33.2
Using cached grpcio_status-1.51.1-py3-none-any.whl (5.1 kB)
Using cached grpcio_status-1.50.0-py3-none-any.whl (14 kB)
Using cached grpcio_status-1.49.1-py3-none-any.whl (14 kB)
Using cached grpcio_status-1.48.2-py3-none-any.whl (14 kB)
Requirement already satisfied: zipp>=0.5 in /home/jenkins/jenkins-slave/workspace/beam_LoadTests_Python_ParDo_Flink_Batch/src/build/gradleenv/1329484227/lib/python3.7/site-packages (from importlib-metadata>=0.12->pytest<8.0,>=7.1.2->apache-beam==2.47.0.dev0) (3.14.0)
Collecting PyJWT[crypto]<3,>=1.0.0
Using cached PyJWT-2.6.0-py3-none-any.whl (20 kB)
Collecting portalocker<3,>=1.0
Using cached portalocker-2.7.0-py2.py3-none-any.whl (15 kB)
Collecting pyasn1>=0.1.7
Using cached pyasn1-0.4.8-py2.py3-none-any.whl (77 kB)
Requirement already satisfied: py in /home/jenkins/jenkins-slave/workspace/beam_LoadTests_Python_ParDo_Flink_Batch/src/build/gradleenv/1329484227/lib/python3.7/site-packages (from pytest-forked->pytest-xdist<3,>=2.5.0->apache-beam==2.47.0.dev0) (1.11.0)
Building wheels for collected packages: apache-beam
Building wheel for apache-beam (setup.py): started
Building wheel for apache-beam (setup.py): finished with status 'done'
Created wheel for apache-beam: filename=apache_beam-2.47.0.dev0-py3-none-any.whl size=3032338 sha256=d11a8aad72155e0af1bac3d89a1496dd419a7d25589cbe580a44f33b2be2179b
Stored in directory: /home/jenkins/.cache/pip/wheels/90/d8/b7/51c85dc301f777ed726fe78499a1e5dc02890cd8ebeaac231e
Successfully built apache-beam
Installing collected packages: sortedcontainers, pytz, pyasn1, parameterized, docopt, crcmod, charset-normalizer, zstandard, wrapt, websocket-client, urllib3, tomli, threadpoolctl, tenacity, sqlparse, scipy, rsa, regex, pyyaml, python-dateutil, pyparsing, pymysql, pymongo, PyJWT, pyhamcrest, pycparser, pyasn1-modules, pyarrow, psycopg2-binary, proto-plus, portalocker, pbr, overrides, orjson, objsize, joblib, jmespath, isodate, iniconfig, idna, greenlet, googleapis-common-protos, google-crc32c, fasteners, fastavro, execnet, exceptiongroup, dill, deprecation, cloudpickle, certifi, cachetools, attrs, sqlalchemy, scikit-learn, requests, pydot, pandas, mock, hypothesis, httplib2, grpcio-status, google-resumable-media, google-auth, freezegun, cffi, botocore, s3transfer, requests_mock, pytest, oauth2client, hdfs, grpc-google-iam-v1, google-auth-httplib2, google-api-core, docker, cryptography, azure-core, testcontainers, pytest-timeout, pytest-forked, google-cloud-core, google-apitools, boto3, azure-storage-blob, apache-beam, pytest-xdist, msal, google-cloud-vision, google-cloud-videointelligence, google-cloud-spanner, google-cloud-recommendations-ai, google-cloud-pubsub, google-cloud-language, google-cloud-dlp, google-cloud-datastore, google-cloud-bigtable, google-cloud-bigquery-storage, google-cloud-bigquery, msal-extensions, google-cloud-pubsublite, azure-identity
Successfully installed PyJWT-2.6.0 apache-beam-2.47.0.dev0 attrs-22.2.0 azure-core-1.26.3 azure-identity-1.12.0 azure-storage-blob-12.15.0 boto3-1.26.78 botocore-1.29.78 cachetools-4.2.4 certifi-2022.12.7 cffi-1.15.1 charset-normalizer-3.0.1 cloudpickle-2.2.1 crcmod-1.7 cryptography-39.0.1 deprecation-2.1.0 dill-0.3.1.1 docker-6.0.1 docopt-0.6.2 exceptiongroup-1.1.0 execnet-1.9.0 fastavro-1.7.2 fasteners-0.18 freezegun-1.2.2 google-api-core-2.11.0 google-apitools-0.5.31 google-auth-2.16.1 google-auth-httplib2-0.1.0 google-cloud-bigquery-3.6.0 google-cloud-bigquery-storage-2.16.2 google-cloud-bigtable-1.7.3 google-cloud-core-2.3.2 google-cloud-datastore-1.15.5 google-cloud-dlp-3.11.1 google-cloud-language-1.3.2 google-cloud-pubsub-2.15.0 google-cloud-pubsublite-1.7.0 google-cloud-recommendations-ai-0.7.1 google-cloud-spanner-3.27.1 google-cloud-videointelligence-1.16.3 google-cloud-vision-3.3.1 google-crc32c-1.5.0 google-resumable-media-2.4.1 googleapis-common-protos-1.58.0 greenlet-2.0.2 grpc-google-iam-v1-0.12.6 grpcio-status-1.48.2 hdfs-2.7.0 httplib2-0.21.0 hypothesis-6.68.2 idna-3.4 iniconfig-2.0.0 isodate-0.6.1 jmespath-1.0.1 joblib-1.2.0 mock-2.0.0 msal-1.21.0 msal-extensions-1.0.0 oauth2client-4.1.3 objsize-0.6.1 orjson-3.8.6 overrides-6.5.0 pandas-1.3.5 parameterized-0.8.1 pbr-5.11.1 portalocker-2.7.0 proto-plus-1.22.2 psycopg2-binary-2.9.5 pyarrow-9.0.0 pyasn1-0.4.8 pyasn1-modules-0.2.8 pycparser-2.21 pydot-1.4.2 pyhamcrest-1.10.1 pymongo-3.13.0 pymysql-1.0.2 pyparsing-3.0.9 pytest-7.2.1 pytest-forked-1.6.0 pytest-timeout-2.1.0 pytest-xdist-2.5.0 python-dateutil-2.8.2 pytz-2022.7.1 pyyaml-6.0 regex-2022.10.31 requests-2.28.2 requests_mock-1.10.0 rsa-4.9 s3transfer-0.6.0 scikit-learn-1.0.2 scipy-1.7.3 sortedcontainers-2.4.0 sqlalchemy-1.4.46 sqlparse-0.4.3 tenacity-5.1.5 testcontainers-3.7.1 threadpoolctl-3.1.0 tomli-2.0.1 urllib3-1.26.14 websocket-client-1.5.1 wrapt-1.14.1 zstandard-0.20.0
> Task :sdks:python:apache_beam:testing:load_tests:run
INFO:root:Default Python SDK image for environment is apache/beam_python3.7_sdk:2.47.0.dev
INFO:root:Using provided Python SDK container image: gcr.io/apache-beam-testing/beam_portability/beam_python3.7_sdk:latest
INFO:root:Python SDK container image set to "gcr.io/apache-beam-testing/beam_portability/beam_python3.7_sdk:latest" for Docker environment
INFO:apache_beam.runners.portability.fn_api_runner.translations:==================== <function pack_combiners at 0x7f3234b23a70> ====================
INFO:apache_beam.runners.portability.fn_api_runner.translations:==================== <function lift_combiners at 0x7f3234b23b00> ====================
INFO:apache_beam.runners.portability.fn_api_runner.translations:==================== <function sort_stages at 0x7f3234b21290> ====================
WARNING:apache_beam.options.pipeline_options:Discarding unparseable args: ['--iterations=1', '--number_of_counter_operations=100', '--number_of_counters=1']
INFO:apache_beam.runners.portability.portable_runner:Job state changed to STOPPED
INFO:apache_beam.runners.portability.portable_runner:Job state changed to STARTING
INFO:apache_beam.runners.portability.portable_runner:Job state changed to RUNNING
FATAL: command execution failed
java.io.IOException: Backing channel 'apache-beam-jenkins-10' is disconnected.
at hudson.remoting.RemoteInvocationHandler.channelOrFail(RemoteInvocationHandler.java:215)
at hudson.remoting.RemoteInvocationHandler.invoke(RemoteInvocationHandler.java:285)
at com.sun.proxy.$Proxy141.isAlive(Unknown Source)
at hudson.Launcher$RemoteLauncher$ProcImpl.isAlive(Launcher.java:1215)
at hudson.Launcher$RemoteLauncher$ProcImpl.join(Launcher.java:1207)
at hudson.Launcher$ProcStarter.join(Launcher.java:524)
at hudson.plugins.gradle.Gradle.perform(Gradle.java:317)
at hudson.tasks.BuildStepMonitor$1.perform(BuildStepMonitor.java:20)
at hudson.model.AbstractBuild$AbstractBuildExecution.perform(AbstractBuild.java:814)
at hudson.model.Build$BuildExecution.build(Build.java:199)
at hudson.model.Build$BuildExecution.doRun(Build.java:164)
at hudson.model.AbstractBuild$AbstractBuildExecution.run(AbstractBuild.java:522)
at hudson.model.Run.execute(Run.java:1896)
at hudson.model.FreeStyleBuild.run(FreeStyleBuild.java:44)
at hudson.model.ResourceController.execute(ResourceController.java:101)
at hudson.model.Executor.run(Executor.java:442)
Caused by: java.io.IOException: Pipe closed after 0 cycles
at org.apache.sshd.common.channel.ChannelPipedInputStream.read(ChannelPipedInputStream.java:126)
at org.apache.sshd.common.channel.ChannelPipedInputStream.read(ChannelPipedInputStream.java:105)
at hudson.remoting.FlightRecorderInputStream.read(FlightRecorderInputStream.java:94)
at hudson.remoting.ChunkedInputStream.readHeader(ChunkedInputStream.java:75)
at hudson.remoting.ChunkedInputStream.readUntilBreak(ChunkedInputStream.java:105)
at hudson.remoting.ChunkedCommandTransport.readBlock(ChunkedCommandTransport.java:39)
at hudson.remoting.AbstractSynchronousByteArrayCommandTransport.read(AbstractSynchronousByteArrayCommandTransport.java:34)
at hudson.remoting.SynchronousCommandTransport$ReaderThread.run(SynchronousCommandTransport.java:61)
Build step 'Invoke Gradle script' changed build result to FAILURE
Build step 'Invoke Gradle script' marked build as failure
ERROR: apache-beam-jenkins-10 is offline; cannot locate jdk_1.8_latest
---------------------------------------------------------------------
To unsubscribe, e-mail: builds-unsubscribe@beam.apache.org
For additional commands, e-mail: builds-help@beam.apache.org
Build failed in Jenkins: beam_LoadTests_Python_ParDo_Flink_Batch #1236
Posted by Apache Jenkins Server <je...@builds.apache.org>.
See <https://ci-beam.apache.org/job/beam_LoadTests_Python_ParDo_Flink_Batch/1236/display/redirect>
Changes:
------------------------------------------
Started by timer
Running as SYSTEM
[EnvInject] - Loading node environment variables.
Building remotely on apache-beam-jenkins-4 (beam) in workspace <https://ci-beam.apache.org/job/beam_LoadTests_Python_ParDo_Flink_Batch/ws/>
The recommended git tool is: NONE
No credentials specified
Wiping out workspace first.
Cloning the remote Git repository
Using shallow clone with depth 1
Avoid fetching tags
Cloning repository https://github.com/apache/beam.git
> git init <https://ci-beam.apache.org/job/beam_LoadTests_Python_ParDo_Flink_Batch/ws/src> # timeout=10
Fetching upstream changes from https://github.com/apache/beam.git
> git --version # timeout=10
> git --version # 'git version 2.25.1'
> git fetch --no-tags --force --progress --depth=1 -- https://github.com/apache/beam.git +refs/heads/*:refs/remotes/origin/* # timeout=10
> git config remote.origin.url https://github.com/apache/beam.git # timeout=10
> git config --add remote.origin.fetch +refs/heads/*:refs/remotes/origin/* # timeout=10
> git config remote.origin.url https://github.com/apache/beam.git # timeout=10
Using shallow fetch with depth 1
Fetching upstream changes from https://github.com/apache/beam.git
> git fetch --no-tags --force --progress --depth=1 -- https://github.com/apache/beam.git +refs/heads/*:refs/remotes/origin/* +refs/pull/${ghprbPullId}/*:refs/remotes/origin/pr/${ghprbPullId}/* # timeout=10
> git rev-parse origin/master^{commit} # timeout=10
Checking out Revision 011296c14659f80c8ecbeefda79ecc3f1113bd95 (origin/master)
> git config core.sparsecheckout # timeout=10
> git checkout -f 011296c14659f80c8ecbeefda79ecc3f1113bd95 # timeout=10
Commit message: "Apply shallow clone for jenkins (#25595)"
> git rev-list --no-walk 8cfee7d05e6bdf73431f390577c9d000eadd3b3a # timeout=10
First time build. Skipping changelog.
No emails were triggered.
[EnvInject] - Executing scripts and injecting environment variables after the SCM step.
[EnvInject] - Injecting as environment variables the properties content
SETUPTOOLS_USE_DISTUTILS=stdlib
SPARK_LOCAL_IP=127.0.0.1
[EnvInject] - Variables injected successfully.
[EnvInject] - Injecting environment variables from a build step.
[EnvInject] - Injecting as environment variables the properties content
CLUSTER_NAME=beam-loadtests-python-pardo-flink-batch-1236
FLINK_NUM_WORKERS=5
DETACHED_MODE=true
JOB_SERVER_IMAGE=gcr.io/apache-beam-testing/beam_portability/beam_flink1.15_job_server:latest
GCS_BUCKET=gs://beam-flink-cluster
HARNESS_IMAGES_TO_PULL=gcr.io/apache-beam-testing/beam_portability/beam_python3.7_sdk:latest
HADOOP_DOWNLOAD_URL=https://repo.maven.apache.org/maven2/org/apache/flink/flink-shaded-hadoop-2-uber/2.8.3-10.0/flink-shaded-hadoop-2-uber-2.8.3-10.0.jar
GCLOUD_ZONE=us-central1-a
FLINK_TASKMANAGER_SLOTS=1
FLINK_DOWNLOAD_URL=https://archive.apache.org/dist/flink/flink-1.15.0/flink-1.15.0-bin-scala_2.12.tgz
ARTIFACTS_DIR=gs://beam-flink-cluster/beam-loadtests-python-pardo-flink-batch-1236
[EnvInject] - Variables injected successfully.
[beam_LoadTests_Python_ParDo_Flink_Batch] $ /bin/bash -xe /tmp/jenkins6811112766019001614.sh
+ echo Setting up flink cluster
Setting up flink cluster
[beam_LoadTests_Python_ParDo_Flink_Batch] $ /bin/bash -xe /tmp/jenkins5953194262161751292.sh
+ cd <https://ci-beam.apache.org/job/beam_LoadTests_Python_ParDo_Flink_Batch/ws/src/.test-infra/dataproc>
+ ./flink_cluster.sh create
+ GCLOUD_ZONE=us-central1-a
+ DATAPROC_VERSION=preview-debian11
++ echo us-central1-a
++ sed -E 's/(-[a-z])?$//'
+ GCLOUD_REGION=us-central1
+ MASTER_NAME=beam-loadtests-python-pardo-flink-batch-1236-m
+ INIT_ACTIONS_FOLDER_NAME=init-actions
+ FLINK_INIT=gs://beam-flink-cluster/init-actions/flink.sh
+ BEAM_INIT=gs://beam-flink-cluster/init-actions/beam.sh
+ DOCKER_INIT=gs://beam-flink-cluster/init-actions/docker.sh
+ FLINK_LOCAL_PORT=8081
+ FLINK_TASKMANAGER_SLOTS=1
+ YARN_APPLICATION_MASTER=
+ create
+ upload_init_actions
+ echo 'Uploading initialization actions to GCS bucket: gs://beam-flink-cluster'
Uploading initialization actions to GCS bucket: gs://beam-flink-cluster
+ gsutil cp -r init-actions/beam.sh init-actions/docker.sh init-actions/flink.sh gs://beam-flink-cluster/init-actions
Copying file://init-actions/beam.sh [Content-Type=text/x-sh]...
/ [0 files][ 0.0 B/ 2.3 KiB] / [1 files][ 2.3 KiB/ 2.3 KiB] Copying file://init-actions/docker.sh [Content-Type=text/x-sh]...
/ [1 files][ 2.3 KiB/ 6.0 KiB] / [2 files][ 6.0 KiB/ 6.0 KiB] Copying file://init-actions/flink.sh [Content-Type=text/x-sh]...
/ [2 files][ 6.0 KiB/ 13.5 KiB] / [3 files][ 13.5 KiB/ 13.5 KiB] -
Operation completed over 3 objects/13.5 KiB.
+ create_cluster
+ local metadata=flink-snapshot-url=https://archive.apache.org/dist/flink/flink-1.15.0/flink-1.15.0-bin-scala_2.12.tgz,
+ metadata+=flink-start-yarn-session=true,
+ metadata+=flink-taskmanager-slots=1,
+ metadata+=hadoop-jar-url=https://repo.maven.apache.org/maven2/org/apache/flink/flink-shaded-hadoop-2-uber/2.8.3-10.0/flink-shaded-hadoop-2-uber-2.8.3-10.0.jar
+ [[ -n gcr.io/apache-beam-testing/beam_portability/beam_python3.7_sdk:latest ]]
+ metadata+=,beam-sdk-harness-images-to-pull=gcr.io/apache-beam-testing/beam_portability/beam_python3.7_sdk:latest
+ [[ -n gcr.io/apache-beam-testing/beam_portability/beam_flink1.15_job_server:latest ]]
+ metadata+=,beam-job-server-image=gcr.io/apache-beam-testing/beam_portability/beam_flink1.15_job_server:latest
+ local image_version=preview-debian11
+ echo 'Starting dataproc cluster. Dataproc version: preview-debian11'
Starting dataproc cluster. Dataproc version: preview-debian11
+ gcloud dataproc clusters create beam-loadtests-python-pardo-flink-batch-1236 --region=us-central1 --num-****s=5 --master-machine-type=n1-standard-2 --****-machine-type=n1-standard-2 --metadata flink-snapshot-url=https://archive.apache.org/dist/flink/flink-1.15.0/flink-1.15.0-bin-scala_2.12.tgz,flink-start-yarn-session=true,flink-taskmanager-slots=1,hadoop-jar-url=https://repo.maven.apache.org/maven2/org/apache/flink/flink-shaded-hadoop-2-uber/2.8.3-10.0/flink-shaded-hadoop-2-uber-2.8.3-10.0.jar,beam-sdk-harness-images-to-pull=gcr.io/apache-beam-testing/beam_portability/beam_python3.7_sdk:latest,beam-job-server-image=gcr.io/apache-beam-testing/beam_portability/beam_flink1.15_job_server:latest, --image-version=preview-debian11 --zone=us-central1-a --optional-components=FLINK,DOCKER --quiet
ERROR: (gcloud.dataproc.clusters.create) INVALID_ARGUMENT: Failed to resolve image version 'preview-debian11'. Accepted image versions: [2.0-centos, 1.5-debian10, 2.1-ubuntu, 1.5-centos8, 2.0-ubuntu18, 1.5-ubuntu18, 2.0-rocky8, 2.1-debian, 2.1-rocky8, 2.0-debian, 2.0-rocky, 2.0-debian10, 1.5-rocky, 1.5-centos, 2.1-ubuntu20, 1.4-ubuntu18, 1.5-ubuntu, 1.4-debian10, 1.3-ubuntu, 1.4-ubuntu, 2.0, 2.1, 2.1-rocky, 1.3, 1.3-debian10, 2.1-debian11, 1.4, 2.0-ubuntu, 1.5, 1.4-debian, 1.5-debian, 1.3-debian, 1.3-ubuntu18, 1.5-rocky8, 2.0-centos8]. See https://cloud.google.com/dataproc/docs/concepts/versioning/dataproc-versions for additional information on image versioning.
Build step 'Execute shell' marked build as failure
---------------------------------------------------------------------
To unsubscribe, e-mail: builds-unsubscribe@beam.apache.org
For additional commands, e-mail: builds-help@beam.apache.org
Build failed in Jenkins: beam_LoadTests_Python_ParDo_Flink_Batch #1235
Posted by Apache Jenkins Server <je...@builds.apache.org>.
See <https://ci-beam.apache.org/job/beam_LoadTests_Python_ParDo_Flink_Batch/1235/display/redirect?page=changes>
Changes:
[Robert Bradshaw] Add retry logic to Python boot script.
[Robert Bradshaw] More verbose messaging.
[noreply] Better error for missing timezone info (#25444)
[noreply] Revert "Replace more uses of `ClassLoadingStrategy.Default.INJECTION`
[noreply] Use context param and error return value in mongodbio.Read SDF methods
[noreply] Revert workers for java tests (#25579)
[noreply] remove unnecessary error check (#25576)
[noreply] Making the default BigQuery write disposition to be WRITE_APPEND
[noreply] [Python] Support loading of TF models with saved weights (#25496)
[noreply] Bump github.com/aws/aws-sdk-go-v2/config in /sdks (#25572)
[noreply] [#24789][prism] V0 Go Direct Runner Replacement, Prism. (#25568)
------------------------------------------
Started by timer
Running as SYSTEM
[EnvInject] - Loading node environment variables.
Building remotely on apache-beam-jenkins-8 (beam) in workspace <https://ci-beam.apache.org/job/beam_LoadTests_Python_ParDo_Flink_Batch/ws/>
The recommended git tool is: NONE
No credentials specified
Wiping out workspace first.
Cloning the remote Git repository
Cloning repository https://github.com/apache/beam.git
> git init <https://ci-beam.apache.org/job/beam_LoadTests_Python_ParDo_Flink_Batch/ws/src> # timeout=10
Fetching upstream changes from https://github.com/apache/beam.git
> git --version # timeout=10
> git --version # 'git version 2.25.1'
> git fetch --tags --force --progress -- https://github.com/apache/beam.git +refs/heads/*:refs/remotes/origin/* # timeout=10
> git config remote.origin.url https://github.com/apache/beam.git # timeout=10
> git config --add remote.origin.fetch +refs/heads/*:refs/remotes/origin/* # timeout=10
> git config remote.origin.url https://github.com/apache/beam.git # timeout=10
Fetching upstream changes from https://github.com/apache/beam.git
> git fetch --tags --force --progress -- https://github.com/apache/beam.git +refs/heads/*:refs/remotes/origin/* +refs/pull/${ghprbPullId}/*:refs/remotes/origin/pr/${ghprbPullId}/* # timeout=10
> git rev-parse origin/master^{commit} # timeout=10
Checking out Revision 8cfee7d05e6bdf73431f390577c9d000eadd3b3a (origin/master)
> git config core.sparsecheckout # timeout=10
> git checkout -f 8cfee7d05e6bdf73431f390577c9d000eadd3b3a # timeout=10
Commit message: "Merge pull request #25473 Add retry logic to Python boot script."
> git rev-list --no-walk 921bc7b94708391eb7d980cb8d9ed35c80d3aebb # timeout=10
No emails were triggered.
[EnvInject] - Executing scripts and injecting environment variables after the SCM step.
[EnvInject] - Injecting as environment variables the properties content
SETUPTOOLS_USE_DISTUTILS=stdlib
SPARK_LOCAL_IP=127.0.0.1
[EnvInject] - Variables injected successfully.
[EnvInject] - Injecting environment variables from a build step.
[EnvInject] - Injecting as environment variables the properties content
CLUSTER_NAME=beam-loadtests-python-pardo-flink-batch-1235
FLINK_NUM_WORKERS=5
DETACHED_MODE=true
JOB_SERVER_IMAGE=gcr.io/apache-beam-testing/beam_portability/beam_flink1.15_job_server:latest
GCS_BUCKET=gs://beam-flink-cluster
HARNESS_IMAGES_TO_PULL=gcr.io/apache-beam-testing/beam_portability/beam_python3.7_sdk:latest
HADOOP_DOWNLOAD_URL=https://repo.maven.apache.org/maven2/org/apache/flink/flink-shaded-hadoop-2-uber/2.8.3-10.0/flink-shaded-hadoop-2-uber-2.8.3-10.0.jar
GCLOUD_ZONE=us-central1-a
FLINK_TASKMANAGER_SLOTS=1
FLINK_DOWNLOAD_URL=https://archive.apache.org/dist/flink/flink-1.15.0/flink-1.15.0-bin-scala_2.12.tgz
ARTIFACTS_DIR=gs://beam-flink-cluster/beam-loadtests-python-pardo-flink-batch-1235
[EnvInject] - Variables injected successfully.
[beam_LoadTests_Python_ParDo_Flink_Batch] $ /bin/bash -xe /tmp/jenkins3341952168954580299.sh
+ echo Setting up flink cluster
Setting up flink cluster
[beam_LoadTests_Python_ParDo_Flink_Batch] $ /bin/bash -xe /tmp/jenkins5506576149581496312.sh
+ cd <https://ci-beam.apache.org/job/beam_LoadTests_Python_ParDo_Flink_Batch/ws/src/.test-infra/dataproc>
+ ./flink_cluster.sh create
+ GCLOUD_ZONE=us-central1-a
+ DATAPROC_VERSION=preview-debian11
++ echo us-central1-a
++ sed -E 's/(-[a-z])?$//'
+ GCLOUD_REGION=us-central1
+ MASTER_NAME=beam-loadtests-python-pardo-flink-batch-1235-m
+ INIT_ACTIONS_FOLDER_NAME=init-actions
+ FLINK_INIT=gs://beam-flink-cluster/init-actions/flink.sh
+ BEAM_INIT=gs://beam-flink-cluster/init-actions/beam.sh
+ DOCKER_INIT=gs://beam-flink-cluster/init-actions/docker.sh
+ FLINK_LOCAL_PORT=8081
+ FLINK_TASKMANAGER_SLOTS=1
+ YARN_APPLICATION_MASTER=
+ create
+ upload_init_actions
+ echo 'Uploading initialization actions to GCS bucket: gs://beam-flink-cluster'
Uploading initialization actions to GCS bucket: gs://beam-flink-cluster
+ gsutil cp -r init-actions/beam.sh init-actions/docker.sh init-actions/flink.sh gs://beam-flink-cluster/init-actions
Copying file://init-actions/beam.sh [Content-Type=text/x-sh]...
/ [0 files][ 0.0 B/ 2.3 KiB] / [1 files][ 2.3 KiB/ 2.3 KiB] Copying file://init-actions/docker.sh [Content-Type=text/x-sh]...
/ [1 files][ 2.3 KiB/ 6.0 KiB] / [2 files][ 6.0 KiB/ 6.0 KiB] Copying file://init-actions/flink.sh [Content-Type=text/x-sh]...
/ [2 files][ 6.0 KiB/ 13.5 KiB] / [3 files][ 13.5 KiB/ 13.5 KiB] -
Operation completed over 3 objects/13.5 KiB.
+ create_cluster
+ local metadata=flink-snapshot-url=https://archive.apache.org/dist/flink/flink-1.15.0/flink-1.15.0-bin-scala_2.12.tgz,
+ metadata+=flink-start-yarn-session=true,
+ metadata+=flink-taskmanager-slots=1,
+ metadata+=hadoop-jar-url=https://repo.maven.apache.org/maven2/org/apache/flink/flink-shaded-hadoop-2-uber/2.8.3-10.0/flink-shaded-hadoop-2-uber-2.8.3-10.0.jar
+ [[ -n gcr.io/apache-beam-testing/beam_portability/beam_python3.7_sdk:latest ]]
+ metadata+=,beam-sdk-harness-images-to-pull=gcr.io/apache-beam-testing/beam_portability/beam_python3.7_sdk:latest
+ [[ -n gcr.io/apache-beam-testing/beam_portability/beam_flink1.15_job_server:latest ]]
+ metadata+=,beam-job-server-image=gcr.io/apache-beam-testing/beam_portability/beam_flink1.15_job_server:latest
+ local image_version=preview-debian11
+ echo 'Starting dataproc cluster. Dataproc version: preview-debian11'
Starting dataproc cluster. Dataproc version: preview-debian11
+ gcloud dataproc clusters create beam-loadtests-python-pardo-flink-batch-1235 --region=us-central1 --num-****s=5 --master-machine-type=n1-standard-2 --****-machine-type=n1-standard-2 --metadata flink-snapshot-url=https://archive.apache.org/dist/flink/flink-1.15.0/flink-1.15.0-bin-scala_2.12.tgz,flink-start-yarn-session=true,flink-taskmanager-slots=1,hadoop-jar-url=https://repo.maven.apache.org/maven2/org/apache/flink/flink-shaded-hadoop-2-uber/2.8.3-10.0/flink-shaded-hadoop-2-uber-2.8.3-10.0.jar,beam-sdk-harness-images-to-pull=gcr.io/apache-beam-testing/beam_portability/beam_python3.7_sdk:latest,beam-job-server-image=gcr.io/apache-beam-testing/beam_portability/beam_flink1.15_job_server:latest, --image-version=preview-debian11 --zone=us-central1-a --optional-components=FLINK,DOCKER --quiet
ERROR: (gcloud.dataproc.clusters.create) INVALID_ARGUMENT: Failed to resolve image version 'preview-debian11'. Accepted image versions: [2.0-centos, 1.5-debian10, 2.1-ubuntu, 1.5-centos8, 2.0-ubuntu18, 1.5-ubuntu18, 2.0-rocky8, 2.1-debian, 2.1-rocky8, 2.0-debian, 2.0-rocky, 2.0-debian10, 1.5-rocky, 1.5-centos, 2.1-ubuntu20, 1.4-ubuntu18, 1.5-ubuntu, 1.4-debian10, 1.3-ubuntu, 1.4-ubuntu, 2.0, 2.1, 2.1-rocky, 1.3, 1.3-debian10, 2.1-debian11, 1.4, 2.0-ubuntu, 1.5, 1.4-debian, 1.5-debian, 1.3-debian, 1.3-ubuntu18, 1.5-rocky8, 2.0-centos8]. See https://cloud.google.com/dataproc/docs/concepts/versioning/dataproc-versions for additional information on image versioning.
Build step 'Execute shell' marked build as failure
---------------------------------------------------------------------
To unsubscribe, e-mail: builds-unsubscribe@beam.apache.org
For additional commands, e-mail: builds-help@beam.apache.org