You are viewing a plain text version of this content. The canonical link for it is here.
Posted to dev@lucene.apache.org by Apache Jenkins Server <je...@builds.apache.org> on 2015/03/03 16:25:41 UTC

[JENKINS] Lucene-Artifacts-5.x - Build # 780 - Failure

Build: https://builds.apache.org/job/Lucene-Artifacts-5.x/780/

No tests ran.

Build Log:
[...truncated 12495 lines...]
BUILD FAILED
/usr/home/jenkins/jenkins-slave/workspace/Lucene-Artifacts-5.x/lucene/build.xml:389: java.net.ConnectException: Operation timed out
	at java.net.PlainSocketImpl.socketConnect(Native Method)
	at java.net.AbstractPlainSocketImpl.doConnect(AbstractPlainSocketImpl.java:339)
	at java.net.AbstractPlainSocketImpl.connectToAddress(AbstractPlainSocketImpl.java:200)
	at java.net.AbstractPlainSocketImpl.connect(AbstractPlainSocketImpl.java:182)
	at java.net.SocksSocketImpl.connect(SocksSocketImpl.java:392)
	at java.net.Socket.connect(Socket.java:579)
	at java.net.Socket.connect(Socket.java:528)
	at sun.net.NetworkClient.doConnect(NetworkClient.java:180)
	at sun.net.www.http.HttpClient.openServer(HttpClient.java:432)
	at sun.net.www.http.HttpClient.openServer(HttpClient.java:527)
	at sun.net.www.http.HttpClient.<init>(HttpClient.java:211)
	at sun.net.www.http.HttpClient.New(HttpClient.java:308)
	at sun.net.www.http.HttpClient.New(HttpClient.java:326)
	at sun.net.www.protocol.http.HttpURLConnection.getNewHttpClient(HttpURLConnection.java:996)
	at sun.net.www.protocol.http.HttpURLConnection.plainConnect(HttpURLConnection.java:932)
	at sun.net.www.protocol.http.HttpURLConnection.connect(HttpURLConnection.java:850)
	at org.apache.tools.ant.taskdefs.Get$GetThread.openConnection(Get.java:660)
	at org.apache.tools.ant.taskdefs.Get$GetThread.get(Get.java:579)
	at org.apache.tools.ant.taskdefs.Get$GetThread.run(Get.java:569)

Total time: 7 minutes 38 seconds
Build step 'Invoke Ant' marked build as failure
Archiving artifacts
Sending artifact delta relative to Lucene-Artifacts-5.x #779
Archived 13 artifacts
Archive block size is 32768
Received 1078 blocks and 140836903 bytes
Compression is 20.1%
Took 2 min 39 sec
Publishing Javadoc
Email was triggered for: Failure
Sending email for trigger: Failure



[JENKINS] Lucene-Artifacts-5.x - Build # 781 - Still Failing

Posted by Apache Jenkins Server <je...@builds.apache.org>.
Build: https://builds.apache.org/job/Lucene-Artifacts-5.x/781/

No tests ran.

Build Log:
[...truncated 6765 lines...]
BUILD FAILED
/usr/home/jenkins/jenkins-slave/workspace/Lucene-Artifacts-5.x/lucene/build.xml:460: The following error occurred while executing this line:
/usr/home/jenkins/jenkins-slave/workspace/Lucene-Artifacts-5.x/lucene/common-build.xml:2518: Can't get https://issues.apache.org/jira/rest/api/2/project/LUCENE to /usr/home/jenkins/jenkins-slave/workspace/Lucene-Artifacts-5.x/lucene/build/docs/changes/jiraVersionList.json

Total time: 5 minutes 10 seconds
Build step 'Invoke Ant' marked build as failure
Archiving artifacts
Publishing Javadoc
Email was triggered for: Failure
Sending email for trigger: Failure