You are viewing a plain text version of this content. The canonical link for it is here.
Posted to commits@beam.apache.org by Apache Jenkins Server <je...@builds.apache.org> on 2018/07/23 06:37:37 UTC

Build failed in Jenkins: beam_PerformanceTests_Compressed_TextIOIT #765

See <https://builds.apache.org/job/beam_PerformanceTests_Compressed_TextIOIT/765/display/redirect>

------------------------------------------
[...truncated 26.63 KB...]
	at org.gradle.launcher.bootstrap.ProcessBootstrap.run(ProcessBootstrap.java:37)
	at org.gradle.launcher.GradleMain.main(GradleMain.java:23)
	at org.gradle.wrapper.BootstrapMainStarter.start(BootstrapMainStarter.java:31)
	at org.gradle.wrapper.WrapperExecutor.execute(WrapperExecutor.java:108)
	at org.gradle.wrapper.GradleWrapperMain.main(GradleWrapperMain.java:61)
Caused by: org.gradle.internal.service.ServiceCreationException: Could not create service of type FileHasher using GradleUserHomeScopeServices.createCachingFileHasher().
	at org.gradle.internal.service.DefaultServiceRegistry$FactoryMethodService.invokeMethod(DefaultServiceRegistry.java:816)
	at org.gradle.internal.service.DefaultServiceRegistry$FactoryService.create(DefaultServiceRegistry.java:767)
	at org.gradle.internal.service.DefaultServiceRegistry$ManagedObjectServiceProvider.getInstance(DefaultServiceRegistry.java:571)
	at org.gradle.internal.service.DefaultServiceRegistry$SingletonService.get(DefaultServiceRegistry.java:628)
	at org.gradle.internal.service.DefaultServiceRegistry$FactoryService.assembleParameters(DefaultServiceRegistry.java:780)
	at org.gradle.internal.service.DefaultServiceRegistry$FactoryService.create(DefaultServiceRegistry.java:766)
	at org.gradle.internal.service.DefaultServiceRegistry$ManagedObjectServiceProvider.getInstance(DefaultServiceRegistry.java:571)
	at org.gradle.internal.service.DefaultServiceRegistry$SingletonService.get(DefaultServiceRegistry.java:628)
	at org.gradle.internal.service.DefaultServiceRegistry$FactoryService.assembleParameters(DefaultServiceRegistry.java:780)
	at org.gradle.internal.service.DefaultServiceRegistry$FactoryService.create(DefaultServiceRegistry.java:766)
	at org.gradle.internal.service.DefaultServiceRegistry$ManagedObjectServiceProvider.getInstance(DefaultServiceRegistry.java:571)
	at org.gradle.internal.service.DefaultServiceRegistry$SingletonService.get(DefaultServiceRegistry.java:628)
	at org.gradle.internal.service.DefaultServiceRegistry$FactoryService.assembleParameters(DefaultServiceRegistry.java:780)
	at org.gradle.internal.service.DefaultServiceRegistry$FactoryService.create(DefaultServiceRegistry.java:766)
	at org.gradle.internal.service.DefaultServiceRegistry$ManagedObjectServiceProvider.getInstance(DefaultServiceRegistry.java:571)
	at org.gradle.internal.service.DefaultServiceRegistry$SingletonService.get(DefaultServiceRegistry.java:628)
	at org.gradle.internal.service.DefaultServiceRegistry$FactoryService.assembleParameters(DefaultServiceRegistry.java:780)
	at org.gradle.internal.service.DefaultServiceRegistry$FactoryService.create(DefaultServiceRegistry.java:766)
	at org.gradle.internal.service.DefaultServiceRegistry$ManagedObjectServiceProvider.getInstance(DefaultServiceRegistry.java:571)
	at org.gradle.internal.service.DefaultServiceRegistry$SingletonService.get(DefaultServiceRegistry.java:628)
	at org.gradle.internal.service.DefaultServiceRegistry$FactoryService.assembleParameters(DefaultServiceRegistry.java:780)
	at org.gradle.internal.service.DefaultServiceRegistry$FactoryService.create(DefaultServiceRegistry.java:766)
	at org.gradle.internal.service.DefaultServiceRegistry$ManagedObjectServiceProvider.getInstance(DefaultServiceRegistry.java:571)
	at org.gradle.internal.service.DefaultServiceRegistry$SingletonService.get(DefaultServiceRegistry.java:628)
	at org.gradle.internal.service.DefaultServiceRegistry$FactoryService.assembleParameters(DefaultServiceRegistry.java:780)
	at org.gradle.internal.service.DefaultServiceRegistry$FactoryService.create(DefaultServiceRegistry.java:766)
	at org.gradle.internal.service.DefaultServiceRegistry$ManagedObjectServiceProvider.getInstance(DefaultServiceRegistry.java:571)
	at org.gradle.internal.service.DefaultServiceRegistry$SingletonService.get(DefaultServiceRegistry.java:628)
	at org.gradle.internal.service.DefaultServiceRegistry.find(DefaultServiceRegistry.java:295)
	at org.gradle.internal.service.DefaultServiceRegistry.get(DefaultServiceRegistry.java:284)
	at org.gradle.internal.service.DefaultServiceRegistry.get(DefaultServiceRegistry.java:279)
	at org.gradle.internal.service.scopes.BuildScopeServices.defaultScriptPluginFactory(BuildScopeServices.java:306)
	at org.gradle.internal.service.scopes.BuildScopeServices.createScriptPluginFactory(BuildScopeServices.java:298)
	at org.gradle.internal.reflect.JavaMethod.invoke(JavaMethod.java:73)
	at org.gradle.internal.service.ReflectionBasedServiceMethod.invoke(ReflectionBasedServiceMethod.java:35)
	at org.gradle.internal.service.DefaultServiceRegistry$FactoryMethodService.invokeMethod(DefaultServiceRegistry.java:814)
	... 51 more
Caused by: org.gradle.cache.LockTimeoutException: Timeout waiting to lock file hash cache (/home/jenkins/.gradle/caches/4.8/fileHashes). It is currently in use by another Gradle instance.
Owner PID: 15714
Our PID: 32611
Owner Operation: 
Our operation: 
Lock file: /home/jenkins/.gradle/caches/4.8/fileHashes/fileHashes.lock
	at org.gradle.cache.internal.DefaultFileLockManager$DefaultFileLock.lock(DefaultFileLockManager.java:284)
	at org.gradle.cache.internal.DefaultFileLockManager$DefaultFileLock.<init>(DefaultFileLockManager.java:154)
	at org.gradle.cache.internal.DefaultFileLockManager.lock(DefaultFileLockManager.java:100)
	at org.gradle.cache.internal.LockOnDemandCrossProcessCacheAccess.incrementLockCount(LockOnDemandCrossProcessCacheAccess.java:105)
	at org.gradle.cache.internal.LockOnDemandCrossProcessCacheAccess.acquireFileLock(LockOnDemandCrossProcessCacheAccess.java:161)
	at org.gradle.cache.internal.DefaultCacheAccess.onStartWork(DefaultCacheAccess.java:368)
	at org.gradle.cache.internal.DefaultCacheAccess.useCache(DefaultCacheAccess.java:213)
	at org.gradle.cache.internal.DefaultCacheAccess.useCache(DefaultCacheAccess.java:203)
	at org.gradle.cache.internal.DefaultCacheAccess.newCache(DefaultCacheAccess.java:298)
	at org.gradle.cache.internal.DefaultCacheAccess.newCache(DefaultCacheAccess.java:57)
	at org.gradle.cache.internal.DefaultPersistentDirectoryStore.createCache(DefaultPersistentDirectoryStore.java:148)
	at org.gradle.cache.internal.DefaultCacheFactory$ReferenceTrackingCache.createCache(DefaultCacheFactory.java:177)
	at org.gradle.api.internal.changedetection.state.CrossBuildFileHashCache.createCache(CrossBuildFileHashCache.java:51)
	at org.gradle.api.internal.changedetection.state.CachingFileHasher.<init>(CachingFileHasher.java:44)
	at org.gradle.internal.service.scopes.GradleUserHomeScopeServices.createCachingFileHasher(GradleUserHomeScopeServices.java:120)
	at org.gradle.internal.reflect.JavaMethod.invoke(JavaMethod.java:73)
	at org.gradle.internal.service.ReflectionBasedServiceMethod.invoke(ReflectionBasedServiceMethod.java:35)
	at org.gradle.internal.service.DefaultServiceRegistry$FactoryMethodService.invokeMethod(DefaultServiceRegistry.java:814)
	... 86 more


* Get more help at https://help.gradle.org

BUILD FAILED in 1m 2s

2018-07-23 06:36:34,953 a75fddbf MainThread beam_integration_benchmark(1/1) INFO     Running benchmark beam_integration_benchmark
2018-07-23 06:36:34,960 a75fddbf MainThread beam_integration_benchmark(1/1) INFO     Running: <https://builds.apache.org/job/beam_PerformanceTests_Compressed_TextIOIT/ws/src/gradlew> integrationTest --tests=org.apache.beam.sdk.io.text.TextIOIT -p sdks/java/io/file-based-io-tests -DintegrationTestRunner=dataflow -Dfilesystem=gcs -DintegrationTestPipelineOptions=["--project=apache-beam-testing","--tempRoot=gs://temp-storage-for-perf-tests","--filenamePrefix=gs://temp-storage-for-perf-tests/beam_PerformanceTests_Compressed_TextIOIT/765/","--numberOfRecords=1000000","--compressionType=GZIP","--runner=TestDataflowRunner"] --stacktrace --info
2018-07-23 06:37:37,033 a75fddbf MainThread beam_integration_benchmark(1/1) INFO     Ran: {<https://builds.apache.org/job/beam_PerformanceTests_Compressed_TextIOIT/ws/src/gradlew> integrationTest --tests=org.apache.beam.sdk.io.text.TextIOIT -p sdks/java/io/file-based-io-tests -DintegrationTestRunner=dataflow -Dfilesystem=gcs -DintegrationTestPipelineOptions=["--project=apache-beam-testing","--tempRoot=gs://temp-storage-for-perf-tests","--filenamePrefix=gs://temp-storage-for-perf-tests/beam_PerformanceTests_Compressed_TextIOIT/765/","--numberOfRecords=1000000","--compressionType=GZIP","--runner=TestDataflowRunner"] --stacktrace --info}  ReturnCode:1
STDOUT: Initialized native services in: /home/jenkins/.gradle/native
Using 16 worker leases.

STDERR: 
FAILURE: Build failed with an exception.

* What went wrong:
Could not create service of type ScriptPluginFactory using BuildScopeServices.createScriptPluginFactory().
> Could not create service of type FileHasher using GradleUserHomeScopeServices.createCachingFileHasher().

* Try:
Run with --debug option to get more log output. Run with --scan to get full insights.

* Exception is:
org.gradle.internal.service.ServiceCreationException: Could not create service of type ScriptPluginFactory using BuildScopeServices.createScriptPluginFactory().
	at org.gradle.internal.service.DefaultServiceRegistry$FactoryMethodService.invokeMethod(DefaultServiceRegistry.java:816)
	at org.gradle.internal.service.DefaultServiceRegistry$FactoryService.create(DefaultServiceRegistry.java:767)
	at org.gradle.internal.service.DefaultServiceRegistry$ManagedObjectServiceProvider.getInstance(DefaultServiceRegistry.java:571)
	at org.gradle.internal.service.DefaultServiceRegistry$SingletonService.get(DefaultServiceRegistry.java:628)
	at org.gradle.internal.service.DefaultServiceRegistry$FactoryService.assembleParameters(DefaultServiceRegistry.java:780)
	at org.gradle.internal.service.DefaultServiceRegistry$FactoryService.create(DefaultServiceRegistry.java:766)
	at org.gradle.internal.service.DefaultServiceRegistry$ManagedObjectServiceProvider.getInstance(DefaultServiceRegistry.java:571)
	at org.gradle.internal.service.DefaultServiceRegistry$SingletonService.get(DefaultServiceRegistry.java:628)
	at org.gradle.internal.service.DefaultServiceRegistry$FactoryService.assembleParameters(DefaultServiceRegistry.java:780)
	at org.gradle.internal.service.DefaultServiceRegistry$FactoryService.create(DefaultServiceRegistry.java:766)
	at org.gradle.internal.service.DefaultServiceRegistry$ManagedObjectServiceProvider.getInstance(DefaultServiceRegistry.java:571)
	at org.gradle.internal.service.DefaultServiceRegistry$SingletonService.get(DefaultServiceRegistry.java:628)
	at org.gradle.internal.service.DefaultServiceRegistry.find(DefaultServiceRegistry.java:295)
	at org.gradle.internal.service.DefaultServiceRegistry.get(DefaultServiceRegistry.java:284)
	at org.gradle.internal.service.DefaultServiceRegistry.get(DefaultServiceRegistry.java:279)
	at org.gradle.initialization.DefaultGradleLauncherFactory.doNewInstance(DefaultGradleLauncherFactory.java:176)
	at org.gradle.initialization.DefaultGradleLauncherFactory.newInstance(DefaultGradleLauncherFactory.java:104)
	at org.gradle.composite.internal.DefaultRootBuildState.run(DefaultRootBuildState.java:59)
	at org.gradle.launcher.exec.InProcessBuildActionExecuter.execute(InProcessBuildActionExecuter.java:46)
	at org.gradle.launcher.exec.InProcessBuildActionExecuter.execute(InProcessBuildActionExecuter.java:32)
	at org.gradle.launcher.exec.BuildTreeScopeBuildActionExecuter.execute(BuildTreeScopeBuildActionExecuter.java:39)
	at org.gradle.launcher.exec.BuildTreeScopeBuildActionExecuter.execute(BuildTreeScopeBuildActionExecuter.java:25)
	at org.gradle.tooling.internal.provider.ContinuousBuildActionExecuter.execute(ContinuousBuildActionExecuter.java:80)
	at org.gradle.tooling.internal.provider.ContinuousBuildActionExecuter.execute(ContinuousBuildActionExecuter.java:53)
	at org.gradle.tooling.internal.provider.ServicesSetupBuildActionExecuter.execute(ServicesSetupBuildActionExecuter.java:62)
	at org.gradle.tooling.internal.provider.ServicesSetupBuildActionExecuter.execute(ServicesSetupBuildActionExecuter.java:34)
	at org.gradle.tooling.internal.provider.GradleThreadBuildActionExecuter.execute(GradleThreadBuildActionExecuter.java:36)
	at org.gradle.tooling.internal.provider.GradleThreadBuildActionExecuter.execute(GradleThreadBuildActionExecuter.java:25)
	at org.gradle.tooling.internal.provider.ParallelismConfigurationBuildActionExecuter.execute(ParallelismConfigurationBuildActionExecuter.java:43)
	at org.gradle.tooling.internal.provider.ParallelismConfigurationBuildActionExecuter.execute(ParallelismConfigurationBuildActionExecuter.java:29)
	at org.gradle.tooling.internal.provider.StartParamsValidatingActionExecuter.execute(StartParamsValidatingActionExecuter.java:59)
	at org.gradle.tooling.internal.provider.StartParamsValidatingActionExecuter.execute(StartParamsValidatingActionExecuter.java:31)
	at org.gradle.tooling.internal.provider.SessionFailureReportingActionExecuter.execute(SessionFailureReportingActionExecuter.java:59)
	at org.gradle.tooling.internal.provider.SessionFailureReportingActionExecuter.execute(SessionFailureReportingActionExecuter.java:44)
	at org.gradle.tooling.internal.provider.SetupLoggingActionExecuter.execute(SetupLoggingActionExecuter.java:46)
	at org.gradle.tooling.internal.provider.SetupLoggingActionExecuter.execute(SetupLoggingActionExecuter.java:30)
	at org.gradle.launcher.cli.RunBuildAction.run(RunBuildAction.java:52)
	at org.gradle.internal.Actions$RunnableActionAdapter.execute(Actions.java:173)
	at org.gradle.launcher.cli.CommandLineActionFactory$ParseAndBuildAction.execute(CommandLineActionFactory.java:379)
	at org.gradle.launcher.cli.CommandLineActionFactory$ParseAndBuildAction.execute(CommandLineActionFactory.java:352)
	at org.gradle.launcher.cli.ExceptionReportingAction.execute(ExceptionReportingAction.java:37)
	at org.gradle.launcher.cli.ExceptionReportingAction.execute(ExceptionReportingAction.java:23)
	at org.gradle.launcher.cli.CommandLineActionFactory$WithLogging.execute(CommandLineActionFactory.java:345)
	at org.gradle.launcher.cli.CommandLineActionFactory$WithLogging.execute(CommandLineActionFactory.java:275)
	at org.gradle.launcher.Main.doAction(Main.java:36)
	at org.gradle.launcher.bootstrap.EntryPoint.run(EntryPoint.java:45)
	at org.gradle.launcher.bootstrap.ProcessBootstrap.runNoExit(ProcessBootstrap.java:60)
	at org.gradle.launcher.bootstrap.ProcessBootstrap.run(ProcessBootstrap.java:37)
	at org.gradle.launcher.GradleMain.main(GradleMain.java:23)
	at org.gradle.wrapper.BootstrapMainStarter.start(BootstrapMainStarter.java:31)
	at org.gradle.wrapper.WrapperExecutor.execute(WrapperExecutor.java:108)
	at org.gradle.wrapper.GradleWrapperMain.main(GradleWrapperMain.java:61)
Caused by: org.gradle.internal.service.ServiceCreationException: Could not create service of type FileHasher using GradleUserHomeScopeServices.createCachingFileHasher().
	at org.gradle.internal.service.DefaultServiceRegistry$FactoryMethodService.invokeMethod(DefaultServiceRegistry.java:816)
	at org.gradle.internal.service.DefaultServiceRegistry$FactoryService.create(DefaultServiceRegistry.java:767)
	at org.gradle.internal.service.DefaultServiceRegistry$ManagedObjectServiceProvider.getInstance(DefaultServiceRegistry.java:571)
	at org.gradle.internal.service.DefaultServiceRegistry$SingletonService.get(DefaultServiceRegistry.java:628)
	at org.gradle.internal.service.DefaultServiceRegistry$FactoryService.assembleParameters(DefaultServiceRegistry.java:780)
	at org.gradle.internal.service.DefaultServiceRegistry$FactoryService.create(DefaultServiceRegistry.java:766)
	at org.gradle.internal.service.DefaultServiceRegistry$ManagedObjectServiceProvider.getInstance(DefaultServiceRegistry.java:571)
	at org.gradle.internal.service.DefaultServiceRegistry$SingletonService.get(DefaultServiceRegistry.java:628)
	at org.gradle.internal.service.DefaultServiceRegistry$FactoryService.assembleParameters(DefaultServiceRegistry.java:780)
	at org.gradle.internal.service.DefaultServiceRegistry$FactoryService.create(DefaultServiceRegistry.java:766)
	at org.gradle.internal.service.DefaultServiceRegistry$ManagedObjectServiceProvider.getInstance(DefaultServiceRegistry.java:571)
	at org.gradle.internal.service.DefaultServiceRegistry$SingletonService.get(DefaultServiceRegistry.java:628)
	at org.gradle.internal.service.DefaultServiceRegistry$FactoryService.assembleParameters(DefaultServiceRegistry.java:780)
	at org.gradle.internal.service.DefaultServiceRegistry$FactoryService.create(DefaultServiceRegistry.java:766)
	at org.gradle.internal.service.DefaultServiceRegistry$ManagedObjectServiceProvider.getInstance(DefaultServiceRegistry.java:571)
	at org.gradle.internal.service.DefaultServiceRegistry$SingletonService.get(DefaultServiceRegistry.java:628)
	at org.gradle.internal.service.DefaultServiceRegistry$FactoryService.assembleParameters(DefaultServiceRegistry.java:780)
	at org.gradle.internal.service.DefaultServiceRegistry$FactoryService.create(DefaultServiceRegistry.java:766)
	at org.gradle.internal.service.DefaultServiceRegistry$ManagedObjectServiceProvider.getInstance(DefaultServiceRegistry.java:571)
	at org.gradle.internal.service.DefaultServiceRegistry$SingletonService.get(DefaultServiceRegistry.java:628)
	at org.gradle.internal.service.DefaultServiceRegistry$FactoryService.assembleParameters(DefaultServiceRegistry.java:780)
	at org.gradle.internal.service.DefaultServiceRegistry$FactoryService.create(DefaultServiceRegistry.java:766)
	at org.gradle.internal.service.DefaultServiceRegistry$ManagedObjectServiceProvider.getInstance(DefaultServiceRegistry.java:571)
	at org.gradle.internal.service.DefaultServiceRegistry$SingletonService.get(DefaultServiceRegistry.java:628)
	at org.gradle.internal.service.DefaultServiceRegistry$FactoryService.assembleParameters(DefaultServiceRegistry.java:780)
	at org.gradle.internal.service.DefaultServiceRegistry$FactoryService.create(DefaultServiceRegistry.java:766)
	at org.gradle.internal.service.DefaultServiceRegistry$ManagedObjectServiceProvider.getInstance(DefaultServiceRegistry.java:571)
	at org.gradle.internal.service.DefaultServiceRegistry$SingletonService.get(DefaultServiceRegistry.java:628)
	at org.gradle.internal.service.DefaultServiceRegistry.find(DefaultServiceRegistry.java:295)
	at org.gradle.internal.service.DefaultServiceRegistry.get(DefaultServiceRegistry.java:284)
	at org.gradle.internal.service.DefaultServiceRegistry.get(DefaultServiceRegistry.java:279)
	at org.gradle.internal.service.scopes.BuildScopeServices.defaultScriptPluginFactory(BuildScopeServices.java:306)
	at org.gradle.internal.service.scopes.BuildScopeServices.createScriptPluginFactory(BuildScopeServices.java:298)
	at org.gradle.internal.reflect.JavaMethod.invoke(JavaMethod.java:73)
	at org.gradle.internal.service.ReflectionBasedServiceMethod.invoke(ReflectionBasedServiceMethod.java:35)
	at org.gradle.internal.service.DefaultServiceRegistry$FactoryMethodService.invokeMethod(DefaultServiceRegistry.java:814)
	... 51 more
Caused by: org.gradle.cache.LockTimeoutException: Timeout waiting to lock file hash cache (/home/jenkins/.gradle/caches/4.8/fileHashes). It is currently in use by another Gradle instance.
Owner PID: 15714
Our PID: 426
Owner Operation: 
Our operation: 
Lock file: /home/jenkins/.gradle/caches/4.8/fileHashes/fileHashes.lock
	at org.gradle.cache.internal.DefaultFileLockManager$DefaultFileLock.lock(DefaultFileLockManager.java:284)
	at org.gradle.cache.internal.DefaultFileLockManager$DefaultFileLock.<init>(DefaultFileLockManager.java:154)
	at org.gradle.cache.internal.DefaultFileLockManager.lock(DefaultFileLockManager.java:100)
	at org.gradle.cache.internal.LockOnDemandCrossProcessCacheAccess.incrementLockCount(LockOnDemandCrossProcessCacheAccess.java:105)
	at org.gradle.cache.internal.LockOnDemandCrossProcessCacheAccess.acquireFileLock(LockOnDemandCrossProcessCacheAccess.java:161)
	at org.gradle.cache.internal.DefaultCacheAccess.onStartWork(DefaultCacheAccess.java:368)
	at org.gradle.cache.internal.DefaultCacheAccess.useCache(DefaultCacheAccess.java:213)
	at org.gradle.cache.internal.DefaultCacheAccess.useCache(DefaultCacheAccess.java:203)
	at org.gradle.cache.internal.DefaultCacheAccess.newCache(DefaultCacheAccess.java:298)
	at org.gradle.cache.internal.DefaultCacheAccess.newCache(DefaultCacheAccess.java:57)
	at org.gradle.cache.internal.DefaultPersistentDirectoryStore.createCache(DefaultPersistentDirectoryStore.java:148)
	at org.gradle.cache.internal.DefaultCacheFactory$ReferenceTrackingCache.createCache(DefaultCacheFactory.java:177)
	at org.gradle.api.internal.changedetection.state.CrossBuildFileHashCache.createCache(CrossBuildFileHashCache.java:51)
	at org.gradle.api.internal.changedetection.state.CachingFileHasher.<init>(CachingFileHasher.java:44)
	at org.gradle.internal.service.scopes.GradleUserHomeScopeServices.createCachingFileHasher(GradleUserHomeScopeServices.java:120)
	at org.gradle.internal.reflect.JavaMethod.invoke(JavaMethod.java:73)
	at org.gradle.internal.service.ReflectionBasedServiceMethod.invoke(ReflectionBasedServiceMethod.java:35)
	at org.gradle.internal.service.DefaultServiceRegistry$FactoryMethodService.invokeMethod(DefaultServiceRegistry.java:814)
	... 86 more


* Get more help at https://help.gradle.org

BUILD FAILED in 1m 1s

2018-07-23 06:37:37,035 a75fddbf MainThread beam_integration_benchmark(1/1) ERROR    Error during benchmark beam_integration_benchmark
Traceback (most recent call last):
  File "<https://builds.apache.org/job/beam_PerformanceTests_Compressed_TextIOIT/ws/PerfKitBenchmarker/perfkitbenchmarker/pkb.py",> line 668, in RunBenchmark
    DoRunPhase(spec, collector, detailed_timer)
  File "<https://builds.apache.org/job/beam_PerformanceTests_Compressed_TextIOIT/ws/PerfKitBenchmarker/perfkitbenchmarker/pkb.py",> line 548, in DoRunPhase
    samples = spec.BenchmarkRun(spec)
  File "<https://builds.apache.org/job/beam_PerformanceTests_Compressed_TextIOIT/ws/PerfKitBenchmarker/perfkitbenchmarker/linux_benchmarks/beam_integration_benchmark.py",> line 159, in Run
    job_type=job_type)
  File "<https://builds.apache.org/job/beam_PerformanceTests_Compressed_TextIOIT/ws/PerfKitBenchmarker/perfkitbenchmarker/providers/gcp/gcp_dpb_dataflow.py",> line 90, in SubmitJob
    assert retcode == 0, "Integration Test Failed."
AssertionError: Integration Test Failed.
2018-07-23 06:37:37,036 a75fddbf MainThread beam_integration_benchmark(1/1) INFO     Cleaning up benchmark beam_integration_benchmark
2018-07-23 06:37:37,038 a75fddbf MainThread beam_integration_benchmark(1/1) ERROR    Exception running benchmark
Traceback (most recent call last):
  File "<https://builds.apache.org/job/beam_PerformanceTests_Compressed_TextIOIT/ws/PerfKitBenchmarker/perfkitbenchmarker/pkb.py",> line 802, in RunBenchmarkTask
    RunBenchmark(spec, collector)
  File "<https://builds.apache.org/job/beam_PerformanceTests_Compressed_TextIOIT/ws/PerfKitBenchmarker/perfkitbenchmarker/pkb.py",> line 668, in RunBenchmark
    DoRunPhase(spec, collector, detailed_timer)
  File "<https://builds.apache.org/job/beam_PerformanceTests_Compressed_TextIOIT/ws/PerfKitBenchmarker/perfkitbenchmarker/pkb.py",> line 548, in DoRunPhase
    samples = spec.BenchmarkRun(spec)
  File "<https://builds.apache.org/job/beam_PerformanceTests_Compressed_TextIOIT/ws/PerfKitBenchmarker/perfkitbenchmarker/linux_benchmarks/beam_integration_benchmark.py",> line 159, in Run
    job_type=job_type)
  File "<https://builds.apache.org/job/beam_PerformanceTests_Compressed_TextIOIT/ws/PerfKitBenchmarker/perfkitbenchmarker/providers/gcp/gcp_dpb_dataflow.py",> line 90, in SubmitJob
    assert retcode == 0, "Integration Test Failed."
AssertionError: Integration Test Failed.
2018-07-23 06:37:37,039 a75fddbf MainThread beam_integration_benchmark(1/1) ERROR    Benchmark 1/1 beam_integration_benchmark (UID: beam_integration_benchmark0) failed. Execution will continue.
2018-07-23 06:37:37,081 a75fddbf MainThread INFO     Benchmark run statuses:
---------------------------------------------------------------------------------
Name                        UID                          Status  Failed Substatus
---------------------------------------------------------------------------------
beam_integration_benchmark  beam_integration_benchmark0  FAILED                  
---------------------------------------------------------------------------------
Success rate: 0.00% (0/1)
2018-07-23 06:37:37,082 a75fddbf MainThread INFO     Complete logs can be found at: <https://builds.apache.org/job/beam_PerformanceTests_Compressed_TextIOIT/ws/runs/a75fddbf/pkb.log>
2018-07-23 06:37:37,082 a75fddbf MainThread INFO     Completion statuses can be found at: <https://builds.apache.org/job/beam_PerformanceTests_Compressed_TextIOIT/ws/runs/a75fddbf/completion_statuses.json>
Build step 'Execute shell' marked build as failure

Jenkins build is back to normal : beam_PerformanceTests_Compressed_TextIOIT #766

Posted by Apache Jenkins Server <je...@builds.apache.org>.
See <https://builds.apache.org/job/beam_PerformanceTests_Compressed_TextIOIT/766/display/redirect?page=changes>