You are viewing a plain text version of this content. The canonical link for it is here.
Posted to dev@lucene.apache.org by Apache Jenkins Server <je...@builds.apache.org> on 2011/07/01 09:17:29 UTC
[JENKINS] Lucene-Solr-tests-only-3.x - Build # 9221 - Failure
Build: https://builds.apache.org/job/Lucene-Solr-tests-only-3.x/9221/
11 tests failed.
FAILED: org.apache.lucene.util.TestFieldCacheSanityChecker.testIndexAndMerge
Error Message:
Forked Java VM exited abnormally. Please note the time in the report does not reflect the time until the VM exit.
Stack Trace:
junit.framework.AssertionFailedError: Forked Java VM exited abnormally. Please note the time in the report does not reflect the time until the VM exit.
at java.lang.Thread.run(Thread.java:636)
REGRESSION: org.apache.lucene.index.TestAddIndexes.testNonCFSLeftovers
Error Message:
Only one compound segment should exist expected:<3> but was:<4>
Stack Trace:
junit.framework.AssertionFailedError: Only one compound segment should exist expected:<3> but was:<4>
at org.apache.lucene.util.LuceneTestCase$LuceneTestCaseRunner.runChild(LuceneTestCase.java:1277)
at org.apache.lucene.util.LuceneTestCase$LuceneTestCaseRunner.runChild(LuceneTestCase.java:1195)
at org.apache.lucene.index.TestAddIndexes.testNonCFSLeftovers(TestAddIndexes.java:952)
REGRESSION: org.apache.lucene.index.TestCompoundFile.testSingleFile
Error Message:
org/apache/lucene/index/CompoundFileWriter
Stack Trace:
java.lang.NoClassDefFoundError: org/apache/lucene/index/CompoundFileWriter
at org.apache.lucene.index.TestCompoundFile.testSingleFile(TestCompoundFile.java:203)
at org.apache.lucene.util.LuceneTestCase$LuceneTestCaseRunner.runChild(LuceneTestCase.java:1277)
at org.apache.lucene.util.LuceneTestCase$LuceneTestCaseRunner.runChild(LuceneTestCase.java:1195)
Caused by: java.lang.ClassNotFoundException: org.apache.lucene.index.CompoundFileWriter
at java.net.URLClassLoader$1.run(URLClassLoader.java:217)
at java.security.AccessController.doPrivileged(Native Method)
at java.net.URLClassLoader.findClass(URLClassLoader.java:205)
at java.lang.ClassLoader.loadClass(ClassLoader.java:321)
at sun.misc.Launcher$AppClassLoader.loadClass(Launcher.java:294)
at java.lang.ClassLoader.loadClass(ClassLoader.java:266)
REGRESSION: org.apache.lucene.index.TestCompoundFile.testTwoFiles
Error Message:
org/apache/lucene/index/CompoundFileWriter
Stack Trace:
java.lang.NoClassDefFoundError: org/apache/lucene/index/CompoundFileWriter
at org.apache.lucene.index.TestCompoundFile.testTwoFiles(TestCompoundFile.java:226)
at org.apache.lucene.util.LuceneTestCase$LuceneTestCaseRunner.runChild(LuceneTestCase.java:1277)
at org.apache.lucene.util.LuceneTestCase$LuceneTestCaseRunner.runChild(LuceneTestCase.java:1195)
REGRESSION: org.apache.lucene.index.TestCompoundFile.testRandomFiles
Error Message:
org/apache/lucene/index/CompoundFileWriter
Stack Trace:
java.lang.NoClassDefFoundError: org/apache/lucene/index/CompoundFileWriter
at org.apache.lucene.index.TestCompoundFile.testRandomFiles(TestCompoundFile.java:276)
at org.apache.lucene.util.LuceneTestCase$LuceneTestCaseRunner.runChild(LuceneTestCase.java:1277)
at org.apache.lucene.util.LuceneTestCase$LuceneTestCaseRunner.runChild(LuceneTestCase.java:1195)
REGRESSION: org.apache.lucene.index.TestCompoundFile.testClonedStreamsClosing
Error Message:
org/apache/lucene/index/CompoundFileWriter
Stack Trace:
java.lang.NoClassDefFoundError: org/apache/lucene/index/CompoundFileWriter
at org.apache.lucene.index.TestCompoundFile.setUp_2(TestCompoundFile.java:305)
at org.apache.lucene.index.TestCompoundFile.testClonedStreamsClosing(TestCompoundFile.java:371)
at org.apache.lucene.util.LuceneTestCase$LuceneTestCaseRunner.runChild(LuceneTestCase.java:1277)
at org.apache.lucene.util.LuceneTestCase$LuceneTestCaseRunner.runChild(LuceneTestCase.java:1195)
REGRESSION: org.apache.lucene.index.TestCompoundFile.testRandomAccess
Error Message:
org/apache/lucene/index/CompoundFileWriter
Stack Trace:
java.lang.NoClassDefFoundError: org/apache/lucene/index/CompoundFileWriter
at org.apache.lucene.index.TestCompoundFile.setUp_2(TestCompoundFile.java:305)
at org.apache.lucene.index.TestCompoundFile.testRandomAccess(TestCompoundFile.java:428)
at org.apache.lucene.util.LuceneTestCase$LuceneTestCaseRunner.runChild(LuceneTestCase.java:1277)
at org.apache.lucene.util.LuceneTestCase$LuceneTestCaseRunner.runChild(LuceneTestCase.java:1195)
REGRESSION: org.apache.lucene.index.TestCompoundFile.testRandomAccessClones
Error Message:
org/apache/lucene/index/CompoundFileWriter
Stack Trace:
java.lang.NoClassDefFoundError: org/apache/lucene/index/CompoundFileWriter
at org.apache.lucene.index.TestCompoundFile.setUp_2(TestCompoundFile.java:305)
at org.apache.lucene.index.TestCompoundFile.testRandomAccessClones(TestCompoundFile.java:507)
at org.apache.lucene.util.LuceneTestCase$LuceneTestCaseRunner.runChild(LuceneTestCase.java:1277)
at org.apache.lucene.util.LuceneTestCase$LuceneTestCaseRunner.runChild(LuceneTestCase.java:1195)
REGRESSION: org.apache.lucene.index.TestCompoundFile.testFileNotFound
Error Message:
org/apache/lucene/index/CompoundFileWriter
Stack Trace:
java.lang.NoClassDefFoundError: org/apache/lucene/index/CompoundFileWriter
at org.apache.lucene.index.TestCompoundFile.setUp_2(TestCompoundFile.java:305)
at org.apache.lucene.index.TestCompoundFile.testFileNotFound(TestCompoundFile.java:584)
at org.apache.lucene.util.LuceneTestCase$LuceneTestCaseRunner.runChild(LuceneTestCase.java:1277)
at org.apache.lucene.util.LuceneTestCase$LuceneTestCaseRunner.runChild(LuceneTestCase.java:1195)
REGRESSION: org.apache.lucene.index.TestCompoundFile.testReadPastEOF
Error Message:
org/apache/lucene/index/CompoundFileWriter
Stack Trace:
java.lang.NoClassDefFoundError: org/apache/lucene/index/CompoundFileWriter
at org.apache.lucene.index.TestCompoundFile.setUp_2(TestCompoundFile.java:305)
at org.apache.lucene.index.TestCompoundFile.testReadPastEOF(TestCompoundFile.java:602)
at org.apache.lucene.util.LuceneTestCase$LuceneTestCaseRunner.runChild(LuceneTestCase.java:1277)
at org.apache.lucene.util.LuceneTestCase$LuceneTestCaseRunner.runChild(LuceneTestCase.java:1195)
REGRESSION: org.apache.lucene.index.TestCompoundFile.testAddExternalFile
Error Message:
org/apache/lucene/index/CompoundFileWriter
Stack Trace:
java.lang.NoClassDefFoundError: org/apache/lucene/index/CompoundFileWriter
at org.apache.lucene.index.TestCompoundFile.testAddExternalFile(TestCompoundFile.java:656)
at org.apache.lucene.util.LuceneTestCase$LuceneTestCaseRunner.runChild(LuceneTestCase.java:1277)
at org.apache.lucene.util.LuceneTestCase$LuceneTestCaseRunner.runChild(LuceneTestCase.java:1195)
Build Log (for compile errors):
[...truncated 10688 lines...]
---------------------------------------------------------------------
To unsubscribe, e-mail: dev-unsubscribe@lucene.apache.org
For additional commands, e-mail: dev-help@lucene.apache.org
RE: [JENKINS] Lucene-Solr-tests-only-3.x - Build # 9221 - Failure
Posted by Uwe Schindler <uw...@thetaphi.de>.
Hi,
It would be nice, if you could stop sending those eMails. If they are
generated by an auto-mailer, please stop it.
If this doesn't stop, the moderator will remove your address from the
mailing list.
Uwe
-----
Uwe Schindler
H.-H.-Meier-Allee 63, D-28213 Bremen
http://www.thetaphi.de <http://www.thetaphi.de/>
eMail: uwe@thetaphi.de
From: yazhini.k vini [mailto:yazhini.feb@gmail.com]
Sent: Friday, July 01, 2011 9:49 AM
To: dev@lucene.apache.org
Subject: Re: [JENKINS] Lucene-Solr-tests-only-3.x - Build # 9221 - Failure
I don't need message from your mail sir.
Re: [JENKINS] Lucene-Solr-tests-only-3.x - Build # 9221 - Failure
Posted by "yazhini.k vini" <ya...@gmail.com>.
I don't need message from your mail sir.
RE: [JENKINS] Lucene-Solr-tests-only-3.x - Build # 9221 - Failure
Posted by Uwe Schindler <uw...@thetaphi.de>.
Is fixed now, was a problem during cutover to 3.3 backwards tests.
-----
Uwe Schindler
H.-H.-Meier-Allee 63, D-28213 Bremen
http://www.thetaphi.de
eMail: uwe@thetaphi.de
> -----Original Message-----
> From: Apache Jenkins Server [mailto:jenkins@builds.apache.org]
> Sent: Friday, July 01, 2011 9:17 AM
> To: dev@lucene.apache.org
> Subject: [JENKINS] Lucene-Solr-tests-only-3.x - Build # 9221 - Failure
>
> Build: https://builds.apache.org/job/Lucene-Solr-tests-only-3.x/9221/
>
> 11 tests failed.
> FAILED:
> org.apache.lucene.util.TestFieldCacheSanityChecker.testIndexAndMerge
>
> Error Message:
> Forked Java VM exited abnormally. Please note the time in the report does
> not reflect the time until the VM exit.
>
> Stack Trace:
> junit.framework.AssertionFailedError: Forked Java VM exited abnormally.
> Please note the time in the report does not reflect the time until the VM
> exit.
> at java.lang.Thread.run(Thread.java:636)
>
>
> REGRESSION:
> org.apache.lucene.index.TestAddIndexes.testNonCFSLeftovers
>
> Error Message:
> Only one compound segment should exist expected:<3> but was:<4>
>
> Stack Trace:
> junit.framework.AssertionFailedError: Only one compound segment should
> exist expected:<3> but was:<4>
> at
> org.apache.lucene.util.LuceneTestCase$LuceneTestCaseRunner.runChild(Luc
> eneTestCase.java:1277)
> at
> org.apache.lucene.util.LuceneTestCase$LuceneTestCaseRunner.runChild(Luc
> eneTestCase.java:1195)
> at
> org.apache.lucene.index.TestAddIndexes.testNonCFSLeftovers(TestAddInd
> exes.java:952)
>
>
> REGRESSION: org.apache.lucene.index.TestCompoundFile.testSingleFile
>
> Error Message:
> org/apache/lucene/index/CompoundFileWriter
>
> Stack Trace:
> java.lang.NoClassDefFoundError:
> org/apache/lucene/index/CompoundFileWriter
> at
> org.apache.lucene.index.TestCompoundFile.testSingleFile(TestCompoundFil
> e.java:203)
> at
> org.apache.lucene.util.LuceneTestCase$LuceneTestCaseRunner.runChild(Luc
> eneTestCase.java:1277)
> at
> org.apache.lucene.util.LuceneTestCase$LuceneTestCaseRunner.runChild(Luc
> eneTestCase.java:1195)
> Caused by: java.lang.ClassNotFoundException:
> org.apache.lucene.index.CompoundFileWriter
> at java.net.URLClassLoader$1.run(URLClassLoader.java:217)
> at java.security.AccessController.doPrivileged(Native Method)
> at java.net.URLClassLoader.findClass(URLClassLoader.java:205)
> at java.lang.ClassLoader.loadClass(ClassLoader.java:321)
> at sun.misc.Launcher$AppClassLoader.loadClass(Launcher.java:294)
> at java.lang.ClassLoader.loadClass(ClassLoader.java:266)
>
>
> REGRESSION: org.apache.lucene.index.TestCompoundFile.testTwoFiles
>
> Error Message:
> org/apache/lucene/index/CompoundFileWriter
>
> Stack Trace:
> java.lang.NoClassDefFoundError:
> org/apache/lucene/index/CompoundFileWriter
> at
> org.apache.lucene.index.TestCompoundFile.testTwoFiles(TestCompoundFil
> e.java:226)
> at
> org.apache.lucene.util.LuceneTestCase$LuceneTestCaseRunner.runChild(Luc
> eneTestCase.java:1277)
> at
> org.apache.lucene.util.LuceneTestCase$LuceneTestCaseRunner.runChild(Luc
> eneTestCase.java:1195)
>
>
> REGRESSION: org.apache.lucene.index.TestCompoundFile.testRandomFiles
>
> Error Message:
> org/apache/lucene/index/CompoundFileWriter
>
> Stack Trace:
> java.lang.NoClassDefFoundError:
> org/apache/lucene/index/CompoundFileWriter
> at
> org.apache.lucene.index.TestCompoundFile.testRandomFiles(TestCompoun
> dFile.java:276)
> at
> org.apache.lucene.util.LuceneTestCase$LuceneTestCaseRunner.runChild(Luc
> eneTestCase.java:1277)
> at
> org.apache.lucene.util.LuceneTestCase$LuceneTestCaseRunner.runChild(Luc
> eneTestCase.java:1195)
>
>
> REGRESSION:
> org.apache.lucene.index.TestCompoundFile.testClonedStreamsClosing
>
> Error Message:
> org/apache/lucene/index/CompoundFileWriter
>
> Stack Trace:
> java.lang.NoClassDefFoundError:
> org/apache/lucene/index/CompoundFileWriter
> at
> org.apache.lucene.index.TestCompoundFile.setUp_2(TestCompoundFile.jav
> a:305)
> at
> org.apache.lucene.index.TestCompoundFile.testClonedStreamsClosing(Test
> CompoundFile.java:371)
> at
> org.apache.lucene.util.LuceneTestCase$LuceneTestCaseRunner.runChild(Luc
> eneTestCase.java:1277)
> at
> org.apache.lucene.util.LuceneTestCase$LuceneTestCaseRunner.runChild(Luc
> eneTestCase.java:1195)
>
>
> REGRESSION:
> org.apache.lucene.index.TestCompoundFile.testRandomAccess
>
> Error Message:
> org/apache/lucene/index/CompoundFileWriter
>
> Stack Trace:
> java.lang.NoClassDefFoundError:
> org/apache/lucene/index/CompoundFileWriter
> at
> org.apache.lucene.index.TestCompoundFile.setUp_2(TestCompoundFile.jav
> a:305)
> at
> org.apache.lucene.index.TestCompoundFile.testRandomAccess(TestCompo
> undFile.java:428)
> at
> org.apache.lucene.util.LuceneTestCase$LuceneTestCaseRunner.runChild(Luc
> eneTestCase.java:1277)
> at
> org.apache.lucene.util.LuceneTestCase$LuceneTestCaseRunner.runChild(Luc
> eneTestCase.java:1195)
>
>
> REGRESSION:
> org.apache.lucene.index.TestCompoundFile.testRandomAccessClones
>
> Error Message:
> org/apache/lucene/index/CompoundFileWriter
>
> Stack Trace:
> java.lang.NoClassDefFoundError:
> org/apache/lucene/index/CompoundFileWriter
> at
> org.apache.lucene.index.TestCompoundFile.setUp_2(TestCompoundFile.jav
> a:305)
> at
> org.apache.lucene.index.TestCompoundFile.testRandomAccessClones(TestC
> ompoundFile.java:507)
> at
> org.apache.lucene.util.LuceneTestCase$LuceneTestCaseRunner.runChild(Luc
> eneTestCase.java:1277)
> at
> org.apache.lucene.util.LuceneTestCase$LuceneTestCaseRunner.runChild(Luc
> eneTestCase.java:1195)
>
>
> REGRESSION: org.apache.lucene.index.TestCompoundFile.testFileNotFound
>
> Error Message:
> org/apache/lucene/index/CompoundFileWriter
>
> Stack Trace:
> java.lang.NoClassDefFoundError:
> org/apache/lucene/index/CompoundFileWriter
> at
> org.apache.lucene.index.TestCompoundFile.setUp_2(TestCompoundFile.jav
> a:305)
> at
> org.apache.lucene.index.TestCompoundFile.testFileNotFound(TestCompou
> ndFile.java:584)
> at
> org.apache.lucene.util.LuceneTestCase$LuceneTestCaseRunner.runChild(Luc
> eneTestCase.java:1277)
> at
> org.apache.lucene.util.LuceneTestCase$LuceneTestCaseRunner.runChild(Luc
> eneTestCase.java:1195)
>
>
> REGRESSION: org.apache.lucene.index.TestCompoundFile.testReadPastEOF
>
> Error Message:
> org/apache/lucene/index/CompoundFileWriter
>
> Stack Trace:
> java.lang.NoClassDefFoundError:
> org/apache/lucene/index/CompoundFileWriter
> at
> org.apache.lucene.index.TestCompoundFile.setUp_2(TestCompoundFile.jav
> a:305)
> at
> org.apache.lucene.index.TestCompoundFile.testReadPastEOF(TestCompoun
> dFile.java:602)
> at
> org.apache.lucene.util.LuceneTestCase$LuceneTestCaseRunner.runChild(Luc
> eneTestCase.java:1277)
> at
> org.apache.lucene.util.LuceneTestCase$LuceneTestCaseRunner.runChild(Luc
> eneTestCase.java:1195)
>
>
> REGRESSION:
> org.apache.lucene.index.TestCompoundFile.testAddExternalFile
>
> Error Message:
> org/apache/lucene/index/CompoundFileWriter
>
> Stack Trace:
> java.lang.NoClassDefFoundError:
> org/apache/lucene/index/CompoundFileWriter
> at
> org.apache.lucene.index.TestCompoundFile.testAddExternalFile(TestCompo
> undFile.java:656)
> at
> org.apache.lucene.util.LuceneTestCase$LuceneTestCaseRunner.runChild(Luc
> eneTestCase.java:1277)
> at
> org.apache.lucene.util.LuceneTestCase$LuceneTestCaseRunner.runChild(Luc
> eneTestCase.java:1195)
>
>
>
>
> Build Log (for compile errors):
> [...truncated 10688 lines...]
>
>
>
> ---------------------------------------------------------------------
> To unsubscribe, e-mail: dev-unsubscribe@lucene.apache.org For additional
> commands, e-mail: dev-help@lucene.apache.org
---------------------------------------------------------------------
To unsubscribe, e-mail: dev-unsubscribe@lucene.apache.org
For additional commands, e-mail: dev-help@lucene.apache.org
Re: [JENKINS] Lucene-Solr-tests-only-3.x - Build # 9222 - Still Failing
Posted by "yazhini.k vini" <ya...@gmail.com>.
I don't need message from your mail sir.
[JENKINS] Lucene-Solr-tests-only-3.x - Build # 9222 - Still Failing
Posted by Apache Jenkins Server <je...@builds.apache.org>.
Build: https://builds.apache.org/job/Lucene-Solr-tests-only-3.x/9222/
11 tests failed.
FAILED: org.apache.lucene.util.TestFieldCacheSanityChecker.testIndexAndMerge
Error Message:
Forked Java VM exited abnormally. Please note the time in the report does not reflect the time until the VM exit.
Stack Trace:
junit.framework.AssertionFailedError: Forked Java VM exited abnormally. Please note the time in the report does not reflect the time until the VM exit.
at java.lang.Thread.run(Thread.java:636)
REGRESSION: org.apache.lucene.index.TestAddIndexes.testNonCFSLeftovers
Error Message:
Only one compound segment should exist expected:<3> but was:<4>
Stack Trace:
junit.framework.AssertionFailedError: Only one compound segment should exist expected:<3> but was:<4>
at org.apache.lucene.util.LuceneTestCase$LuceneTestCaseRunner.runChild(LuceneTestCase.java:1277)
at org.apache.lucene.util.LuceneTestCase$LuceneTestCaseRunner.runChild(LuceneTestCase.java:1195)
at org.apache.lucene.index.TestAddIndexes.testNonCFSLeftovers(TestAddIndexes.java:952)
REGRESSION: org.apache.lucene.index.TestCompoundFile.testSingleFile
Error Message:
org/apache/lucene/index/CompoundFileWriter
Stack Trace:
java.lang.NoClassDefFoundError: org/apache/lucene/index/CompoundFileWriter
at org.apache.lucene.index.TestCompoundFile.testSingleFile(TestCompoundFile.java:203)
at org.apache.lucene.util.LuceneTestCase$LuceneTestCaseRunner.runChild(LuceneTestCase.java:1277)
at org.apache.lucene.util.LuceneTestCase$LuceneTestCaseRunner.runChild(LuceneTestCase.java:1195)
Caused by: java.lang.ClassNotFoundException: org.apache.lucene.index.CompoundFileWriter
at java.net.URLClassLoader$1.run(URLClassLoader.java:217)
at java.security.AccessController.doPrivileged(Native Method)
at java.net.URLClassLoader.findClass(URLClassLoader.java:205)
at java.lang.ClassLoader.loadClass(ClassLoader.java:321)
at sun.misc.Launcher$AppClassLoader.loadClass(Launcher.java:294)
at java.lang.ClassLoader.loadClass(ClassLoader.java:266)
REGRESSION: org.apache.lucene.index.TestCompoundFile.testTwoFiles
Error Message:
org/apache/lucene/index/CompoundFileWriter
Stack Trace:
java.lang.NoClassDefFoundError: org/apache/lucene/index/CompoundFileWriter
at org.apache.lucene.index.TestCompoundFile.testTwoFiles(TestCompoundFile.java:226)
at org.apache.lucene.util.LuceneTestCase$LuceneTestCaseRunner.runChild(LuceneTestCase.java:1277)
at org.apache.lucene.util.LuceneTestCase$LuceneTestCaseRunner.runChild(LuceneTestCase.java:1195)
REGRESSION: org.apache.lucene.index.TestCompoundFile.testRandomFiles
Error Message:
org/apache/lucene/index/CompoundFileWriter
Stack Trace:
java.lang.NoClassDefFoundError: org/apache/lucene/index/CompoundFileWriter
at org.apache.lucene.index.TestCompoundFile.testRandomFiles(TestCompoundFile.java:276)
at org.apache.lucene.util.LuceneTestCase$LuceneTestCaseRunner.runChild(LuceneTestCase.java:1277)
at org.apache.lucene.util.LuceneTestCase$LuceneTestCaseRunner.runChild(LuceneTestCase.java:1195)
REGRESSION: org.apache.lucene.index.TestCompoundFile.testClonedStreamsClosing
Error Message:
org/apache/lucene/index/CompoundFileWriter
Stack Trace:
java.lang.NoClassDefFoundError: org/apache/lucene/index/CompoundFileWriter
at org.apache.lucene.index.TestCompoundFile.setUp_2(TestCompoundFile.java:305)
at org.apache.lucene.index.TestCompoundFile.testClonedStreamsClosing(TestCompoundFile.java:371)
at org.apache.lucene.util.LuceneTestCase$LuceneTestCaseRunner.runChild(LuceneTestCase.java:1277)
at org.apache.lucene.util.LuceneTestCase$LuceneTestCaseRunner.runChild(LuceneTestCase.java:1195)
REGRESSION: org.apache.lucene.index.TestCompoundFile.testRandomAccess
Error Message:
org/apache/lucene/index/CompoundFileWriter
Stack Trace:
java.lang.NoClassDefFoundError: org/apache/lucene/index/CompoundFileWriter
at org.apache.lucene.index.TestCompoundFile.setUp_2(TestCompoundFile.java:305)
at org.apache.lucene.index.TestCompoundFile.testRandomAccess(TestCompoundFile.java:428)
at org.apache.lucene.util.LuceneTestCase$LuceneTestCaseRunner.runChild(LuceneTestCase.java:1277)
at org.apache.lucene.util.LuceneTestCase$LuceneTestCaseRunner.runChild(LuceneTestCase.java:1195)
REGRESSION: org.apache.lucene.index.TestCompoundFile.testRandomAccessClones
Error Message:
org/apache/lucene/index/CompoundFileWriter
Stack Trace:
java.lang.NoClassDefFoundError: org/apache/lucene/index/CompoundFileWriter
at org.apache.lucene.index.TestCompoundFile.setUp_2(TestCompoundFile.java:305)
at org.apache.lucene.index.TestCompoundFile.testRandomAccessClones(TestCompoundFile.java:507)
at org.apache.lucene.util.LuceneTestCase$LuceneTestCaseRunner.runChild(LuceneTestCase.java:1277)
at org.apache.lucene.util.LuceneTestCase$LuceneTestCaseRunner.runChild(LuceneTestCase.java:1195)
REGRESSION: org.apache.lucene.index.TestCompoundFile.testFileNotFound
Error Message:
org/apache/lucene/index/CompoundFileWriter
Stack Trace:
java.lang.NoClassDefFoundError: org/apache/lucene/index/CompoundFileWriter
at org.apache.lucene.index.TestCompoundFile.setUp_2(TestCompoundFile.java:305)
at org.apache.lucene.index.TestCompoundFile.testFileNotFound(TestCompoundFile.java:584)
at org.apache.lucene.util.LuceneTestCase$LuceneTestCaseRunner.runChild(LuceneTestCase.java:1277)
at org.apache.lucene.util.LuceneTestCase$LuceneTestCaseRunner.runChild(LuceneTestCase.java:1195)
REGRESSION: org.apache.lucene.index.TestCompoundFile.testReadPastEOF
Error Message:
org/apache/lucene/index/CompoundFileWriter
Stack Trace:
java.lang.NoClassDefFoundError: org/apache/lucene/index/CompoundFileWriter
at org.apache.lucene.index.TestCompoundFile.setUp_2(TestCompoundFile.java:305)
at org.apache.lucene.index.TestCompoundFile.testReadPastEOF(TestCompoundFile.java:602)
at org.apache.lucene.util.LuceneTestCase$LuceneTestCaseRunner.runChild(LuceneTestCase.java:1277)
at org.apache.lucene.util.LuceneTestCase$LuceneTestCaseRunner.runChild(LuceneTestCase.java:1195)
REGRESSION: org.apache.lucene.index.TestCompoundFile.testAddExternalFile
Error Message:
org/apache/lucene/index/CompoundFileWriter
Stack Trace:
java.lang.NoClassDefFoundError: org/apache/lucene/index/CompoundFileWriter
at org.apache.lucene.index.TestCompoundFile.testAddExternalFile(TestCompoundFile.java:656)
at org.apache.lucene.util.LuceneTestCase$LuceneTestCaseRunner.runChild(LuceneTestCase.java:1277)
at org.apache.lucene.util.LuceneTestCase$LuceneTestCaseRunner.runChild(LuceneTestCase.java:1195)
Build Log (for compile errors):
[...truncated 10569 lines...]
---------------------------------------------------------------------
To unsubscribe, e-mail: dev-unsubscribe@lucene.apache.org
For additional commands, e-mail: dev-help@lucene.apache.org