You are viewing a plain text version of this content. The canonical link for it is here.
Posted to builds@solr.apache.org by Policeman Jenkins Server via builds <bu...@solr.apache.org> on 2026/04/02 17:58:51 UTC
[JENKINS] Solr-main-macOS (64bit/hotspot/jdk-23.0.2) - Build # 8710 - Unstable!
Build: https://jenkins.thetaphi.de/job/Solr-main-macOS/8710/
Java: 64bit/hotspot/jdk-23.0.2 -XX:+UseCompressedOops -XX:+UseParallelGC
2 tests failed.
FAILED: org.apache.solr.cloud.TestCloudConsistency.testOutOfSyncReplicasCannotBecomeLeaderAfterRestart
Error Message:
java.lang.Exception: Test abandoned because suite timeout was reached.
Stack Trace:
java.lang.Exception: Test abandoned because suite timeout was reached.
at __randomizedtesting.SeedInfo.seed([AB86BBD7F4265288]:0)
FAILED: org.apache.solr.cloud.TestCloudConsistency.classMethod
Error Message:
java.lang.Exception: Suite timeout exceeded (>= 7200000 msec).
Stack Trace:
java.lang.Exception: Suite timeout exceeded (>= 7200000 msec).
at __randomizedtesting.SeedInfo.seed([AB86BBD7F4265288]:0)