You are viewing a plain text version of this content. The canonical link for it is here.
Posted to dev@lucene.apache.org by Apache Jenkins Server <je...@builds.apache.org> on 2017/05/10 17:17:05 UTC

[JENKINS] Lucene-Solr-NightlyTests-6.x - Build # 345 - Still Unstable

Build: https://builds.apache.org/job/Lucene-Solr-NightlyTests-6.x/345/

2 tests failed.
FAILED:  org.apache.solr.cloud.TestStressCloudBlindAtomicUpdates.test_dv

Error Message:
java.lang.RuntimeException: Error from server at http://127.0.0.1:38858/solr/test_col: Async exception during distributed update: Error from server at http://127.0.0.1:57777/solr/test_col_shard1_replica1: Server Error    request: http://127.0.0.1:57777/solr/test_col_shard1_replica1/update?update.distrib=TOLEADER&distrib.from=http%3A%2F%2F127.0.0.1%3A38858%2Fsolr%2Ftest_col_shard2_replica2%2F&wt=javabin&version=2 Remote error message: Failed synchronous update on shard StdNode: http://127.0.0.1:46265/solr/test_col_shard1_replica2/ update: org.apache.solr.client.solrj.request.UpdateRequest@4f046945

Stack Trace:
java.util.concurrent.ExecutionException: java.lang.RuntimeException: Error from server at http://127.0.0.1:38858/solr/test_col: Async exception during distributed update: Error from server at http://127.0.0.1:57777/solr/test_col_shard1_replica1: Server Error



request: http://127.0.0.1:57777/solr/test_col_shard1_replica1/update?update.distrib=TOLEADER&distrib.from=http%3A%2F%2F127.0.0.1%3A38858%2Fsolr%2Ftest_col_shard2_replica2%2F&wt=javabin&version=2
Remote error message: Failed synchronous update on shard StdNode: http://127.0.0.1:46265/solr/test_col_shard1_replica2/ update: org.apache.solr.client.solrj.request.UpdateRequest@4f046945
	at __randomizedtesting.SeedInfo.seed([14D79D4EC8D64DB9:22C3FF08428B77A8]:0)
	at java.util.concurrent.FutureTask.report(FutureTask.java:122)
	at java.util.concurrent.FutureTask.get(FutureTask.java:192)
	at org.apache.solr.cloud.TestStressCloudBlindAtomicUpdates.checkField(TestStressCloudBlindAtomicUpdates.java:281)
	at org.apache.solr.cloud.TestStressCloudBlindAtomicUpdates.test_dv(TestStressCloudBlindAtomicUpdates.java:193)
	at sun.reflect.NativeMethodAccessorImpl.invoke0(Native Method)
	at sun.reflect.NativeMethodAccessorImpl.invoke(NativeMethodAccessorImpl.java:62)
	at sun.reflect.DelegatingMethodAccessorImpl.invoke(DelegatingMethodAccessorImpl.java:43)
	at java.lang.reflect.Method.invoke(Method.java:498)
	at com.carrotsearch.randomizedtesting.RandomizedRunner.invoke(RandomizedRunner.java:1713)
	at com.carrotsearch.randomizedtesting.RandomizedRunner$8.evaluate(RandomizedRunner.java:907)
	at com.carrotsearch.randomizedtesting.RandomizedRunner$9.evaluate(RandomizedRunner.java:943)
	at com.carrotsearch.randomizedtesting.RandomizedRunner$10.evaluate(RandomizedRunner.java:957)
	at com.carrotsearch.randomizedtesting.rules.SystemPropertiesRestoreRule$1.evaluate(SystemPropertiesRestoreRule.java:57)
	at org.apache.lucene.util.TestRuleSetupTeardownChained$1.evaluate(TestRuleSetupTeardownChained.java:49)
	at org.apache.lucene.util.AbstractBeforeAfterRule$1.evaluate(AbstractBeforeAfterRule.java:45)
	at org.apache.lucene.util.TestRuleThreadAndTestName$1.evaluate(TestRuleThreadAndTestName.java:48)
	at org.apache.lucene.util.TestRuleIgnoreAfterMaxFailures$1.evaluate(TestRuleIgnoreAfterMaxFailures.java:64)
	at org.apache.lucene.util.TestRuleMarkFailure$1.evaluate(TestRuleMarkFailure.java:47)
	at com.carrotsearch.randomizedtesting.rules.StatementAdapter.evaluate(StatementAdapter.java:36)
	at com.carrotsearch.randomizedtesting.ThreadLeakControl$StatementRunner.run(ThreadLeakControl.java:368)
	at com.carrotsearch.randomizedtesting.ThreadLeakControl.forkTimeoutingTask(ThreadLeakControl.java:817)
	at com.carrotsearch.randomizedtesting.ThreadLeakControl$3.evaluate(ThreadLeakControl.java:468)
	at com.carrotsearch.randomizedtesting.RandomizedRunner.runSingleTest(RandomizedRunner.java:916)
	at com.carrotsearch.randomizedtesting.RandomizedRunner$5.evaluate(RandomizedRunner.java:802)
	at com.carrotsearch.randomizedtesting.RandomizedRunner$6.evaluate(RandomizedRunner.java:852)
	at com.carrotsearch.randomizedtesting.RandomizedRunner$7.evaluate(RandomizedRunner.java:863)
	at com.carrotsearch.randomizedtesting.rules.StatementAdapter.evaluate(StatementAdapter.java:36)
	at com.carrotsearch.randomizedtesting.rules.SystemPropertiesRestoreRule$1.evaluate(SystemPropertiesRestoreRule.java:57)
	at org.apache.lucene.util.AbstractBeforeAfterRule$1.evaluate(AbstractBeforeAfterRule.java:45)
	at com.carrotsearch.randomizedtesting.rules.StatementAdapter.evaluate(StatementAdapter.java:36)
	at org.apache.lucene.util.TestRuleStoreClassName$1.evaluate(TestRuleStoreClassName.java:41)
	at com.carrotsearch.randomizedtesting.rules.NoShadowingOrOverridesOnMethodsRule$1.evaluate(NoShadowingOrOverridesOnMethodsRule.java:40)
	at com.carrotsearch.randomizedtesting.rules.NoShadowingOrOverridesOnMethodsRule$1.evaluate(NoShadowingOrOverridesOnMethodsRule.java:40)
	at com.carrotsearch.randomizedtesting.rules.StatementAdapter.evaluate(StatementAdapter.java:36)
	at com.carrotsearch.randomizedtesting.rules.StatementAdapter.evaluate(StatementAdapter.java:36)
	at com.carrotsearch.randomizedtesting.rules.StatementAdapter.evaluate(StatementAdapter.java:36)
	at org.apache.lucene.util.TestRuleAssertionsRequired$1.evaluate(TestRuleAssertionsRequired.java:53)
	at org.apache.lucene.util.TestRuleMarkFailure$1.evaluate(TestRuleMarkFailure.java:47)
	at org.apache.lucene.util.TestRuleIgnoreAfterMaxFailures$1.evaluate(TestRuleIgnoreAfterMaxFailures.java:64)
	at org.apache.lucene.util.TestRuleIgnoreTestSuites$1.evaluate(TestRuleIgnoreTestSuites.java:54)
	at com.carrotsearch.randomizedtesting.rules.StatementAdapter.evaluate(StatementAdapter.java:36)
	at com.carrotsearch.randomizedtesting.ThreadLeakControl$StatementRunner.run(ThreadLeakControl.java:368)
	at java.lang.Thread.run(Thread.java:745)
Caused by: java.lang.RuntimeException: Error from server at http://127.0.0.1:38858/solr/test_col: Async exception during distributed update: Error from server at http://127.0.0.1:57777/solr/test_col_shard1_replica1: Server Error



request: http://127.0.0.1:57777/solr/test_col_shard1_replica1/update?update.distrib=TOLEADER&distrib.from=http%3A%2F%2F127.0.0.1%3A38858%2Fsolr%2Ftest_col_shard2_replica2%2F&wt=javabin&version=2
Remote error message: Failed synchronous update on shard StdNode: http://127.0.0.1:46265/solr/test_col_shard1_replica2/ update: org.apache.solr.client.solrj.request.UpdateRequest@4f046945
	at org.apache.solr.cloud.TestStressCloudBlindAtomicUpdates$Worker.run(TestStressCloudBlindAtomicUpdates.java:409)
	at java.util.concurrent.Executors$RunnableAdapter.call(Executors.java:511)
	at java.util.concurrent.FutureTask.run(FutureTask.java:266)
	at org.apache.solr.common.util.ExecutorUtil$MDCAwareThreadPoolExecutor.lambda$execute$0(ExecutorUtil.java:229)
	at java.util.concurrent.ThreadPoolExecutor.runWorker(ThreadPoolExecutor.java:1142)
	at java.util.concurrent.ThreadPoolExecutor$Worker.run(ThreadPoolExecutor.java:617)
	... 1 more
Caused by: org.apache.solr.client.solrj.impl.HttpSolrClient$RemoteSolrException: Error from server at http://127.0.0.1:38858/solr/test_col: Async exception during distributed update: Error from server at http://127.0.0.1:57777/solr/test_col_shard1_replica1: Server Error



request: http://127.0.0.1:57777/solr/test_col_shard1_replica1/update?update.distrib=TOLEADER&distrib.from=http%3A%2F%2F127.0.0.1%3A38858%2Fsolr%2Ftest_col_shard2_replica2%2F&wt=javabin&version=2
Remote error message: Failed synchronous update on shard StdNode: http://127.0.0.1:46265/solr/test_col_shard1_replica2/ update: org.apache.solr.client.solrj.request.UpdateRequest@4f046945
	at org.apache.solr.client.solrj.impl.HttpSolrClient.executeMethod(HttpSolrClient.java:610)
	at org.apache.solr.client.solrj.impl.HttpSolrClient.request(HttpSolrClient.java:279)
	at org.apache.solr.client.solrj.impl.HttpSolrClient.request(HttpSolrClient.java:268)
	at org.apache.solr.client.solrj.SolrRequest.process(SolrRequest.java:160)
	at org.apache.solr.client.solrj.SolrRequest.process(SolrRequest.java:177)
	at org.apache.solr.cloud.TestStressCloudBlindAtomicUpdates$Worker.doRandomAtomicUpdate(TestStressCloudBlindAtomicUpdates.java:368)
	at org.apache.solr.cloud.TestStressCloudBlindAtomicUpdates$Worker.run(TestStressCloudBlindAtomicUpdates.java:397)
	... 6 more


FAILED:  org.apache.solr.cloud.hdfs.StressHdfsTest.test

Error Message:
Timeout occured while waiting response from server at: http://127.0.0.1:53926

Stack Trace:
org.apache.solr.client.solrj.SolrServerException: Timeout occured while waiting response from server at: http://127.0.0.1:53926
	at __randomizedtesting.SeedInfo.seed([14D79D4EC8D64DB9:9C83A294662A2041]:0)
	at org.apache.solr.client.solrj.impl.HttpSolrClient.executeMethod(HttpSolrClient.java:621)
	at org.apache.solr.client.solrj.impl.HttpSolrClient.request(HttpSolrClient.java:279)
	at org.apache.solr.client.solrj.impl.HttpSolrClient.request(HttpSolrClient.java:268)
	at org.apache.solr.client.solrj.impl.LBHttpSolrClient.doRequest(LBHttpSolrClient.java:447)
	at org.apache.solr.client.solrj.impl.LBHttpSolrClient.request(LBHttpSolrClient.java:388)
	at org.apache.solr.client.solrj.impl.CloudSolrClient.sendRequest(CloudSolrClient.java:1383)
	at org.apache.solr.client.solrj.impl.CloudSolrClient.requestWithRetryOnStaleState(CloudSolrClient.java:1134)
	at org.apache.solr.client.solrj.impl.CloudSolrClient.request(CloudSolrClient.java:1073)
	at org.apache.solr.client.solrj.SolrClient.request(SolrClient.java:1219)
	at org.apache.solr.cloud.hdfs.StressHdfsTest.createAndDeleteCollection(StressHdfsTest.java:220)
	at org.apache.solr.cloud.hdfs.StressHdfsTest.test(StressHdfsTest.java:103)
	at sun.reflect.NativeMethodAccessorImpl.invoke0(Native Method)
	at sun.reflect.NativeMethodAccessorImpl.invoke(NativeMethodAccessorImpl.java:62)
	at sun.reflect.DelegatingMethodAccessorImpl.invoke(DelegatingMethodAccessorImpl.java:43)
	at java.lang.reflect.Method.invoke(Method.java:498)
	at com.carrotsearch.randomizedtesting.RandomizedRunner.invoke(RandomizedRunner.java:1713)
	at com.carrotsearch.randomizedtesting.RandomizedRunner$8.evaluate(RandomizedRunner.java:907)
	at com.carrotsearch.randomizedtesting.RandomizedRunner$9.evaluate(RandomizedRunner.java:943)
	at com.carrotsearch.randomizedtesting.RandomizedRunner$10.evaluate(RandomizedRunner.java:957)
	at org.apache.solr.BaseDistributedSearchTestCase$ShardsRepeatRule$ShardsFixedStatement.callStatement(BaseDistributedSearchTestCase.java:992)
	at org.apache.solr.BaseDistributedSearchTestCase$ShardsRepeatRule$ShardsStatement.evaluate(BaseDistributedSearchTestCase.java:967)
	at com.carrotsearch.randomizedtesting.rules.SystemPropertiesRestoreRule$1.evaluate(SystemPropertiesRestoreRule.java:57)
	at org.apache.lucene.util.TestRuleSetupTeardownChained$1.evaluate(TestRuleSetupTeardownChained.java:49)
	at org.apache.lucene.util.AbstractBeforeAfterRule$1.evaluate(AbstractBeforeAfterRule.java:45)
	at org.apache.lucene.util.TestRuleThreadAndTestName$1.evaluate(TestRuleThreadAndTestName.java:48)
	at org.apache.lucene.util.TestRuleIgnoreAfterMaxFailures$1.evaluate(TestRuleIgnoreAfterMaxFailures.java:64)
	at org.apache.lucene.util.TestRuleMarkFailure$1.evaluate(TestRuleMarkFailure.java:47)
	at com.carrotsearch.randomizedtesting.rules.StatementAdapter.evaluate(StatementAdapter.java:36)
	at com.carrotsearch.randomizedtesting.ThreadLeakControl$StatementRunner.run(ThreadLeakControl.java:368)
	at com.carrotsearch.randomizedtesting.ThreadLeakControl.forkTimeoutingTask(ThreadLeakControl.java:817)
	at com.carrotsearch.randomizedtesting.ThreadLeakControl$3.evaluate(ThreadLeakControl.java:468)
	at com.carrotsearch.randomizedtesting.RandomizedRunner.runSingleTest(RandomizedRunner.java:916)
	at com.carrotsearch.randomizedtesting.RandomizedRunner$5.evaluate(RandomizedRunner.java:802)
	at com.carrotsearch.randomizedtesting.RandomizedRunner$6.evaluate(RandomizedRunner.java:852)
	at com.carrotsearch.randomizedtesting.RandomizedRunner$7.evaluate(RandomizedRunner.java:863)
	at com.carrotsearch.randomizedtesting.rules.StatementAdapter.evaluate(StatementAdapter.java:36)
	at com.carrotsearch.randomizedtesting.rules.SystemPropertiesRestoreRule$1.evaluate(SystemPropertiesRestoreRule.java:57)
	at org.apache.lucene.util.AbstractBeforeAfterRule$1.evaluate(AbstractBeforeAfterRule.java:45)
	at com.carrotsearch.randomizedtesting.rules.StatementAdapter.evaluate(StatementAdapter.java:36)
	at org.apache.lucene.util.TestRuleStoreClassName$1.evaluate(TestRuleStoreClassName.java:41)
	at com.carrotsearch.randomizedtesting.rules.NoShadowingOrOverridesOnMethodsRule$1.evaluate(NoShadowingOrOverridesOnMethodsRule.java:40)
	at com.carrotsearch.randomizedtesting.rules.NoShadowingOrOverridesOnMethodsRule$1.evaluate(NoShadowingOrOverridesOnMethodsRule.java:40)
	at com.carrotsearch.randomizedtesting.rules.StatementAdapter.evaluate(StatementAdapter.java:36)
	at com.carrotsearch.randomizedtesting.rules.StatementAdapter.evaluate(StatementAdapter.java:36)
	at com.carrotsearch.randomizedtesting.rules.StatementAdapter.evaluate(StatementAdapter.java:36)
	at org.apache.lucene.util.TestRuleAssertionsRequired$1.evaluate(TestRuleAssertionsRequired.java:53)
	at org.apache.lucene.util.TestRuleMarkFailure$1.evaluate(TestRuleMarkFailure.java:47)
	at org.apache.lucene.util.TestRuleIgnoreAfterMaxFailures$1.evaluate(TestRuleIgnoreAfterMaxFailures.java:64)
	at org.apache.lucene.util.TestRuleIgnoreTestSuites$1.evaluate(TestRuleIgnoreTestSuites.java:54)
	at com.carrotsearch.randomizedtesting.rules.StatementAdapter.evaluate(StatementAdapter.java:36)
	at com.carrotsearch.randomizedtesting.ThreadLeakControl$StatementRunner.run(ThreadLeakControl.java:368)
	at java.lang.Thread.run(Thread.java:745)
Caused by: java.net.SocketTimeoutException: Read timed out
	at java.net.SocketInputStream.socketRead0(Native Method)
	at java.net.SocketInputStream.socketRead(SocketInputStream.java:116)
	at java.net.SocketInputStream.read(SocketInputStream.java:171)
	at java.net.SocketInputStream.read(SocketInputStream.java:141)
	at org.apache.http.impl.io.AbstractSessionInputBuffer.fillBuffer(AbstractSessionInputBuffer.java:160)
	at org.apache.http.impl.io.SocketInputBuffer.fillBuffer(SocketInputBuffer.java:84)
	at org.apache.http.impl.io.AbstractSessionInputBuffer.readLine(AbstractSessionInputBuffer.java:273)
	at org.apache.http.impl.conn.DefaultHttpResponseParser.parseHead(DefaultHttpResponseParser.java:140)
	at org.apache.http.impl.conn.DefaultHttpResponseParser.parseHead(DefaultHttpResponseParser.java:57)
	at org.apache.http.impl.io.AbstractMessageParser.parse(AbstractMessageParser.java:261)
	at org.apache.http.impl.AbstractHttpClientConnection.receiveResponseHeader(AbstractHttpClientConnection.java:283)
	at org.apache.http.impl.conn.DefaultClientConnection.receiveResponseHeader(DefaultClientConnection.java:251)
	at org.apache.http.impl.conn.ManagedClientConnectionImpl.receiveResponseHeader(ManagedClientConnectionImpl.java:197)
	at org.apache.http.protocol.HttpRequestExecutor.doReceiveResponse(HttpRequestExecutor.java:272)
	at org.apache.http.protocol.HttpRequestExecutor.execute(HttpRequestExecutor.java:124)
	at org.apache.http.impl.client.DefaultRequestDirector.tryExecute(DefaultRequestDirector.java:685)
	at org.apache.http.impl.client.DefaultRequestDirector.execute(DefaultRequestDirector.java:487)
	at org.apache.http.impl.client.AbstractHttpClient.doExecute(AbstractHttpClient.java:882)
	at org.apache.http.impl.client.CloseableHttpClient.execute(CloseableHttpClient.java:82)
	at org.apache.http.impl.client.CloseableHttpClient.execute(CloseableHttpClient.java:55)
	at org.apache.solr.client.solrj.impl.HttpSolrClient.executeMethod(HttpSolrClient.java:515)
	... 51 more




Build Log:
[...truncated 12342 lines...]
   [junit4] Suite: org.apache.solr.cloud.hdfs.StressHdfsTest
   [junit4]   2> Creating dataDir: /x1/jenkins/jenkins-slave/workspace/Lucene-Solr-NightlyTests-6.x/checkout/solr/build/solr-core/test/J2/temp/solr.cloud.hdfs.StressHdfsTest_14D79D4EC8D64DB9-001/init-core-data-001
   [junit4]   2> 1850752 WARN  (SUITE-StressHdfsTest-seed#[14D79D4EC8D64DB9]-worker) [    ] o.a.s.SolrTestCaseJ4 startTrackingSearchers: numOpens=17 numCloses=17
   [junit4]   2> 1850753 INFO  (SUITE-StressHdfsTest-seed#[14D79D4EC8D64DB9]-worker) [    ] o.a.s.SolrTestCaseJ4 Using PointFields
   [junit4]   2> 1850754 INFO  (SUITE-StressHdfsTest-seed#[14D79D4EC8D64DB9]-worker) [    ] o.a.s.SolrTestCaseJ4 Randomized ssl (false) and clientAuth (false) via: @org.apache.solr.SolrTestCaseJ4$SuppressSSL(bugUrl=https://issues.apache.org/jira/browse/SOLR-5776)
   [junit4]   2> 1850754 INFO  (SUITE-StressHdfsTest-seed#[14D79D4EC8D64DB9]-worker) [    ] o.a.s.BaseDistributedSearchTestCase Setting hostContext system property: /
   [junit4]   1> Formatting using clusterid: testClusterID
   [junit4]   2> 1850819 WARN  (SUITE-StressHdfsTest-seed#[14D79D4EC8D64DB9]-worker) [    ] o.a.h.m.i.MetricsConfig Cannot locate configuration: tried hadoop-metrics2-namenode.properties,hadoop-metrics2.properties
   [junit4]   2> 1850841 WARN  (SUITE-StressHdfsTest-seed#[14D79D4EC8D64DB9]-worker) [    ] o.a.h.h.HttpRequestLog Jetty request log can only be enabled using Log4j
   [junit4]   2> 1850846 INFO  (SUITE-StressHdfsTest-seed#[14D79D4EC8D64DB9]-worker) [    ] o.m.log jetty-6.1.26
   [junit4]   2> 1850877 INFO  (SUITE-StressHdfsTest-seed#[14D79D4EC8D64DB9]-worker) [    ] o.m.log Extract jar:file:/x1/jenkins/.ivy2/cache/org.apache.hadoop/hadoop-hdfs/tests/hadoop-hdfs-2.7.2-tests.jar!/webapps/hdfs to ./temp/Jetty_localhost_49953_hdfs____.phz5no/webapp
   [junit4]   2> 1851214 INFO  (SUITE-StressHdfsTest-seed#[14D79D4EC8D64DB9]-worker) [    ] o.m.log Started HttpServer2$SelectChannelConnectorWithSafeStartup@localhost:49953
   [junit4]   2> 1851271 WARN  (SUITE-StressHdfsTest-seed#[14D79D4EC8D64DB9]-worker) [    ] o.a.h.h.HttpRequestLog Jetty request log can only be enabled using Log4j
   [junit4]   2> 1851276 INFO  (SUITE-StressHdfsTest-seed#[14D79D4EC8D64DB9]-worker) [    ] o.m.log jetty-6.1.26
   [junit4]   2> 1851293 INFO  (SUITE-StressHdfsTest-seed#[14D79D4EC8D64DB9]-worker) [    ] o.m.log Extract jar:file:/x1/jenkins/.ivy2/cache/org.apache.hadoop/hadoop-hdfs/tests/hadoop-hdfs-2.7.2-tests.jar!/webapps/datanode to ./temp/Jetty_localhost_58962_datanode____.9kh4h3/webapp
   [junit4]   2> 1851667 INFO  (SUITE-StressHdfsTest-seed#[14D79D4EC8D64DB9]-worker) [    ] o.m.log Started HttpServer2$SelectChannelConnectorWithSafeStartup@localhost:58962
   [junit4]   2> 1851722 WARN  (SUITE-StressHdfsTest-seed#[14D79D4EC8D64DB9]-worker) [    ] o.a.h.h.HttpRequestLog Jetty request log can only be enabled using Log4j
   [junit4]   2> 1851724 INFO  (SUITE-StressHdfsTest-seed#[14D79D4EC8D64DB9]-worker) [    ] o.m.log jetty-6.1.26
   [junit4]   2> 1851736 INFO  (SUITE-StressHdfsTest-seed#[14D79D4EC8D64DB9]-worker) [    ] o.m.log Extract jar:file:/x1/jenkins/.ivy2/cache/org.apache.hadoop/hadoop-hdfs/tests/hadoop-hdfs-2.7.2-tests.jar!/webapps/datanode to ./temp/Jetty_localhost_41655_datanode____h6w6jk/webapp
   [junit4]   2> 1851766 INFO  (IPC Server handler 2 on 59770) [    ] BlockStateChange BLOCK* processReport: from storage DS-ac539bd4-ae85-4de6-8fdf-754114b347e5 node DatanodeRegistration(127.0.0.1:51713, datanodeUuid=c4ca2f55-08d7-437a-97d1-20955c8b26bd, infoPort=57912, infoSecurePort=0, ipcPort=44712, storageInfo=lv=-56;cid=testClusterID;nsid=527817052;c=0), blocks: 0, hasStaleStorage: true, processing time: 0 msecs
   [junit4]   2> 1851766 INFO  (IPC Server handler 2 on 59770) [    ] BlockStateChange BLOCK* processReport: from storage DS-8bb34c81-d392-437f-b071-43d377d56082 node DatanodeRegistration(127.0.0.1:51713, datanodeUuid=c4ca2f55-08d7-437a-97d1-20955c8b26bd, infoPort=57912, infoSecurePort=0, ipcPort=44712, storageInfo=lv=-56;cid=testClusterID;nsid=527817052;c=0), blocks: 0, hasStaleStorage: false, processing time: 0 msecs
   [junit4]   2> 1852105 INFO  (SUITE-StressHdfsTest-seed#[14D79D4EC8D64DB9]-worker) [    ] o.m.log Started HttpServer2$SelectChannelConnectorWithSafeStartup@localhost:41655
   [junit4]   2> 1852203 INFO  (IPC Server handler 8 on 59770) [    ] BlockStateChange BLOCK* processReport: from storage DS-325916dc-507f-471b-91b4-b63d28c137af node DatanodeRegistration(127.0.0.1:52552, datanodeUuid=c5f4ce09-5d9c-4664-b8a4-500576f62dd1, infoPort=44649, infoSecurePort=0, ipcPort=36048, storageInfo=lv=-56;cid=testClusterID;nsid=527817052;c=0), blocks: 0, hasStaleStorage: true, processing time: 0 msecs
   [junit4]   2> 1852203 INFO  (IPC Server handler 8 on 59770) [    ] BlockStateChange BLOCK* processReport: from storage DS-6d1f8695-b9e6-48fa-b38b-4d07c59aae0f node DatanodeRegistration(127.0.0.1:52552, datanodeUuid=c5f4ce09-5d9c-4664-b8a4-500576f62dd1, infoPort=44649, infoSecurePort=0, ipcPort=36048, storageInfo=lv=-56;cid=testClusterID;nsid=527817052;c=0), blocks: 0, hasStaleStorage: false, processing time: 0 msecs
   [junit4]   2> 1852258 INFO  (TEST-StressHdfsTest.test-seed#[14D79D4EC8D64DB9]) [    ] o.a.s.c.ZkTestServer STARTING ZK TEST SERVER
   [junit4]   2> 1852259 INFO  (Thread-10285) [    ] o.a.s.c.ZkTestServer client port:0.0.0.0/0.0.0.0:0
   [junit4]   2> 1852259 INFO  (Thread-10285) [    ] o.a.s.c.ZkTestServer Starting server
   [junit4]   2> 1852262 ERROR (Thread-10285) [    ] o.a.z.s.ZooKeeperServer ZKShutdownHandler is not registered, so ZooKeeper server won't take any action on ERROR or SHUTDOWN server state changes
   [junit4]   2> 1852359 INFO  (TEST-StressHdfsTest.test-seed#[14D79D4EC8D64DB9]) [    ] o.a.s.c.ZkTestServer start zk server on port:40645
   [junit4]   2> 1852373 INFO  (TEST-StressHdfsTest.test-seed#[14D79D4EC8D64DB9]) [    ] o.a.s.c.AbstractZkTestCase put /x1/jenkins/jenkins-slave/workspace/Lucene-Solr-NightlyTests-6.x/checkout/solr/core/src/test-files/solr/collection1/conf/solrconfig-tlog.xml to /configs/conf1/solrconfig.xml
   [junit4]   2> 1852375 INFO  (TEST-StressHdfsTest.test-seed#[14D79D4EC8D64DB9]) [    ] o.a.s.c.AbstractZkTestCase put /x1/jenkins/jenkins-slave/workspace/Lucene-Solr-NightlyTests-6.x/checkout/solr/core/src/test-files/solr/collection1/conf/schema.xml to /configs/conf1/schema.xml
   [junit4]   2> 1852378 INFO  (TEST-StressHdfsTest.test-seed#[14D79D4EC8D64DB9]) [    ] o.a.s.c.AbstractZkTestCase put /x1/jenkins/jenkins-slave/workspace/Lucene-Solr-NightlyTests-6.x/checkout/solr/core/src/test-files/solr/collection1/conf/solrconfig.snippet.randomindexconfig.xml to /configs/conf1/solrconfig.snippet.randomindexconfig.xml
   [junit4]   2> 1852379 INFO  (TEST-StressHdfsTest.test-seed#[14D79D4EC8D64DB9]) [    ] o.a.s.c.AbstractZkTestCase put /x1/jenkins/jenkins-slave/workspace/Lucene-Solr-NightlyTests-6.x/checkout/solr/core/src/test-files/solr/collection1/conf/stopwords.txt to /configs/conf1/stopwords.txt
   [junit4]   2> 1852381 INFO  (TEST-StressHdfsTest.test-seed#[14D79D4EC8D64DB9]) [    ] o.a.s.c.AbstractZkTestCase put /x1/jenkins/jenkins-slave/workspace/Lucene-Solr-NightlyTests-6.x/checkout/solr/core/src/test-files/solr/collection1/conf/protwords.txt to /configs/conf1/protwords.txt
   [junit4]   2> 1852382 INFO  (TEST-StressHdfsTest.test-seed#[14D79D4EC8D64DB9]) [    ] o.a.s.c.AbstractZkTestCase put /x1/jenkins/jenkins-slave/workspace/Lucene-Solr-NightlyTests-6.x/checkout/solr/core/src/test-files/solr/collection1/conf/currency.xml to /configs/conf1/currency.xml
   [junit4]   2> 1852383 INFO  (TEST-StressHdfsTest.test-seed#[14D79D4EC8D64DB9]) [    ] o.a.s.c.AbstractZkTestCase put /x1/jenkins/jenkins-slave/workspace/Lucene-Solr-NightlyTests-6.x/checkout/solr/core/src/test-files/solr/collection1/conf/enumsConfig.xml to /configs/conf1/enumsConfig.xml
   [junit4]   2> 1852385 INFO  (TEST-StressHdfsTest.test-seed#[14D79D4EC8D64DB9]) [    ] o.a.s.c.AbstractZkTestCase put /x1/jenkins/jenkins-slave/workspace/Lucene-Solr-NightlyTests-6.x/checkout/solr/core/src/test-files/solr/collection1/conf/open-exchange-rates.json to /configs/conf1/open-exchange-rates.json
   [junit4]   2> 1852386 INFO  (TEST-StressHdfsTest.test-seed#[14D79D4EC8D64DB9]) [    ] o.a.s.c.AbstractZkTestCase put /x1/jenkins/jenkins-slave/workspace/Lucene-Solr-NightlyTests-6.x/checkout/solr/core/src/test-files/solr/collection1/conf/mapping-ISOLatin1Accent.txt to /configs/conf1/mapping-ISOLatin1Accent.txt
   [junit4]   2> 1852387 INFO  (TEST-StressHdfsTest.test-seed#[14D79D4EC8D64DB9]) [    ] o.a.s.c.AbstractZkTestCase put /x1/jenkins/jenkins-slave/workspace/Lucene-Solr-NightlyTests-6.x/checkout/solr/core/src/test-files/solr/collection1/conf/old_synonyms.txt to /configs/conf1/old_synonyms.txt
   [junit4]   2> 1852389 INFO  (TEST-StressHdfsTest.test-seed#[14D79D4EC8D64DB9]) [    ] o.a.s.c.AbstractZkTestCase put /x1/jenkins/jenkins-slave/workspace/Lucene-Solr-NightlyTests-6.x/checkout/solr/core/src/test-files/solr/collection1/conf/synonyms.txt to /configs/conf1/synonyms.txt
   [junit4]   2> 1852498 INFO  (TEST-StressHdfsTest.test-seed#[14D79D4EC8D64DB9]) [    ] o.a.s.SolrTestCaseJ4 Writing core.properties file to /x1/jenkins/jenkins-slave/workspace/Lucene-Solr-NightlyTests-6.x/checkout/solr/build/solr-core/test/J2/temp/solr.cloud.hdfs.StressHdfsTest_14D79D4EC8D64DB9-001/control-001/cores/collection1
   [junit4]   2> 1852500 INFO  (TEST-StressHdfsTest.test-seed#[14D79D4EC8D64DB9]) [    ] o.e.j.s.Server jetty-9.3.14.v20161028
   [junit4]   2> 1852502 INFO  (TEST-StressHdfsTest.test-seed#[14D79D4EC8D64DB9]) [    ] o.e.j.s.h.ContextHandler Started o.e.j.s.ServletContextHandler@600ad72{/,null,AVAILABLE}
   [junit4]   2> 1852502 INFO  (TEST-StressHdfsTest.test-seed#[14D79D4EC8D64DB9]) [    ] o.e.j.s.AbstractConnector Started ServerConnector@20df7d62{HTTP/1.1,[http/1.1]}{127.0.0.1:46342}
   [junit4]   2> 1852502 INFO  (TEST-StressHdfsTest.test-seed#[14D79D4EC8D64DB9]) [    ] o.e.j.s.Server Started @1855472ms
   [junit4]   2> 1852502 INFO  (TEST-StressHdfsTest.test-seed#[14D79D4EC8D64DB9]) [    ] o.a.s.c.s.e.JettySolrRunner Jetty properties: {solr.data.dir=hdfs://localhost:59770/hdfs__localhost_59770__x1_jenkins_jenkins-slave_workspace_Lucene-Solr-NightlyTests-6.x_checkout_solr_build_solr-core_test_J2_temp_solr.cloud.hdfs.StressHdfsTest_14D79D4EC8D64DB9-001_tempDir-002_control_data, hostContext=/, hostPort=46342, coreRootDirectory=/x1/jenkins/jenkins-slave/workspace/Lucene-Solr-NightlyTests-6.x/checkout/solr/build/solr-core/test/J2/temp/solr.cloud.hdfs.StressHdfsTest_14D79D4EC8D64DB9-001/control-001/cores}
   [junit4]   2> 1852502 ERROR (TEST-StressHdfsTest.test-seed#[14D79D4EC8D64DB9]) [    ] o.a.s.s.StartupLoggingUtils Missing Java Option solr.log.dir. Logging may be missing or incomplete.
   [junit4]   2> 1852503 INFO  (TEST-StressHdfsTest.test-seed#[14D79D4EC8D64DB9]) [    ] o.a.s.s.SolrDispatchFilter  ___      _       Welcome to Apache Solr? version 6.6.0
   [junit4]   2> 1852503 INFO  (TEST-StressHdfsTest.test-seed#[14D79D4EC8D64DB9]) [    ] o.a.s.s.SolrDispatchFilter / __| ___| |_ _   Starting in cloud mode on port null
   [junit4]   2> 1852503 INFO  (TEST-StressHdfsTest.test-seed#[14D79D4EC8D64DB9]) [    ] o.a.s.s.SolrDispatchFilter \__ \/ _ \ | '_|  Install dir: null
   [junit4]   2> 1852503 INFO  (TEST-StressHdfsTest.test-seed#[14D79D4EC8D64DB9]) [    ] o.a.s.s.SolrDispatchFilter |___/\___/_|_|    Start time: 2017-05-10T16:09:30.058Z
   [junit4]   2> 1852510 INFO  (TEST-StressHdfsTest.test-seed#[14D79D4EC8D64DB9]) [    ] o.a.s.s.SolrDispatchFilter Loading solr.xml from SolrHome (not found in ZooKeeper)
   [junit4]   2> 1852510 INFO  (TEST-StressHdfsTest.test-seed#[14D79D4EC8D64DB9]) [    ] o.a.s.c.SolrXmlConfig Loading container configuration from /x1/jenkins/jenkins-slave/workspace/Lucene-Solr-NightlyTests-6.x/checkout/solr/build/solr-core/test/J2/temp/solr.cloud.hdfs.StressHdfsTest_14D79D4EC8D64DB9-001/control-001/solr.xml
   [junit4]   2> 1852517 INFO  (TEST-StressHdfsTest.test-seed#[14D79D4EC8D64DB9]) [    ] o.a.s.u.UpdateShardHandler Creating UpdateShardHandler HTTP client with params: socketTimeout=340000&connTimeout=45000&retry=true
   [junit4]   2> 1852518 INFO  (TEST-StressHdfsTest.test-seed#[14D79D4EC8D64DB9]) [    ] o.a.s.c.ZkContainer Zookeeper client=127.0.0.1:40645/solr
   [junit4]   2> 1852552 INFO  (TEST-StressHdfsTest.test-seed#[14D79D4EC8D64DB9]) [n:127.0.0.1:46342_    ] o.a.s.c.Overseer Overseer (id=null) closing
   [junit4]   2> 1852553 INFO  (TEST-StressHdfsTest.test-seed#[14D79D4EC8D64DB9]) [n:127.0.0.1:46342_    ] o.a.s.c.OverseerElectionContext I am going to be the leader 127.0.0.1:46342_
   [junit4]   2> 1852554 INFO  (TEST-StressHdfsTest.test-seed#[14D79D4EC8D64DB9]) [n:127.0.0.1:46342_    ] o.a.s.c.Overseer Overseer (id=97939132895395844-127.0.0.1:46342_-n_0000000000) starting
   [junit4]   2> 1852559 INFO  (TEST-StressHdfsTest.test-seed#[14D79D4EC8D64DB9]) [n:127.0.0.1:46342_    ] o.a.s.c.ZkController Register node as live in ZooKeeper:/live_nodes/127.0.0.1:46342_
   [junit4]   2> 1852560 INFO  (zkCallback-1481-thread-1-processing-n:127.0.0.1:46342_) [n:127.0.0.1:46342_    ] o.a.s.c.c.ZkStateReader Updated live nodes from ZooKeeper... (0) -> (1)
   [junit4]   2> 1852661 INFO  (TEST-StressHdfsTest.test-seed#[14D79D4EC8D64DB9]) [n:127.0.0.1:46342_    ] o.a.s.c.CorePropertiesLocator Found 1 core definitions underneath /x1/jenkins/jenkins-slave/workspace/Lucene-Solr-NightlyTests-6.x/checkout/solr/build/solr-core/test/J2/temp/solr.cloud.hdfs.StressHdfsTest_14D79D4EC8D64DB9-001/control-001/cores
   [junit4]   2> 1852661 INFO  (TEST-StressHdfsTest.test-seed#[14D79D4EC8D64DB9]) [n:127.0.0.1:46342_    ] o.a.s.c.CorePropertiesLocator Cores are: [collection1]
   [junit4]   2> 1852662 INFO  (coreLoadExecutor-3375-thread-1-processing-n:127.0.0.1:46342_) [n:127.0.0.1:46342_ c:control_collection   x:collection1] o.a.s.c.TransientSolrCoreCacheDefault Allocating transient cache for 4 transient cores
   [junit4]   2> 1852665 INFO  (OverseerStateUpdate-97939132895395844-127.0.0.1:46342_-n_0000000000) [n:127.0.0.1:46342_    ] o.a.s.c.o.ReplicaMutator Assigning new node to shard shard=shard1
   [junit4]   2> 1852693 WARN  (coreLoadExecutor-3375-thread-1-processing-n:127.0.0.1:46342_) [n:127.0.0.1:46342_ c:control_collection   x:collection1] o.a.s.c.Config Beginning with Solr 5.5, <mergePolicy> is deprecated, use <mergePolicyFactory> instead.
   [junit4]   2> 1852694 INFO  (coreLoadExecutor-3375-thread-1-processing-n:127.0.0.1:46342_) [n:127.0.0.1:46342_ c:control_collection   x:collection1] o.a.s.c.SolrConfig Using Lucene MatchVersion: 6.6.0
   [junit4]   2> 1852722 INFO  (coreLoadExecutor-3375-thread-1-processing-n:127.0.0.1:46342_) [n:127.0.0.1:46342_ c:control_collection   x:collection1] o.a.s.s.IndexSchema [collection1] Schema name=test
   [junit4]   2> 1852847 INFO  (coreLoadExecutor-3375-thread-1-processing-n:127.0.0.1:46342_) [n:127.0.0.1:46342_ c:control_collection   x:collection1] o.a.s.s.IndexSchema Loaded schema test/1.0 with uniqueid field id
   [junit4]   2> 1852862 INFO  (coreLoadExecutor-3375-thread-1-processing-n:127.0.0.1:46342_) [n:127.0.0.1:46342_ c:control_collection   x:collection1] o.a.s.c.CoreContainer Creating SolrCore 'collection1' using configuration from collection control_collection, trusted=true
   [junit4]   2> 1852862 INFO  (coreLoadExecutor-3375-thread-1-processing-n:127.0.0.1:46342_) [n:127.0.0.1:46342_ c:control_collection   x:collection1] o.a.s.c.HdfsDirectoryFactory solr.hdfs.home=hdfs://localhost:59770/solr_hdfs_home
   [junit4]   2> 1852862 INFO  (coreLoadExecutor-3375-thread-1-processing-n:127.0.0.1:46342_) [n:127.0.0.1:46342_ c:control_collection   x:collection1] o.a.s.c.HdfsDirectoryFactory Solr Kerberos Authentication disabled
   [junit4]   2> 1852863 INFO  (coreLoadExecutor-3375-thread-1-processing-n:127.0.0.1:46342_) [n:127.0.0.1:46342_ c:control_collection   x:collection1] o.a.s.c.SolrCore solr.RecoveryStrategy.Builder
   [junit4]   2> 1852863 INFO  (coreLoadExecutor-3375-thread-1-processing-n:127.0.0.1:46342_) [n:127.0.0.1:46342_ c:control_collection   x:collection1] o.a.s.c.SolrCore [[collection1] ] Opening new SolrCore at [/x1/jenkins/jenkins-slave/workspace/Lucene-Solr-NightlyTests-6.x/checkout/solr/build/solr-core/test/J2/temp/solr.cloud.hdfs.StressHdfsTest_14D79D4EC8D64DB9-001/control-001/cores/collection1], dataDir=[hdfs://localhost:59770/solr_hdfs_home/control_collection/core_node1/data/]
   [junit4]   2> 1852863 INFO  (coreLoadExecutor-3375-thread-1-processing-n:127.0.0.1:46342_) [n:127.0.0.1:46342_ c:control_collection   x:collection1] o.a.s.c.JmxMonitoredMap JMX monitoring is enabled. Adding Solr mbeans to JMX Server: com.sun.jmx.mbeanserver.JmxMBeanServer@1b311032
   [junit4]   2> 1852863 INFO  (coreLoadExecutor-3375-thread-1-processing-n:127.0.0.1:46342_) [n:127.0.0.1:46342_ c:control_collection   x:collection1] o.a.s.c.HdfsDirectoryFactory creating directory factory for path hdfs://localhost:59770/solr_hdfs_home/control_collection/core_node1/data/snapshot_metadata
   [junit4]   2> 1852874 INFO  (coreLoadExecutor-3375-thread-1-processing-n:127.0.0.1:46342_) [n:127.0.0.1:46342_ c:control_collection   x:collection1] o.a.s.c.HdfsDirectoryFactory Number of slabs of block cache [1] with direct memory allocation set to [true]
   [junit4]   2> 1852874 INFO  (coreLoadExecutor-3375-thread-1-processing-n:127.0.0.1:46342_) [n:127.0.0.1:46342_ c:control_collection   x:collection1] o.a.s.c.HdfsDirectoryFactory Block cache target memory usage, slab size of [8388608] will allocate [1] slabs and use ~[8388608] bytes
   [junit4]   2> 1852874 INFO  (coreLoadExecutor-3375-thread-1-processing-n:127.0.0.1:46342_) [n:127.0.0.1:46342_ c:control_collection   x:collection1] o.a.s.c.HdfsDirectoryFactory Creating new single instance HDFS BlockCache
   [junit4]   2> 1852885 WARN  (coreLoadExecutor-3375-thread-1-processing-n:127.0.0.1:46342_) [n:127.0.0.1:46342_ c:control_collection   x:collection1] o.a.s.s.h.HdfsDirectory The NameNode is in SafeMode - Solr will wait 5 seconds and try again.
   [junit4]   2> 1857888 INFO  (coreLoadExecutor-3375-thread-1-processing-n:127.0.0.1:46342_) [n:127.0.0.1:46342_ c:control_collection   x:collection1] o.a.s.s.b.BlockDirectory Block cache on write is disabled
   [junit4]   2> 1857893 INFO  (coreLoadExecutor-3375-thread-1-processing-n:127.0.0.1:46342_) [n:127.0.0.1:46342_ c:control_collection   x:collection1] o.a.s.c.HdfsDirectoryFactory creating directory factory for path hdfs://localhost:59770/solr_hdfs_home/control_collection/core_node1/data
   [junit4]   2> 1857926 INFO  (coreLoadExecutor-3375-thread-1-processing-n:127.0.0.1:46342_) [n:127.0.0.1:46342_ c:control_collection   x:collection1] o.a.s.c.HdfsDirectoryFactory creating directory factory for path hdfs://localhost:59770/solr_hdfs_home/control_collection/core_node1/data/index
   [junit4]   2> 1857933 INFO  (coreLoadExecutor-3375-thread-1-processing-n:127.0.0.1:46342_) [n:127.0.0.1:46342_ c:control_collection   x:collection1] o.a.s.c.HdfsDirectoryFactory Number of slabs of block cache [1] with direct memory allocation set to [true]
   [junit4]   2> 1857933 INFO  (coreLoadExecutor-3375-thread-1-processing-n:127.0.0.1:46342_) [n:127.0.0.1:46342_ c:control_collection   x:collection1] o.a.s.c.HdfsDirectoryFactory Block cache target memory usage, slab size of [8388608] will allocate [1] slabs and use ~[8388608] bytes
   [junit4]   2> 1857934 INFO  (coreLoadExecutor-3375-thread-1-processing-n:127.0.0.1:46342_) [n:127.0.0.1:46342_ c:control_collection   x:collection1] o.a.s.c.HdfsDirectoryFactory Creating new single instance HDFS BlockCache
   [junit4]   2> 1857944 INFO  (coreLoadExecutor-3375-thread-1-processing-n:127.0.0.1:46342_) [n:127.0.0.1:46342_ c:control_collection   x:collection1] o.a.s.s.b.BlockDirectory Block cache on write is disabled
   [junit4]   2> 1857947 INFO  (coreLoadExecutor-3375-thread-1-processing-n:127.0.0.1:46342_) [n:127.0.0.1:46342_ c:control_collection   x:collection1] o.a.s.u.RandomMergePolicy RandomMergePolicy wrapping class org.apache.lucene.index.TieredMergePolicy: [TieredMergePolicy: maxMergeAtOnce=39, maxMergeAtOnceExplicit=15, maxMergedSegmentMB=19.7509765625, floorSegmentMB=0.53125, forceMergeDeletesPctAllowed=13.028405312788948, segmentsPerTier=4.0, maxCFSSegmentSizeMB=8.796093022207999E12, noCFSRatio=0.0
   [junit4]   2> 1858073 INFO  (IPC Server handler 4 on 59770) [    ] BlockStateChange BLOCK* addStoredBlock: blockMap updated: 127.0.0.1:51713 is added to blk_1073741825_1001{UCState=UNDER_CONSTRUCTION, truncateBlock=null, primaryNodeIndex=-1, replicas=[ReplicaUC[[DISK]DS-6d1f8695-b9e6-48fa-b38b-4d07c59aae0f:NORMAL:127.0.0.1:52552|RBW], ReplicaUC[[DISK]DS-8bb34c81-d392-437f-b071-43d377d56082:NORMAL:127.0.0.1:51713|RBW]]} size 0
   [junit4]   2> 1858074 INFO  (IPC Server handler 5 on 59770) [    ] BlockStateChange BLOCK* addStoredBlock: blockMap updated: 127.0.0.1:52552 is added to blk_1073741825_1001{UCState=UNDER_CONSTRUCTION, truncateBlock=null, primaryNodeIndex=-1, replicas=[ReplicaUC[[DISK]DS-6d1f8695-b9e6-48fa-b38b-4d07c59aae0f:NORMAL:127.0.0.1:52552|RBW], ReplicaUC[[DISK]DS-8bb34c81-d392-437f-b071-43d377d56082:NORMAL:127.0.0.1:51713|RBW]]} size 0
   [junit4]   2> 1858085 WARN  (coreLoadExecutor-3375-thread-1-processing-n:127.0.0.1:46342_) [n:127.0.0.1:46342_ c:control_collection   x:collection1] o.a.s.c.RequestHandlers INVALID paramSet a in requestHandler {type = requestHandler,name = /dump,class = DumpRequestHandler,attributes = {initParams=a, name=/dump, class=DumpRequestHandler},args = {defaults={a=A,b=B}}}
   [junit4]   2> 1858217 INFO  (coreLoadExecutor-3375-thread-1-processing-n:127.0.0.1:46342_) [n:127.0.0.1:46342_ c:control_collection   x:collection1] o.a.s.u.UpdateHandler Using UpdateLog implementation: org.apache.solr.update.HdfsUpdateLog
   [junit4]   2> 1858218 INFO  (coreLoadExecutor-3375-thread-1-processing-n:127.0.0.1:46342_) [n:127.0.0.1:46342_ c:control_collection   x:collection1] o.a.s.u.UpdateLog Initializing UpdateLog: dataDir= defaultSyncLevel=FLUSH numRecordsToKeep=100 maxNumLogsToKeep=10 numVersionBuckets=65536
   [junit4]   2> 1858218 INFO  (coreLoadExecutor-3375-thread-1-processing-n:127.0.0.1:46342_) [n:127.0.0.1:46342_ c:control_collection   x:collection1] o.a.s.u.HdfsUpdateLog Initializing HdfsUpdateLog: tlogDfsReplication=2
   [junit4]   2> 1858239 INFO  (coreLoadExecutor-3375-thread-1-processing-n:127.0.0.1:46342_) [n:127.0.0.1:46342_ c:control_collection   x:collection1] o.a.s.u.CommitTracker Hard AutoCommit: disabled
   [junit4]   2> 1858239 INFO  (coreLoadExecutor-3375-thread-1-processing-n:127.0.0.1:46342_) [n:127.0.0.1:46342_ c:control_collection   x:collection1] o.a.s.u.CommitTracker Soft AutoCommit: disabled
   [junit4]   2> 1858240 INFO  (coreLoadExecutor-3375-thread-1-processing-n:127.0.0.1:46342_) [n:127.0.0.1:46342_ c:control_collection   x:collection1] o.a.s.u.RandomMergePolicy RandomMergePolicy wrapping class org.apache.lucene.index.MockRandomMergePolicy: org.apache.lucene.index.MockRandomMergePolicy@7d87fa7a
   [junit4]   2> 1858267 INFO  (coreLoadExecutor-3375-thread-1-processing-n:127.0.0.1:46342_) [n:127.0.0.1:46342_ c:control_collection   x:collection1] o.a.s.s.SolrIndexSearcher Opening [Searcher@9046204[collection1] main]
   [junit4]   2> 1858268 INFO  (coreLoadExecutor-3375-thread-1-processing-n:127.0.0.1:46342_) [n:127.0.0.1:46342_ c:control_collection   x:collection1] o.a.s.r.ManagedResourceStorage Configured ZooKeeperStorageIO with znodeBase: /configs/conf1
   [junit4]   2> 1858268 INFO  (coreLoadExecutor-3375-thread-1-processing-n:127.0.0.1:46342_) [n:127.0.0.1:46342_ c:control_collection   x:collection1] o.a.s.r.ManagedResourceStorage Loaded null at path _rest_managed.json using ZooKeeperStorageIO:path=/configs/conf1
   [junit4]   2> 1858268 INFO  (coreLoadExecutor-3375-thread-1-processing-n:127.0.0.1:46342_) [n:127.0.0.1:46342_ c:control_collection   x:collection1] o.a.s.h.ReplicationHandler Commits will be reserved for  10000
   [junit4]   2> 1858270 INFO  (searcherExecutor-3376-thread-1-processing-n:127.0.0.1:46342_ x:collection1 c:control_collection) [n:127.0.0.1:46342_ c:control_collection   x:collection1] o.a.s.c.SolrCore [collection1] Registered new searcher Searcher@9046204[collection1] main{ExitableDirectoryReader(UninvertingDirectoryReader())}
   [junit4]   2> 1858274 INFO  (coreLoadExecutor-3375-thread-1-processing-n:127.0.0.1:46342_) [n:127.0.0.1:46342_ c:control_collection   x:collection1] o.a.s.u.UpdateLog Could not find max version in index or recent updates, using new clock 1567026132632469504
   [junit4]   2> 1858288 INFO  (coreZkRegister-3368-thread-1-processing-n:127.0.0.1:46342_ x:collection1 c:control_collection) [n:127.0.0.1:46342_ c:control_collection s:shard1 r:core_node1 x:collection1] o.a.s.c.ShardLeaderElectionContext Enough replicas found to continue.
   [junit4]   2> 1858288 INFO  (coreZkRegister-3368-thread-1-processing-n:127.0.0.1:46342_ x:collection1 c:control_collection) [n:127.0.0.1:46342_ c:control_collection s:shard1 r:core_node1 x:collection1] o.a.s.c.ShardLeaderElectionContext I may be the new leader - try and sync
   [junit4]   2> 1858288 INFO  (coreZkRegister-3368-thread-1-processing-n:127.0.0.1:46342_ x:collection1 c:control_collection) [n:127.0.0.1:46342_ c:control_collection s:shard1 r:core_node1 x:collection1] o.a.s.c.SyncStrategy Sync replicas to http://127.0.0.1:46342/collection1/
   [junit4]   2> 1858288 INFO  (coreZkRegister-3368-thread-1-processing-n:127.0.0.1:46342_ x:collection1 c:control_collection) [n:127.0.0.1:46342_ c:control_collection s:shard1 r:core_node1 x:collection1] o.a.s.c.SyncStrategy Sync Success - now sync replicas to me
   [junit4]   2> 1858288 INFO  (coreZkRegister-3368-thread-1-processing-n:127.0.0.1:46342_ x:collection1 c:control_collection) [n:127.0.0.1:46342_ c:control_collection s:shard1 r:core_node1 x:collection1] o.a.s.c.SyncStrategy http://127.0.0.1:46342/collection1/ has no replicas
   [junit4]   2> 1858288 INFO  (coreZkRegister-3368-thread-1-processing-n:127.0.0.1:46342_ x:collection1 c:control_collection) [n:127.0.0.1:46342_ c:control_collection s:shard1 r:core_node1 x:collection1] o.a.s.c.ShardLeaderElectionContext Found all replicas participating in election, clear LIR
   [junit4]   2> 1858293 INFO  (coreZkRegister-3368-thread-1-processing-n:127.0.0.1:46342_ x:collection1 c:control_collection) [n:127.0.0.1:46342_ c:control_collection s:shard1 r:core_node1 x:collection1] o.a.s.c.ShardLeaderElectionContext I am the new leader: http://127.0.0.1:46342/collection1/ shard1
   [junit4]   2> 1858448 INFO  (coreZkRegister-3368-thread-1-processing-n:127.0.0.1:46342_ x:collection1 c:control_collection) [n:127.0.0.1:46342_ c:control_collection s:shard1 r:core_node1 x:collection1] o.a.s.c.ZkController I am the leader, no recovery necessary
   [junit4]   2> 1858673 INFO  (TEST-StressHdfsTest.test-seed#[14D79D4EC8D64DB9]) [    ] o.a.s.c.c.ZkStateReader Updated live nodes from ZooKeeper... (0) -> (1)
   [junit4]   2> 1858674 INFO  (TEST-StressHdfsTest.test-seed#[14D79D4EC8D64DB9]) [    ] o.a.s.c.s.i.ZkClientClusterStateProvider Cluster at 127.0.0.1:40645/solr ready
   [junit4]   2> 1858674 INFO  (TEST-StressHdfsTest.test-seed#[14D79D4EC8D64DB9]) [    ] o.a.s.c.ChaosMonkey monkey: init - expire sessions:false cause connection loss:false
   [junit4]   2> 1858674 INFO  (TEST-StressHdfsTest.test-seed#[14D79D4EC8D64DB9]) [    ] o.a.s.c.AbstractFullDistribZkTestBase Creating collection1 with stateFormat=2
   [junit4]   2> 1858807 INFO  (TEST-StressHdfsTest.test-seed#[14D79D4EC8D64DB9]) [    ] o.a.s.SolrTestCaseJ4 Writing core.properties file to /x1/jenkins/jenkins-slave/workspace/Lucene-Solr-NightlyTests-6.x/checkout/solr/build/solr-core/test/J2/temp/solr.cloud.hdfs.StressHdfsTest_14D79D4EC8D64DB9-001/shard-1-001/cores/collection1
   [junit4]   2> 1858807 INFO  (TEST-StressHdfsTest.test-seed#[14D79D4EC8D64DB9]) [    ] o.a.s.c.AbstractFullDistribZkTestBase create jetty 1 in directory /x1/jenkins/jenkins-slave/workspace/Lucene-Solr-NightlyTests-6.x/checkout/solr/build/solr-core/test/J2/temp/solr.cloud.hdfs.StressHdfsTest_14D79D4EC8D64DB9-001/shard-1-001
   [junit4]   2> 1858808 INFO  (TEST-StressHdfsTest.test-seed#[14D79D4EC8D64DB9]) [    ] o.e.j.s.Server jetty-9.3.14.v20161028
   [junit4]   2> 1858810 INFO  (TEST-StressHdfsTest.test-seed#[14D79D4EC8D64DB9]) [    ] o.e.j.s.h.ContextHandler Started o.e.j.s.ServletContextHandler@6b1d9ee6{/,null,AVAILABLE}
   [junit4]   2> 1858811 INFO  (TEST-StressHdfsTest.test-seed#[14D79D4EC8D64DB9]) [    ] o.e.j.s.AbstractConnector Started ServerConnector@22756867{HTTP/1.1,[http/1.1]}{127.0.0.1:53926}
   [junit4]   2> 1858811 INFO  (TEST-StressHdfsTest.test-seed#[14D79D4EC8D64DB9]) [    ] o.e.j.s.Server Started @1861781ms
   [junit4]   2> 1858811 INFO  (TEST-StressHdfsTest.test-seed#[14D79D4EC8D64DB9]) [    ] o.a.s.c.s.e.JettySolrRunner Jetty properties: {solr.data.dir=hdfs://localhost:59770/hdfs__localhost_59770__x1_jenkins_jenkins-slave_workspace_Lucene-Solr-NightlyTests-6.x_checkout_solr_build_solr-core_test_J2_temp_solr.cloud.hdfs.StressHdfsTest_14D79D4EC8D64DB9-001_tempDir-002_jetty1, solrconfig=solrconfig.xml, hostContext=/, hostPort=53926, coreRootDirectory=/x1/jenkins/jenkins-slave/workspace/Lucene-Solr-NightlyTests-6.x/checkout/solr/build/solr-core/test/J2/../../../../../../../../../../../x1/jenkins/jenkins-slave/workspace/Lucene-Solr-NightlyTests-6.x/checkout/solr/build/solr-core/test/J2/temp/solr.cloud.hdfs.StressHdfsTest_14D79D4EC8D64DB9-001/shard-1-001/cores}
   [junit4]   2> 1858811 ERROR (TEST-StressHdfsTest.test-seed#[14D79D4EC8D64DB9]) [    ] o.a.s.s.StartupLoggingUtils Missing Java Option solr.log.dir. Logging may be missing or incomplete.
   [junit4]   2> 1858817 INFO  (TEST-StressHdfsTest.test-seed#[14D79D4EC8D64DB9]) [    ] o.a.s.s.SolrDispatchFilter  ___      _       Welcome to Apache Solr? version 6.6.0
   [junit4]   2> 1858817 INFO  (TEST-StressHdfsTest.test-seed#[14D79D4EC8D64DB9]) [    ] o.a.s.s.SolrDispatchFilter / __| ___| |_ _   Starting in cloud mode on port null
   [junit4]   2> 1858817 INFO  (TEST-StressHdfsTest.test-seed#[14D79D4EC8D64DB9]) [    ] o.a.s.s.SolrDispatchFilter \__ \/ _ \ | '_|  Install dir: null
   [junit4]   2> 1858817 INFO  (TEST-StressHdfsTest.test-seed#[14D79D4EC8D64DB9]) [    ] o.a.s.s.SolrDispatchFilter |___/\___/_|_|    Start time: 2017-05-10T16:09:36.372Z
   [junit4]   2> 1858840 INFO  (TEST-StressHdfsTest.test-seed#[14D79D4EC8D64DB9]) [    ] o.a.s.s.SolrDispatchFilter Loading solr.xml from SolrHome (not found in ZooKeeper)
   [junit4]   2> 1858840 INFO  (TEST-StressHdfsTest.test-seed#[14D79D4EC8D64DB9]) [    ] o.a.s.c.SolrXmlConfig Loading container configuration from /x1/jenkins/jenkins-slave/workspace/Lucene-Solr-NightlyTests-6.x/checkout/solr/build/solr-core/test/J2/temp/solr.cloud.hdfs.StressHdfsTest_14D79D4EC8D64DB9-001/shard-1-001/solr.xml
   [junit4]   2> 1858851 INFO  (TEST-StressHdfsTest.test-seed#[14D79D4EC8D64DB9]) [    ] o.a.s.u.UpdateShardHandler Creating UpdateShardHandler HTTP client with params: socketTimeout=340000&connTimeout=45000&retry=true
   [junit4]   2> 1858853 INFO  (TEST-StressHdfsTest.test-seed#[14D79D4EC8D64DB9]) [    ] o.a.s.c.ZkContainer Zookeeper client=127.0.0.1:40645/solr
   [junit4]   2> 1858892 INFO  (TEST-StressHdfsTest.test-seed#[14D79D4EC8D64DB9]) [n:127.0.0.1:53926_    ] o.a.s.c.c.ZkStateReader Updated live nodes from ZooKeeper... (0) -> (1)
   [junit4]   2> 1858894 INFO  (TEST-StressHdfsTest.test-seed#[14D79D4EC8D64DB9]) [n:127.0.0.1:53926_    ] o.a.s.c.Overseer Overseer (id=null) closing
   [junit4]   2> 1858896 INFO  (TEST-StressHdfsTest.test-seed#[14D79D4EC8D64DB9]) [n:127.0.0.1:53926_    ] o.a.s.c.ZkController Register node as live in ZooKeeper:/live_nodes/127.0.0.1:53926_
   [junit4]   2> 1858897 INFO  (zkCallback-1485-thread-1) [    ] o.a.s.c.c.ZkStateReader Updated live nodes from ZooKeeper... (1) -> (2)
   [junit4]   2> 1858897 INFO  (zkCallback-1481-thread-2-processing-n:127.0.0.1:46342_) [n:127.0.0.1:46342_    ] o.a.s.c.c.ZkStateReader Updated live nodes from ZooKeeper... (1) -> (2)
   [junit4]   2> 1858899 INFO  (zkCallback-1491-thread-1-processing-n:127.0.0.1:53926_) [n:127.0.0.1:53926_    ] o.a.s.c.c.ZkStateReader Updated live nodes from ZooKeeper... (1) -> (2)
   [junit4]   2> 1858997 INFO  (TEST-StressHdfsTest.test-seed#[14D79D4EC8D64DB9]) [n:127.0.0.1:53926_    ] o.a.s.c.CorePropertiesLocator Found 1 core definitions underneath /x1/jenkins/jenkins-slave/workspace/Lucene-Solr-NightlyTests-6.x/checkout/solr/build/solr-core/test/J2/../../../../../../../../../../../x1/jenkins/jenkins-slave/workspace/Lucene-Solr-NightlyTests-6.x/checkout/solr/build/solr-core/test/J2/temp/solr.cloud.hdfs.StressHdfsTest_14D79D4EC8D64DB9-001/shard-1-001/cores
   [junit4]   2> 1858997 INFO  (TEST-StressHdfsTest.test-seed#[14D79D4EC8D64DB9]) [n:127.0.0.1:53926_    ] o.a.s.c.CorePropertiesLocator Cores are: [collection1]
   [junit4]   2> 1859011 INFO  (coreLoadExecutor-3386-thread-1-processing-n:127.0.0.1:53926_) [n:127.0.0.1:53926_ c:collection1   x:collection1] o.a.s.c.TransientSolrCoreCacheDefault Allocating transient cache for 4 transient cores
   [junit4]   2> 1859014 INFO  (OverseerStateUpdate-97939132895395844-127.0.0.1:46342_-n_0000000000) [n:127.0.0.1:46342_    ] o.a.s.c.o.ReplicaMutator Assigning new node to shard shard=shard1
   [junit4]   2> 1859119 INFO  (zkCallback-1491-thread-1-processing-n:127.0.0.1:53926_) [n:127.0.0.1:53926_    ] o.a.s.c.c.ZkStateReader A cluster state change: [WatchedEvent state:SyncConnected type:NodeDataChanged path:/collections/collection1/state.json] for collection [collection1] has occurred - updating... (live nodes size: [2])
   [junit4]   2> 1860034 WARN  (coreLoadExecutor-3386-thread-1-processing-n:127.0.0.1:53926_) [n:127.0.0.1:53926_ c:collection1   x:collection1] o.a.s.c.Config Beginning with Solr 5.5, <mergePolicy> is deprecated, use <mergePolicyFactory> instead.
   [junit4]   2> 1860038 INFO  (coreLoadExecutor-3386-thread-1-processing-n:127.0.0.1:53926_) [n:127.0.0.1:53926_ c:collection1   x:collection1] o.a.s.c.SolrConfig Using Lucene MatchVersion: 6.6.0
   [junit4]   2> 1860061 INFO  (coreLoadExecutor-3386-thread-1-processing-n:127.0.0.1:53926_) [n:127.0.0.1:53926_ c:collection1   x:collection1] o.a.s.s.IndexSchema [collection1] Schema name=test
   [junit4]   2> 1860301 INFO  (coreLoadExecutor-3386-thread-1-processing-n:127.0.0.1:53926_) [n:127.0.0.1:53926_ c:collection1   x:collection1] o.a.s.s.IndexSchema Loaded schema test/1.0 with uniqueid field id
   [junit4]   2> 1860325 INFO  (coreLoadExecutor-3386-thread-1-processing-n:127.0.0.1:53926_) [n:127.0.0.1:53926_ c:collection1   x:collection1] o.a.s.c.CoreContainer Creating SolrCore 'collection1' using configuration from collection collection1, trusted=true
   [junit4]   2> 1860325 INFO  (coreLoadExecutor-3386-thread-1-processing-n:127.0.0.1:53926_) [n:127.0.0.1:53926_ c:collection1   x:collection1] o.a.s.c.HdfsDirectoryFactory solr.hdfs.home=hdfs://localhost:59770/solr_hdfs_home
   [junit4]   2> 1860326 INFO  (coreLoadExecutor-3386-thread-1-processing-n:127.0.0.1:53926_) [n:127.0.0.1:53926_ c:collection1   x:collection1] o.a.s.c.HdfsDirectoryFactory Solr Kerberos Authentication disabled
   [junit4]   2> 1860326 INFO  (coreLoadExecutor-3386-thread-1-processing-n:127.0.0.1:53926_) [n:127.0.0.1:53926_ c:collection1   x:collection1] o.a.s.c.SolrCore solr.RecoveryStrategy.Builder
   [junit4]   2> 1860326 INFO  (coreLoadExecutor-3386-thread-1-processing-n:127.0.0.1:53926_) [n:127.0.0.1:53926_ c:collection1   x:collection1] o.a.s.c.SolrCore [[collection1] ] Opening new SolrCore at [/x1/jenkins/jenkins-slave/workspace/Lucene-Solr-NightlyTests-6.x/checkout/solr/build/solr-core/test/J2/temp/solr.cloud.hdfs.StressHdfsTest_14D79D4EC8D64DB9-001/shard-1-001/cores/collection1], dataDir=[hdfs://localhost:59770/solr_hdfs_home/collection1/core_node1/data/]
   [junit4]   2> 1860328 INFO  (coreLoadExecutor-3386-thread-1-processing-n:127.0.0.1:53926_) [n:127.0.0.1:53926_ c:collection1   x:collection1] o.a.s.c.JmxMonitoredMap JMX monitoring is enabled. Adding Solr mbeans to JMX Server: com.sun.jmx.mbeanserver.JmxMBeanServer@1b311032
   [junit4]   2> 1860329 INFO  (coreLoadExecutor-3386-thread-1-processing-n:127.0.0.1:53926_) [n:127.0.0.1:53926_ c:collection1   x:collection1] o.a.s.c.HdfsDirectoryFactory creating directory factory for path hdfs://localhost:59770/solr_hdfs_home/collection1/core_node1/data/snapshot_metadata
   [junit4]   2> 1860344 INFO  (coreLoadExecutor-3386-thread-1-processing-n:127.0.0.1:53926_) [n:127.0.0.1:53926_ c:collection1   x:collection1] o.a.s.c.HdfsDirectoryFactory Number of slabs of block cache [1] with direct memory allocation set to [true]
   [junit4]   2> 1860344 INFO  (coreLoadExecutor-3386-thread-1-processing-n:127.0.0.1:53926_) [n:127.0.0.1:53926_ c:collection1   x:collection1] o.a.s.c.HdfsDirectoryFactory Block cache target memory usage, slab size of [8388608] will allocate [1] slabs and use ~[8388608] bytes
   [junit4]   2> 1860344 INFO  (coreLoadExecutor-3386-thread-1-processing-n:127.0.0.1:53926_) [n:127.0.0.1:53926_ c:collection1   x:collection1] o.a.s.c.HdfsDirectoryFactory Creating new single instance HDFS BlockCache
   [junit4]   2> 1860359 INFO  (coreLoadExecutor-3386-thread-1-processing-n:127.0.0.1:53926_) [n:127.0.0.1:53926_ c:collection1   x:collection1] o.a.s.s.b.BlockDirectory Block cache on write is disabled
   [junit4]   2> 1860360 INFO  (coreLoadExecutor-3386-thread-1-processing-n:127.0.0.1:53926_) [n:127.0.0.1:53926_ c:collection1   x:collection1] o.a.s.c.HdfsDirectoryFactory creating directory factory for path hdfs://localhost:59770/solr_hdfs_home/collection1/core_node1/data
   [junit4]   2> 1860395 INFO  (coreLoadExecutor-3386-thread-1-processing-n:127.0.0.1:53926_) [n:127.0.0.1:53926_ c:collection1   x:collection1] o.a.s.c.HdfsDirectoryFactory creating directory factory for path hdfs://localhost:59770/solr_hdfs_home/collection1/core_node1/data/index
   [junit4]   2> 1860402 INFO  (coreLoadExecutor-3386-thread-1-processing-n:127.0.0.1:53926_) [n:127.0.0.1:53926_ c:collection1   x:collection1] o.a.s.c.HdfsDirectoryFactory Number of slabs of block cache [1] with direct memory allocation set to [true]
   [junit4]   2> 1860402 INFO  (coreLoadExecutor-3386-thread-1-processing-n:127.0.0.1:53926_) [n:127.0.0.1:53926_ c:collection1   x:collection1] o.a.s.c.HdfsDirectoryFactory Block cache target memory usage, slab size of [8388608] will allocate [1] slabs and use ~[8388608] bytes
   [junit4]   2> 1860402 INFO  (coreLoadExecutor-3386-thread-1-processing-n:127.0.0.1:53926_) [n:127.0.0.1:53926_ c:collection1   x:collection1] o.a.s.c.HdfsDirectoryFactory Creating new single instance HDFS BlockCache
   [junit4]   2> 1860416 INFO  (coreLoadExecutor-3386-thread-1-processing-n:127.0.0.1:53926_) [n:127.0.0.1:53926_ c:collection1   x:collection1] o.a.s.s.b.BlockDirectory Block cache on write is disabled
   [junit4]   2> 1860417 INFO  (coreLoadExecutor-3386-thread-1-processing-n:127.0.0.1:53926_) [n:127.0.0.1:53926_ c:collection1   x:collection1] o.a.s.u.RandomMergePolicy RandomMergePolicy wrapping class org.apache.lucene.index.TieredMergePolicy: [TieredMergePolicy: maxMergeAtOnce=39, maxMergeAtOnceExplicit=15, maxMergedSegmentMB=19.7509765625, floorSegmentMB=0.53125, forceMergeDeletesPctAllowed=13.028405312788948, segmentsPerTier=4.0, maxCFSSegmentSizeMB=8.796093022207999E12, noCFSRatio=0.0
   [junit4]   2> 1860458 INFO  (IPC Server handler 3 on 59770) [    ] BlockStateChange BLOCK* addStoredBlock: blockMap updated: 127.0.0.1:51713 is added to blk_1073741826_1002{UCState=UNDER_CONSTRUCTION, truncateBlock=null, primaryNodeIndex=-1, replicas=[ReplicaUC[[DISK]DS-6d1f8695-b9e6-48fa-b38b-4d07c59aae0f:NORMAL:127.0.0.1:52552|RBW], ReplicaUC[[DISK]DS-ac539bd4-ae85-4de6-8fdf-754114b347e5:NORMAL:127.0.0.1:51713|FINALIZED]]} size 0
   [junit4]   2> 1860459 INFO  (IPC Server handler 2 on 59770) [    ] BlockStateChange BLOCK* addStoredBlock: blockMap updated: 127.0.0.1:52552 is added to blk_1073741826_1002{UCState=UNDER_CONSTRUCTION, truncateBlock=null, primaryNodeIndex=-1, replicas=[ReplicaUC[[DISK]DS-ac539bd4-ae85-4de6-8fdf-754114b347e5:NORMAL:127.0.0.1:51713|FINALIZED], ReplicaUC[[DISK]DS-325916dc-507f-471b-91b4-b63d28c137af:NORMAL:127.0.0.1:52552|FINALIZED]]} size 0
   [junit4]   2> 1860529 WARN  (coreLoadExecutor-3386-thread-1-processing-n:127.0.0.1:53926_) [n:127.0.0.1:53926_ c:collection1   x:collection1] o.a.s.c.RequestHandlers INVALID paramSet a in requestHandler {type = requestHandler,name = /dump,class = DumpRequestHandler,attributes = {initParams=a, name=/dump, class=DumpRequestHandler},args = {defaults={a=A,b=B}}}
   [junit4]   2> 1860616 INFO  (coreLoadExecutor-3386-thread-1-processing-n:127.0.0.1:53926_) [n:127.0.0.1:53926_ c:collection1   x:collection1] o.a.s.u.UpdateHandler Using UpdateLog implementation: org.apache.solr.update.HdfsUpdateLog
   [junit4]   2> 1860616 INFO  (coreLoadExecutor-3386-thread-1-processing-n:127.0.0.1:53926_) [n:127.0.0.1:53926_ c:collection1   x:collection1] o.a.s.u.UpdateLog Initializing UpdateLog: dataDir= defaultSyncLevel=FLUSH numRecordsToKeep=100 maxNumLogsToKeep=10 numVersionBuckets=65536
   [junit4]   2> 1860616 INFO  (coreLoadExecutor-3386-thread-1-processing-n:127.0.0.1:53926_) [n:127.0.0.1:53926_ c:collection1   x:collection1] o.a.s.u.HdfsUpdateLog Initializing HdfsUpdateLog: tlogDfsReplication=2
   [junit4]   2> 1860641 INFO  (coreLoadExecutor-3386-thread-1-processing-n:127.0.0.1:53926_) [n:127.0.0.1:53926_ c:collection1   x:collection1] o.a.s.u.CommitTracker Hard AutoCommit: disabled
   [junit4]   2> 1860641 INFO  (coreLoadExecutor-3386-thread-1-processing-n:127.0.0.1:53926_) [n:127.0.0.1:53926_ c:collection1   x:collection1] o.a.s.u.CommitTracker Soft AutoCommit: disabled
   [junit4]   2> 1860643 INFO  (coreLoadExecutor-3386-thread-1-processing-n:127.0.0.1:53926_) [n:127.0.0.1:53926_ c:collection1   x:collection1] o.a.s.u.RandomMergePolicy RandomMergePolicy wrapping class org.apache.lucene.index.MockRandomMergePolicy: org.apache.lucene.index.MockRandomMergePolicy@2560e1be
   [junit4]   2> 1860651 INFO  (coreLoadExecutor-3386-thread-1-processing-n:127.0.0.1:53926_) [n:127.0.0.1:53926_ c:collection1   x:collection1] o.a.s.s.SolrIndexSearcher Opening [Searcher@e4be1f0[collection1] main]
   [junit4]   2> 1860652 INFO  (coreLoadExecutor-3386-thread-1-processing-n:127.0.0.1:53926_) [n:127.0.0.1:53926_ c:collection1   x:collection1] o.a.s.r.ManagedResourceStorage Configured ZooKeeperStorageIO with znodeBase: /configs/conf1
   [junit4]   2> 1860652 INFO  (coreLoadExecutor-3386-thread-1-processing-n:127.0.0.1:53926_) [n:127.0.0.1:53926_ c:collection1   x:collection1] o.a.s.r.ManagedResourceStorage Loaded null at path _rest_managed.json using ZooKeeperStorageIO:path=/configs/conf1
   [junit4]   2> 1860652 INFO  (coreLoadExecutor-3386-thread-1-processing-n:127.0.0.1:53926_) [n:127.0.0.1:53926_ c:collection1   x:collection1] o.a.s.h.ReplicationHandler Commits will be reserved for  10000
   [junit4]   2> 1860657 INFO  (searcherExecutor-3387-thread-1-processing-n:127.0.0.1:53926_ x:collection1 c:collection1) [n:127.0.0.1:53926_ c:collection1   x:collection1] o.a.s.c.SolrCore [collection1] Registered new searcher Searcher@e4be1f0[collection1] main{ExitableDirectoryReader(UninvertingDirectoryReader())}
   [junit4]   2> 1860661 INFO  (coreLoadExecutor-3386-thread-1-processing-n:127.0.0.1:53926_) [n:127.0.0.1:53926_ c:collection1   x:collection1] o.a.s.u.UpdateLog Could not find max version in index or recent updates, using new clock 1567026135135420416
   [junit4]   2> 1860668 INFO  (coreZkRegister-3381-thread-1-processing-n:127.0.0.1:53926_ x:collection1 c:collection1) [n:127.0.0.1:53926_ c:collection1 s:shard1 r:core_node1 x:collection1] o.a.s.c.ShardLeaderElectionContext Enough replicas found to continue.
   [junit4]   2> 1860669 INFO  (coreZkRegister-3381-thread-1-processing-n:127.0.0.1:53926_ x:collection1 c:collection1) [n:127.0.0.1:53926_ c:collection1 s:shard1 r:core_node1 x:collection1] o.a.s.c.ShardLeaderElectionContext I may be the new leader - try and sync
   [junit4]   2> 1860675 INFO  (coreZkRegister-3381-thread-1-processing-n:127.0.0.1:53926_ x:collection1 c:collection1) [n:127.0.0.1:53926_ c:collection1 s:shard1 r:core_node1 x:collection1] o.a.s.c.SyncStrategy Sync replicas to http://127.0.0.1:53926/collection1/
   [junit4]   2> 1860675 INFO  (coreZkRegister-3381-thread-1-processing-n:127.0.0.1:53926_ x:collection1 c:collection1) [n:127.0.0.1:53926_ c:collection1 s:shard1 r:core_node1 x:collection1] o.a.s.c.SyncStrategy Sync Success - now sync replicas to me
   [junit4]   2> 1860675 INFO  (coreZkRegister-3381-thread-1-processing-n:127.0.0.1:53926_ x:collection1 c:collection1) [n:127.0.0.1:53926_ c:collection1 s:shard1 r:core_node1 x:collection1] o.a.s.c.SyncStrategy http://127.0.0.1:53926/collection1/ has no replicas
   [junit4]   2> 1860675 INFO  (coreZkRegister-3381-thread-1-processing-n:127.0.0.1:53926_ x:collection1 c:collection1) [n:127.0.0.1:53926_ c:collection1 s:shard1 r:core_node1 x:collection1] o.a.s.c.ShardLeaderElectionContext Found all replicas participating in election, clear LIR
   [junit4]   2> 1860684 INFO  (coreZkRegister-3381-thread-1-processing-n:127.0.0.1:53926_ x:collection1 c:collection1) [n:127.0.0.1:53926_ c:collection1 s:shard1 r:core_node1 x:collection1] o.a.s.c.ShardLeaderElectionContext I am the new leader: http://127.0.0.1:53926/collection1/ shard1
   [junit4]   2> 1860787 INFO  (zkCallback-1491-thread-1-processing-n:127.0.0.1:53926_) [n:127.0.0.1:53926_    ] o.a.s.c.c.ZkStateReader A cluster state change: [WatchedEvent state:SyncConnected type:NodeDataChanged path:/collections/collection1/state.json] for collection [collection1] has occurred - updating... (live nodes size: [2])
   [junit4]   2> 1860835 INFO  (coreZkRegister-3381-thread-1-processing-n:127.0.0.1:53926_ x:collection1 c:collection1) [n:127.0.0.1:53926_ c:collection1 s:shard1 r:core_node1 x:collection1] o.a.s.c.ZkController I am the leader, no recovery necessary
   [junit4]   2> 1860940 INFO  (zkCallback-1491-thread-1-processing-n:127.0.0.1:53926_) [n:127.0.0.1:53926_    ] o.a.s.c.c.ZkStateReader A cluster state change: [WatchedEvent state:SyncConnected type:NodeDataChanged path:/collections/collection1/state.json] for collection [collection1] has occurred - updating... (live nodes size: [2])
   [junit4]   2> 1861172 INFO  (TEST-StressHdfsTest.test-seed#[14D79D4EC8D64DB9]) [    ] o.a.s.SolrTestCaseJ4 Writing core.properties file to /x1/jenkins/jenkins-slave/workspace/Lucene-Solr-NightlyTests-6.x/checkout/solr/build/solr-core/test/J2/temp/solr.cloud.hdfs.StressHdfsTest_14D79D4EC8D64DB9-001/shard-2-001/cores/collection1
   [junit4]   2> 1861172 INFO  (TEST-StressHdfsTest.test-seed#[14D79D4EC8D64DB9]) [    ] o.a.s.c.AbstractFullDistribZkTestBase create jetty 2 in directory /x1/jenkins/jenkins-slave/workspace/Lucene-Solr-NightlyTests-6.x/checkout/solr/build/solr-core/test/J2/temp/solr.cloud.hdfs.StressHdfsTest_14D79D4EC8D64DB9-001/shard-2-001
   [junit4]   2> 1861173 INFO  (TEST-StressHdfsTest.test-seed#[14D79D4EC8D64DB9]) [    ] o.e.j.s.Server jetty-9.3.14.v20161028
   [junit4]   2> 1861184 INFO  (TEST-StressHdfsTest.test-seed#[14D79D4EC8D64DB9]) [    ] o.e.j.s.h.ContextHandler Started o.e.j.s.ServletContextHandler@aae577f{/,null,AVAILABLE}
   [junit4]   2> 1861184 INFO  (TEST-StressHdfsTest.test-seed#[14D79D4EC8D64DB9]) [    ] o.e.j.s.AbstractConnector Started ServerConnector@49a4fabe{HTTP/1.1,[http/1.1]}{127.0.0.1:36816}
   [junit4]   2> 1861184 INFO  (TEST-StressHdfsTest.test-seed#[14D79D4EC8D64DB9]) [    ] o.e.j.s.Server Started @1864155ms
   [junit4]   2> 1861184 INFO  (TEST-StressHdfsTest.test-seed#[14D79D4EC8D64DB9]) [    ] o.a.s.c.s.e.JettySolrRunner Jetty properties: {solr.data.dir=hdfs://localhost:59770/hdfs__localhost_59770__x1_jenkins_jenkins-slave_workspace_Lucene-Solr-NightlyTests-6.x_checkout_solr_build_solr-core_test_J2_temp_solr.cloud.hdfs.StressHdfsTest_14D79D4EC8D64DB9-001_tempDir-002_jetty2, solrconfig=solrconfig.xml, hostContext=/, hostPort=36816, coreRootDirectory=/x1/jenkins/jenkins-slave/workspace/Lucene-Solr-NightlyTests-6.x/checkout/solr/build/solr-core/test/J2/../../../../../../../../../../../x1/jenkins/jenkins-slave/workspace/Lucene-Solr-NightlyTests-6.x/checkout/solr/build/solr-core/test/J2/temp/solr.cloud.hdfs.StressHdfsTest_14D79D4EC8D64DB9-001/shard-2-001/cores}
   [junit4]   2> 1861185 ERROR (TEST-StressHdfsTest.test-seed#[14D79D4EC8D64DB9]) [    ] o.a.s.s.StartupLoggingUtils Missing Java Option solr.log.dir. Logging may be missing or incomplete.
   [junit4]   2> 1861191 INFO  (TEST-StressHdfsTest.test-seed#[14D79D4EC8D64DB9]) [    ] o.a.s.s.SolrDispatchFilter  ___      _       Welcome to Apache Solr? version 6.6.0
   [junit4]   2> 1861191 INFO  (TEST-StressHdfsTest.test-seed#[14D79D4EC8D64DB9]) [    ] o.a.s.s.SolrDispatchFilter / __| ___| |_ _   Starting in cloud mode on port null
   [junit4]   2> 1861191 INFO  (TEST-StressHdfsTest.test-seed#[14D79D4EC8D64DB9]) [    ] o.a.s.s.SolrDispatchFilter \__ \/ _ \ | '_|  Install dir: null
   [junit4]   2> 1861191 INFO  (TEST-StressHdfsTest.test-seed#[14D79D4EC8D64DB9]) [    ] o.a.s.s.SolrDispatchFilter |___/\___/_|_|    Start time: 2017-05-10T16:09:38.746Z
   [junit4]   2> 1861226 INFO  (TEST-StressHdfsTest.test-seed#[14D79D4EC8D64DB9]) [    ] o.a.s.s.SolrDispatchFilter Loading solr.xml from SolrHome (not found in ZooKeeper)
   [junit4]   2> 1861226 INFO  (TEST-StressHdfsTest.test-seed#[14D79D4EC8D64DB9]) [    ] o.a.s.c.SolrXmlConfig Loading container configuration from /x1/jenkins/jenkins-slave/workspace/Lucene-Solr-NightlyTests-6.x/checkout/solr/build/solr-core/test/J2/temp/solr.cloud.hdfs.StressHdfsTest_14D79D4EC8D64DB9-001/shard-2-001/solr.xml
   [junit4]   2> 1861233 INFO  (TEST-StressHdfsTest.test-seed#[14D79D4EC8D64DB9]) [    ] o.a.s.u.UpdateShardHandler Creating UpdateShardHandler HTTP client with params: socketTimeout=340000&connTimeout=45000&retry=true
   [junit4]   2> 1861235 INFO  (TEST-StressHdfsTest.test-seed#[14D79D4EC8D64DB9]) [    ] o.a.s.c.ZkContainer Zookeeper client=127.0.0.1:40645/solr
   [junit4]   2> 1861261 INFO  (TEST-StressHdfsTest.test-seed#[14D79D4EC8D64DB9]) [n:127.0.0.1:36816_    ] o.a.s.c.c.ZkStateReader Updated live nodes from ZooKeeper... (0) -> (2)
   [junit4]   2> 1861266 INFO  (TEST-StressHdfsTest.test-seed#[14D79D4EC8D64DB9]) [n:127.0.0.1:36816_    ] o.a.s.c.Overseer Overseer (id=null) closing
   [junit4]   2> 1861269 INFO  (TEST-StressHdfsTest.test-seed#[14D79D4EC8D64DB9]) [n:127.0.0.1:36816_    ] o.a.s.c.ZkController Register node as live in ZooKeeper:/live_nodes/127.0.0.1:36816_
   [junit4]   2> 1861271 INFO  (zkCallback-1491-thread-1-processing-n:127.0.0.1:53926_) [n:127.0.0.1:53926_    ] o.a.s.c.c.ZkStateReader Updated live nodes from ZooKeeper... (2) -> (3)
   [junit4]   2> 1861272 INFO  (zkCallback-1485-thread-1) [    ] o.a.s.c.c.ZkStateReader Updated live nodes from ZooKeeper... (2) -> (3)
   [junit4]   2> 1861272 INFO  (zkCallback-1481-thread-2-processing-n:127.0.0.1:46342_) [n:127.0.0.1:46342_    ] o.a.s.c.c.ZkStateReader Updated live nodes from ZooKeeper... (2) -> (3)
   [junit4]   2> 1861280 INFO  (zkCallback-1497-thread-1-processing-n:127.0.0.1:36816_) [n:127.0.0.1:36816_    ] o.a.s.c.c.ZkStateReader Updated live nodes from ZooKeeper... (2) -> (3)
   [junit4]   2> 1861367 INFO  (TEST-StressHdfsTest.test-seed#[14D79D4EC8D64DB9]) [n:127.0.0.1:36816_    ] o.a.s.c.CorePropertiesLocator Found 1 core definitions underneath /x1/jenkins/jenkins-slave/workspace/Lucene-Solr-NightlyTests-6.x/checkout/solr/build/solr-core/test/J2/../../../../../../../../../../../x1/jenkins/jenkins-slave/workspace/Lucene-Solr-NightlyTests-6.x/checkout/solr/build/solr-core/test/J2/temp/solr.cloud.hdfs.StressHdfsTest_14D79D4EC8D64DB9-001/shard-2-001/cores
   [junit4]   2> 1861367 INFO  (TEST-StressHdfsTest.test-seed#[14D79D4EC8D64DB9]) [n:127.0.0.1:36816_    ] o.a.s.c.CorePropertiesLocator Cores are: [collection1]
   [junit4]   2> 1861369 INFO  (coreLoadExecutor-3397-thread-1-processing-n:127.0.0.1:36816_) [n:127.0.0.1:36816_ c:collection1   x:collection1] o.a.s.c.TransientSolrCoreCacheDefault Allocating transient cache for 4 transient cores
   [junit4]   2> 1861375 INFO  (OverseerStateUpdate-97939132895395844-127.0.0.1:46342_-n_0000000000) [n:127.0.0.1:46342_    ] o.a.s.c.o.ReplicaMutator Assigning new node to shard shard=shard1
   [junit4]   2> 1861480 INFO  (zkCallback-1497-thread-1-processing-n:127.0.0.1:36816_) [n:127.0.0.1:36816_    ] o.a.s.c.c.ZkStateReader A cluster state change: [WatchedEvent state:SyncConnected type:NodeDataChanged path:/collections/collection1/state.json] for collection [collection1] has occurred - updating... (live nodes size: [3])
   [junit4]   2> 1861480 INFO  (zkCallback-1491-thread-1-processing-n:127.0.0.1:53926_) [n:127.0.0.1:53926_    ] o.a.s.c.c.ZkStateReader A cluster state change: [WatchedEvent state:SyncConnected type:NodeDataChanged path:/collections/collection1/state.json] for collection [collection1] has occurred - updating... (live nodes size: [3])
   [junit4]   2> 1862403 WARN  (coreLoadExecutor-3397-thread-1-processing-n:127.0.0.1:36816_) [n:127.0.0.1:36816_ c:collection1   x:collection1] o.a.s.c.Config Beginning with Solr 5.5, <mergePolicy> is deprecated, use <mergePolicyFactory> instead.
   [junit4]   2> 1862404 INFO  (coreLoadExecutor-3397-thread-1-processing-n:127.0.0.1:36816_) [n:127.0.0.1:36816_ c:collection1   x:collection1] o.a.s.c.SolrConfig Using Lucene MatchVersion: 6.6.0
   [junit4]   2> 1862425 INFO  (coreLoadExecutor-3397-thread-1-processing-n:127.0.0.1:36816_) [n:127.0.0.1:36816_ c:collection1   x:collection1] o.a.s.s.IndexSchema [collection1] Schema name=test
   [junit4]   2> 1862612 INFO  (coreLoadExecutor-3397-thread-1-processing-n:127.0.0.1:36816_) [n:127.0.0.1:36816_ c:collection1   x:collection1] o.a.s.s.IndexSchema Loaded schema test/1.0 with uniqueid field id
   [junit4]   2> 1862633 INFO  (coreLoadExecutor-3397-thread-1-processing-n:127.0.0.1:36816_) [n:127.0.0.1:36816_ c:collection1   x:collection1] o.a.s.c.CoreContainer Creating SolrCore 'collection1' using configuration from collection collection1, trusted=true
   [junit4]   2> 1862634 INFO  (coreLoadExecutor-3397-thread-1-processing-n:127.0.0.1:36816_) [n:127.0.0.1:36816_ c:collection1   x:collection1] o.a.s.c.HdfsDirectoryFactory solr.hdfs.home=hdfs://localhost:59770/solr_hdfs_home
   [junit4]   2> 1862634 INFO  (coreLoadExecutor-3397-thread-1-processing-n:127.0.0.1:36816_) [n:127.0.0.1:36816_ c:collection1   x:collection1] o.a.s.c.HdfsDirectoryFactory Solr Kerberos Authentication disabled
   [junit4]   2> 1862634 INFO  (coreLoadExecutor-3397-thread-1-processing-n:127.0.0.1:36816_) [n:127.0.0.1:36816_ c:collection1   x:collection1] o.a.s.c.SolrCore solr.RecoveryStrategy.Builder
   [junit4]   2> 1862634 INFO  (coreLoadExecutor-3397-thread-1-processing-n:127.0.0.1:36816_) [n:127.0.0.1:36816_ c:collection1   x:collection1] o.a.s.c.SolrCore [[collection1] ] Opening new SolrCore at [/x1/jenkins/jenkins-slave/workspace/Lucene-Solr-NightlyTests-6.x/checkout/solr/build/solr-core/test/J2/temp/solr.cloud.hdfs.StressHdfsTest_14D79D4EC8D64DB9-001/shard-2-001/cores/collection1], dataDir=[hdfs://localhost:59770/solr_hdfs_home/collection1/core_node2/data/]
   [junit4]   2> 1862634 INFO  (coreLoadExecutor-3397-thread-1-processing-n:127.0.0.1:36816_) [n:127.0.0.1:36816_ c:collection1   x:collection1] o.a.s.c.JmxMonitoredMap JMX monitoring is enabled. Adding Solr mbeans to JMX Server: com.sun.jmx.mbeanserver.JmxMBeanServer@1b311032
   [junit4]   2> 1862634 INFO  (coreLoadExecutor-3397-thread-1-processing-n:127.0.0.1:36816_) [n:127.0.0.1:36816_ c:collection1   x:collection1] o.a.s.c.HdfsDirectoryFactory creating directory factory for path hdfs://localhost:59770/solr_hdfs_home/collection1/core_node2/data/snapshot_metadata
   [junit4]   2> 1862653 INFO  (coreLoadExecutor-3397-thread-1-processing-n:127.0.0.1:36816_) [n:127.0.0.1:36816_ c:collection1   x:collection1] o.a.s.c.HdfsDirectoryFactory Number of slabs of block cache [1] with direct memory allocation set to [true]
   [junit4]   2> 1862653 INFO  (coreLoadExecutor-3397-thread-1-processing-n:127.0.0.1:36816_) [n:127.0.0.1:36816_ c:collection1   x:collection1] o.a.s.c.HdfsDirectoryFactory Block cache target memory usage, slab size of [8388608] will allocate [1] slabs and use ~[8388608] bytes
   [junit4]   2> 1862653 INFO  (coreLoadExecutor-3397-thread-1-processing-n:127.0.0.1:36816_) [n:127.0.0.1:36816_ c:collection1   x:collection1] o.a.s.c.HdfsDirectoryFactory Creating new single instance HDFS BlockCache
   [junit4]   2> 1862673 INFO  (coreLoadExecutor-3397-thread-1-processing-n:127.0.0.1:36816_) [n:127.0.0.1:36816_ c:collection1   x:collection1] o.a.s.s.b.BlockDirectory Block cache on write is disabled
   [junit4]   2> 1862674 INFO  (coreLoadExecutor-3397-thread-1-processing-n:127.0.0.1:36816_) [n:127.0.0.1:36816_ c:collection1   x:collection1] o.a.s.c.HdfsDirectoryFactory creating directory factory for path hdfs://localhost:59770/solr_hdfs_home/collection1/core_node2/data
   [junit4]   2> 1862736 INFO  (coreLoadExecutor-3397-thread-1-processing-n:127.0.0.1:36816_) [n:127.0.0.1:36816_ c:collection1   x:collection1] o.a.s.c.HdfsDirectoryFactory creating directory factory for path hdfs://localhost:59770/solr_hdfs_home/collection1/core_node2/data/index
   [junit4]   2> 1862761 INFO  (coreLoadExecutor-3397-thread-1-processing-n:127.0.0.1:36816_) [n:127.0.0.1:36816_ c:collection1   x:collection1] o.a.s.c.HdfsDirectoryFactory Number of slabs of block cache [1] with direct memory allocation set to [true]
   [junit4]   2> 1862762 INFO  (coreLoadExecutor-3397-thread-1-processing-n:127.0.0.1:36816_) [n:127.0.0.1:36816_ c:collection1   x:collection1] o.a.s.c.HdfsDirectoryFactory Block cache target memory usage, slab size of [8388608] will allocate [1] slabs and use ~[8388608] bytes
   [junit4]   2> 1862762 INFO  (coreLoadExecutor-3397-thread-1-processing-n:127.0.0.1:36816_) [n:127.0.0.1:36816_ c:collection1   x:collection1] o.a.s.c.HdfsDirectoryFactory Creating new single instance HDFS BlockCache
   [junit4]   2> 1862789 INFO  (coreLoadExecutor-3397-thread-1-processing-n:127.0.0.1:36816_) [n:127.0.0.1:36816_ c:collection1   x:collection1] o.a.s.s.b.BlockDirectory Block cache on write is disabled
   [junit4]   2> 1862789 INFO  (coreLoadExecutor-3397-thread-1-processing-n:127.0.0.1:36816_) [n:127.0.0.1:36816_ c:collection1   x:collection1] o.a.s.u.RandomMergePolicy RandomMergePolicy wrapping class org.apache.lucene.index.TieredMergePolicy: [TieredMergePolicy: maxMergeAtOnce=39, maxMergeAtOnceExplicit=15, maxMergedSegmentMB=19.7509765625, floorSegmentMB=0.53125, forceMergeDeletesPctAllowed=13.028405312788948, segmentsPerTier=4.0, maxCFSSegmentSizeMB=8.796093022207999E12, noCFSRatio=0.0
   [junit4]   2> 1862810 INFO  (IPC Server handler 2 on 59770) [    ] BlockStateChange BLOCK* addStoredBlock: blockMap updated: 127.0.0.1:51713 is added to blk_1073741827_1003{UCState=UNDER_CONSTRUCTION, truncateBlock=null, primaryNodeIndex=-1, replicas=[ReplicaUC[[DISK]DS-6d1f8695-b9e6-48fa-b38b-4d07c59aae0f:NORMAL:127.0.0.1:52552|RBW], ReplicaUC[[DISK]DS-8bb34c81-d392-437f-b071-43d377d56082:NORMAL:127.0.0.1:51713|FINALIZED]]} size 0
   [junit4]   2> 1862813 INFO  (IPC Server handler 5 on 59770) [    ] BlockStateChange BLOCK* addStoredBlock: blockMap updated: 127.0.0.1:52552 is added to blk_1073741827_1003 size 71
   [junit4]   2> 1862833 WARN  (coreLoadExecutor-3397-thread-1-processing-n:127.0.0.1:36816_) [n:127.0.0.1:36816_ c:collection1   x:collection1] o.a.s.c.RequestHandlers INVALID paramSet a in requestHandler {type = requestHandler,name = /dump,class = DumpRequestHandler,attributes = {initParams=a, name=/dump, class=DumpRequestHandler},args = {defaults={a=A,b=B}}}
   [junit4]   2> 1862920 INFO  (coreLoadExecutor-3397-thread-1-processing-n:127.0.0.1:36816_) [n:127.0.0.1:36816_ c:collection1   x:collection1] o.a.s.u.UpdateHandler Using UpdateLog implementation: org.apache.solr.update.HdfsUpdateLog
   [junit4]   2> 1862920 INFO  (coreLoadExecutor-3397-thread-1-processing-n:127.0.0.1:36816_) [n:127.0.0.1:36816_ c:collection1   x:collection1] o.a.s.u.UpdateLog Initializing UpdateLog: dataDir= defaultSyncLevel=FLUSH numRecordsToKeep=100 maxNumLogsToKeep=10 numVersionBuckets=65536
   [junit4]   2> 1862920 INFO  (coreLoadExecutor-3397-thread-1-processing-n:127.0.0.1:36816_) [n:127.0.0.1:36816_ c:collection1   x:collection1] o.a.s.u.HdfsUpdateLog Initializing HdfsUpdateLog: tlogDfsReplication=2
   [junit4]   2> 1862931 INFO  (coreLoadExecutor-3397-thread-1-processing-n:127.0.0.1:36816_) [n:127.0.0.1:36816_ c:collection1   x:collection1] o.a.s.u.CommitTracker Hard AutoCommit: disabled
   [junit4]   2> 1862931 INFO  (coreLoadExecutor-3397-thread-1-processing-n:127.0.0.1:36816_) [n:127.0.0.1:36816_ c:collection1   x:collection1] o.a.s.u.CommitTracker Soft AutoCommit: disabled
   [junit4]   2> 1862934 INFO  (coreLoadExecutor-3397-thread-1-processing-n:127.0.0.1:36816_) [n:127.0.0.1:36816_ c:collection1   x:collection1] o.a.s.u.RandomMergePolicy RandomMergePolicy wrapping class org.apache.lucene.index.MockRandomMergePolicy: org.apache.lucene.index.MockRandomMergePolicy@6eb932f1
   [junit4]   2> 1862944 INFO  (coreLoadExecutor-3397-thread-1-processing-n:127.0.0.1:36816_) [n:127.0.0.1:36816_ c:collection1   x:collection1] o.a.s.s.SolrIndexSearcher Opening [Searcher@d837c11[collection1] main]
   [junit4]   2> 1862950 INFO  (coreLoadExecutor-3397-thread-1-processing-n:127.0.0.1:36816_) [n:127.0.0.1:36816_ c:collection1   x:collection1] o.a.s.r.ManagedResourceStorage Configured ZooKeeperStorageIO with znodeBase: /configs/conf1
   [junit4]   2> 1862952 INFO  (coreLoadExecutor-3397-thread-1-processing-n:127.0.0.1:36816_) [n:127.0.0.1:36816_ c:collection1   x:collection1] o.a.s.r.ManagedResourceStorage Loaded null at path _rest_managed.json using ZooKeeperStorageIO:path=/configs/conf1
   [junit4]   2> 1862952 INFO  (coreLoadExecutor-3397-thread-1-processing-n:127.0.0.1:36816_) [n:127.0.0.1:36816_ c:collection1   x:collection1] o.a.s.h.ReplicationHandler Commits will be reserved for  10000
   [junit4]   2> 1862956 INFO  (searcherExecutor-3398-thread-1-processing-n:127.0.0.1:36816_ x:collection1 c:collection1) [n:127.0.0.1:36816_ c:collection1   x:collection1] o.a.s.c.SolrCore [collection1] Registered new searcher Searcher@d837c11[collection1] main{ExitableDirectoryReader(UninvertingDirectoryReader())}
   [junit4]   2> 1862974 INFO  (coreLoadExecutor-3397-thread-1-processing-n:127.0.0.1:36816_) [n:127.0.0.1:36816_ c:collection1   x:collection1] o.a.s.u.UpdateLog Could not find max version in index or recent updates, using new clock 1567026137560776704
   [junit4]   2> 1862998 INFO  (coreZkRegister-3392-thread-1-processing-n:127.0.0.1:36816_ x:collection1 c:collection1) [n:127.0.0.1:36816_ c:collection1 s:shard1 r:core_node2 x:collection1] o.a.s.c.ZkController Core needs to recover:collection1
   [junit4]   2> 1862999 INFO  (updateExecutor-1494-thread-1-processing-n:127.0.0.1:36816_ x:collection1 s:shard1 c:collection1 r:core_node2) [n:127.0.0.1:36816_ c:collection1 s:shard1 r:core_node2 x:collection1] o.a.s.u.DefaultSolrCoreState Running recovery
   [junit4]   2> 1862999 INFO  (recoveryExecutor-1495-thread-1-processing-n:127.0.0.1:36816_ x:collection1 s:shard1 c:collection1 r:core_node2) [n:127.0.0.1:36816_ c:collection1 s:shard1 r:core_node2 x:collection1] o.a.s.c.RecoveryStrategy Starting recovery process. recoveringAfterStartup=true
   [junit4]   2> 1863000 INFO  (recoveryExecutor-1495-thread-1-processing-n:127.0.0.1:36816_ x:collection1 s:shard1 c:collection1 r:core_node2) [n:127.0.0.1:36816_ c:collection1 s:shard1 r:core_node2 x:collection1] o.a.s.c.RecoveryStrategy ###### startupVersions=[[]]
   [junit4]   2> 1863000 INFO  (recoveryExecutor-1495-thread-1-processing-n:127.0.0.1:36816_ x:collection1 s:shard1 c:collection1 r:core_node2) [n:127.0.0.1:36816_ c:collection1 s:shard1 r:core_node2 x:collection1] o.a.s.c.RecoveryStrategy Begin buffering updates. core=[collection1]
   [junit4]   2> 1863000 INFO  (recoveryExecutor-1495-thread-1-processing-n:127.0.0.1:36816_ x:collection1 s:shard1 c:collection1 r:core_node2) [n:127.0.0.1:36816_ c:collection1 s:shard1 r:core_node2 x:collection1] o.a.s.u.UpdateLog Starting to buffer updates. HDFSUpdateLog{state=ACTIVE, tlog=null}
   [junit4]   2> 1863002 INFO  (recoveryExecutor-1495-thread-1-processing-n:127.0.0.1:36816_ x:collection1 s:shard1 c:collection1 r:core_node2) [n:127.0.0.1:36816_ c:collection1 s:shard1 r:core_node2 x:collection1] o.a.s.c.RecoveryStrategy Publishing state of core [collection1] as recovering, leader is [http://127.0.0.1:53926/collection1/] and I am [http://127.0.0.1:36816/collection1/]
   [junit4]   2> 1863012 INFO  (recoveryExecutor-1495-thread-1-processing-n:127.0.0.1:36816_ x:collection1 s:shard1 c:collection1 r:core_node2) [n:127.0.0.1:36816_ c:collection1 s:shard1 r:core_node2 x:collection1] o.a.s.c.RecoveryStrategy Sending prep recovery command to [http://127.0.0.1:53926]; [WaitForState: action=PREPRECOVERY&core=collection1&nodeName=127.0.0.1:36816_&coreNodeName=core_node2&state=recovering&checkLive=true&onlyIfLeader=true&onlyIfLeaderActive=true]
   [junit4]   2> 1863016 INFO  (qtp1181403562-16681) [n:127.0.0.1:53926_    ] o.a.s.h.a.PrepRecoveryOp Going to wait for coreNodeName: core_node2, state: recovering, checkLive: true, onlyIfLeader: true, onlyIfLeaderActive: true
   [junit4]   2> 1863019 INFO  (qtp1181403562-16681) [n:127.0.0.1:53926_    ] o.a.s.h.a.PrepRecoveryOp Will wait a max of 183 seconds to see collection1 (shard1 of collection1) have state: recovering
   [junit4]   2> 1863019 INFO  (qtp1181403562-16681) [n:127.0.0.1:53926_    ] o.a.s.h.a.PrepRecoveryOp In WaitForState(recovering): collection=collection1, shard=shard1, thisCore=collection1, leaderDoesNotNeedRecovery=false, isLeader? true, live=true, checkLive=true, currentState=down, localState=active, nodeName=127.0.0.1:36816_, coreNodeName=core_node2, onlyIfActiveCheckResult=false, nodeProps: core_node2:{"core":"collection1","base_url":"http://127.0.0.1:36816","node_name":"127.0.0.1:36816_","state":"down"}
   [junit4]   2> 1863107 INFO  (zkCallback-1491-thread-1-processing-n:127.0.0.1:53926_) [n:127.0.0.1:53926_    ] o.a.s.c.c.ZkStateReader A cluster state change: [WatchedEvent state:SyncConnected type:NodeDataChanged path:/collections/collection1/state.json] for collection [collection1] has occurred - updating... (live nodes size: [3])
   [junit4]   2> 1863107 INFO  (zkCallback-1497-thread-1-processing-n:127.0.0.1:36816_) [n:127.0.0.1:36816_    ] o.a.s.c.c.ZkStateReader A cluster state change: [WatchedEvent state:SyncConnected type:NodeDataChanged path:/collections/collection1/state.json] for collection [collection1] has occurred - updating... (live nodes size: [3])
   [junit4]   2> 1863493 INFO  (TEST-StressHdfsTest.test-seed#[14D79D4EC8D64DB9]) [    ] o.a.s.SolrTestCaseJ4 Writing core.properties file to /x1/jenkins/jenkins-slave/workspace/Lucene-Solr-NightlyTests-6.x/checkout/solr/build/solr-core/test/J2/temp/solr.cloud.hdfs.StressHdfsTest_14D79D4EC8D64DB9-001/shard-3-001/cores/collection1
   [junit4]   2> 1863493 INFO  (TEST-StressHdfsTest.test-seed#[14D79D4EC8D64DB9]) [    ] o.a.s.c.AbstractFullDistribZkTestBase create jetty 3 in directory /x1/jenkins/jenkins-slave/workspace/Lucene-Solr-NightlyTests-6.x/checkout/solr/build/solr-core/test/J2/temp/solr.cloud.hdfs.StressHdfsTest_14D79D4EC8D64DB9-001/shard-3-001
   [junit4]   2> 1863494 INFO  (TEST-StressHdfsTest.test-seed#[14D79D4EC8D64DB9]) [    ] o.e.j.s.Server jetty-9.3.14.v20161028
   [junit4]   2> 1863502 INFO  (TEST-StressHdfsTest.test-seed#[14D79D4EC8D64DB9]) [    ] o.e.j.s.h.ContextHandler Started o.e.j.s.ServletContextHandler@6aede4db{/,null,AVAILABLE}
   [junit4]   2> 1863503 INFO  (TEST-StressHdfsTest.test-seed#[14D79D4EC8D64DB9]) [    ] o.e.j.s.AbstractConnector Started ServerConnector@76fc3fad{HTTP/1.1,[http/1.1]}{127.0.0.1:54941}
   [junit4]   2> 1863503 INFO  (TEST-StressHdfsTest.test-seed#[14D79D4EC8D64DB9]) [    ] o.e.j.s.Server Started @1866473ms
   [junit4]   2> 1863503 INFO  (TEST-StressHdfsTest.test-seed#[14D79D4EC8D64DB9]) [    ] o.a.s.c.s.e.JettySolrRunner Jetty properties: {solr.data.dir=hdfs://localhost:59770/hdfs__localhost_59770__x1_jenkins_jenkins-slave_workspace_Lucene-Solr-NightlyTests-6.x_checkout_solr_build_solr-core_test_J2_temp_solr.cloud.hdfs.StressHdfsTest_14D79D4EC8D64DB9-001_tempDir-002_jetty3, solrconfig=solrconfig.xml, hostContext=/, hostPort=54941, coreRootDirectory=/x1/jenkins/jenkins-slave/workspace/Lucene-Solr-NightlyTests-6.x/checkout/solr/build/solr-core/test/J2/../../../../../../../../../../../x1/jenkins/jenkins-slave/workspace/Lucene-Solr-NightlyTests-6.x/checkout/solr/build/solr-core/test/J2/temp/solr.cloud.hdfs.StressHdfsTest_14D79D4EC8D64DB9-001/shard-3-001/cores}
   [junit4]   2> 1863503 ERROR (TEST-StressHdfsTest.test-seed#[14D79D4EC8D64DB9]) [    ] o.a.s.s.StartupLoggingUtils Missing Java Option solr.log.dir. Logging may be missing or incomplete.
   [junit4]   2> 1863512 INFO  (TEST-StressHdfsTest.test-seed#[14D79D4EC8D64DB9]) [    ] o.a.s.s.SolrDispatchFilter  ___      _       Welcome to Apache Solr? version 6.6.0
   [junit4]   2> 1863512 INFO  (TEST-StressHdfsTest.test-seed#[14D79D4EC8D64DB9]) [    ] o.a.s.s.SolrDispatchFilter / __| ___| |_ _   Starting in cloud mode on port null
   [junit4]   2> 1863512 INFO  (TEST-StressHdfsTest.test-seed#[14D79D4EC8D64DB9]) [    ] o.a.s.s.SolrDispatchFilter \__ \/ _ \ | '_|  Install dir: null
   [junit4]   2> 1863512 INFO  (TEST-StressHdfsTest.test-seed#[14D79D4EC8D64DB9]) [    ] o.a.s.s.SolrDispatchFilter |___/\___/_|_|    Start time: 2017-05-10T16:09:41.067Z
   [junit4]   2> 1863537 INFO  (TEST-StressHdfsTest.test-seed#[14D79D4EC8D64DB9]) [    ] o.a.s.s.SolrDispatchFilter Loading solr.xml from SolrHome (not found in ZooKeeper)
   [junit4]   2> 1863537 INFO  (TEST-StressHdfsTest.test-seed#[14D79D4EC8D64DB9]) [    ] o.a.s.c.SolrXmlConfig Loading container configuration from /x1/jenkins/jenkins-slave/workspace/Lucene-Solr-NightlyTests-6.x/checkout/solr/build/solr-core/test/J2/temp/solr.cloud.hdfs.StressHdfsTest_14D79D4EC8D64DB9-001/shard-3-001/solr.xml
   [junit4]   2> 1863580 INFO  (TEST-StressHdfsTest.test-seed#[14D79D4EC8D64DB9]) [    ] o.a.s.u.UpdateShardHandler Creating UpdateShardHandler HTTP client with params: socketTimeout=340000&connTimeout=45000&retry=true
   [junit4]   2> 1863581 INFO  (TEST-StressHdfsTest.test-seed#[14D79D4EC8D64DB9]) [    ] o.a.s.c.ZkContainer Zookeeper client=127.0.0.1:40645/solr
   [junit4]   2> 1863596 INFO  (TEST-StressHdfsTest.test-seed#[14D79D4EC8D64DB9]) [n:127.0.0.1:54941_    ] o.a.s.c.c.ZkStateReader Updated live nodes from ZooKeeper... (0) -> (3)
   [junit4]   2> 1863598 INFO  (TEST-StressHdfsTest.test-seed#[14D79D4EC8D64DB9]) [n:127.0.0.1:54941_    ] o.a.s.c.Overseer Overseer (id=null) closing
   [junit4]   2> 1863600 INFO  (TEST-StressHdfsTest.test-seed#[14D79D4EC8D64DB9]) [n:127.0.0.1:54941_    ] o.a.s.c.ZkController Register node as live in ZooKeeper:/live_nodes/127.0.0.1:54941_
   [junit4]   2> 1863602 INFO  (zkCallback-1481-thread-1-processing-n:127.0.0.1:46342_) [n:127.0.0.1:46342_    ] o.a.s.c.c.ZkStateReader Updated live nodes from ZooKeeper... (3) -> (4)
   [junit4]   2> 1863610 INFO  (zkCallback-1497-thread-1-processing-n:127.0.0.1:36816_) [n:127.0.0.1:36816_    ] o.a.s.c.c.ZkStateReader Updated live nodes from ZooKeeper... (3) -> (4)
   [junit4]   2> 1863612 INFO  (zkCallback-1485-thread-1) [    ] o.a.s.c.c.ZkStateReader Updated live nodes from ZooKeeper... (3) -> (4)
   [junit4]   2> 1863612 INFO  (zkCallback-1491-thread-1-processing-n:127.0.0.1:53926_) [n:127.0.0.1:53926_    ] o.a.s.c.c.ZkStateReader Updated live nodes from ZooKeeper... (3) -> (4)
   [junit4]   2> 1863613 INFO  (zkCallback-1504-thread-1-processing-n:127.0.0.1:54941_) [n:127.0.0.1:54941_    ] o.a.s.c.c.ZkStateReader Updated live nodes from ZooKeeper... (3) -> (4)
   [junit4]   2> 1863740 INFO  (TEST-StressHdfsTest.test-seed#[14D79D4EC8D64DB9]) [n:127.0.0.1:54941_    ] o.a.s.c.CorePropertiesLocator Found 1 core definitions underneath /x1/jenkins/jenkins-slave/workspace/Lucene-Solr-NightlyTests-6.x/checkout/solr/build/solr-core/test/J2/../../../../../../../../../../../x1/jenkins/jenkins-slave/workspace/Lucene-Solr-NightlyTests-6.x/checkout/solr/build/solr-core/test/J2/temp/solr.cloud.hdfs.StressHdfsTest_14D79D4EC8D64DB9-001/shard-3-001/cores
   [junit4]   2> 1863740 INFO  (TEST-StressHdfsTest.test-seed#[14D79D4EC8D64DB9]) [n:127.0.0.1:54941_    ] o.a.s.c.CorePropertiesLocator Cores are: [collection1]
   [junit4]   2> 1863744 INFO  (coreLoadExecutor-3408-thread-1-processing-n:127.0.0.1:54941_) [n:127.0.0.1:54941_ c:collection1   x:collection1] o.a.s.c.TransientSolrCoreCacheDefault Allocating transient cache for 4 transient cores
   [junit4]   2> 1863746 INFO  (OverseerStateUpdate-97939132895395844-127.0.0.1:46342_-n_0000000000) [n:127.0.0.1:46342_    ] o.a.s.c.o.ReplicaMutator Assigning new node to shard shard=shard1
   [junit4]   2> 1863850 INFO  (zkCallback-1491-thread-1-processing-n:127.0.0.1:53926_) [n:127.0.0.1:53926_    ] o.a.s.c.c.ZkStateReader A cluster state change: [WatchedEvent state:SyncConnected type:NodeDataChanged path:/collections/collection1/state.json] for collection [collection1] has occurred - updating... (live nodes size: [4])
   [junit4]   2> 1863850 INFO  (zkCallback-1497-thread-1-processing-n:127.0.0.1:36816_) [n:127.0.0.1:36816_    ] o.a.s.c.c.ZkStateReader A cluster state change: [WatchedEvent state:SyncConnected type:NodeDataChanged path:/collections/collection1/state.json] for collection [collection1] has occurred - updating... (live nodes size: [4])
   [junit4]   2> 1863850 INFO  (zkCallback-1504-thread-1-processing-n:127.0.0.1:54941_) [n:127.0.0.1:54941_    ] o.a.s.c.c.ZkStateReader A cluster state change: [WatchedEvent state:SyncConnected type:NodeDataChanged path:/collections/collection1/state.json] for collection [collection1] has occurred - updating... (live nodes size: [4])
   [junit4]   2> 1864019 INFO  (qtp1181403562-16681) [n:127.0.0.1:53926_    ] o.a.s.h.a.PrepRecoveryOp In WaitForState(recovering): collection=collection1, shard=shard1, thisCore=collection1, leaderDoesNot

[...truncated too long message...]

solr.core.test_col.shard5.replica2
   [junit4]   2> 3067189 INFO  (jetty-closer-1762-thread-5) [    ] o.e.j.s.h.ContextHandler Stopped o.e.j.s.ServletContextHandler@7ef3237c{/solr,null,UNAVAILABLE}
   [junit4]   2> 3067193 INFO  (zkCallback-1784-thread-4-processing-n:127.0.0.1:37093_solr) [n:127.0.0.1:37093_solr    ] o.a.s.c.c.ZkStateReader Updated live nodes from ZooKeeper... (4) -> (3)
   [junit4]   2> 3067193 INFO  (zkCallback-1808-thread-2-processing-n:127.0.0.1:38356_solr) [n:127.0.0.1:38356_solr    ] o.a.s.c.c.ZkStateReader Updated live nodes from ZooKeeper... (4) -> (3)
   [junit4]   2> 3067193 INFO  (zkCallback-1809-thread-3-processing-n:127.0.0.1:44328_solr) [n:127.0.0.1:44328_solr    ] o.a.s.c.c.ZkStateReader Updated live nodes from ZooKeeper... (4) -> (3)
   [junit4]   2> 3067198 INFO  (coreCloseExecutor-4944-thread-1) [n:127.0.0.1:44328_solr c:test_col s:shard5 r:core_node5 x:test_col_shard5_replica1] o.a.s.m.SolrMetricManager Closing metric reporters for: solr.core.test_col.shard5.replica1
   [junit4]   2> 3067200 INFO  (zkCallback-1784-thread-4-processing-n:127.0.0.1:37093_solr) [n:127.0.0.1:37093_solr    ] o.a.s.c.c.ZkStateReader Updated live nodes from ZooKeeper... (3) -> (2)
   [junit4]   2> 3067200 INFO  (zkCallback-1808-thread-2-processing-n:127.0.0.1:38356_solr) [n:127.0.0.1:38356_solr    ] o.a.s.c.c.ZkStateReader Updated live nodes from ZooKeeper... (3) -> (2)
   [junit4]   2> 3067205 INFO  (coreCloseExecutor-4947-thread-1) [n:127.0.0.1:38356_solr c:test_col s:shard4 r:core_node8 x:test_col_shard4_replica1] o.a.s.m.SolrMetricManager Closing metric reporters for: solr.core.test_col.shard4.replica1
   [junit4]   2> 3067208 INFO  (zkCallback-1784-thread-4-processing-n:127.0.0.1:37093_solr) [n:127.0.0.1:37093_solr    ] o.a.s.c.c.ZkStateReader Updated live nodes from ZooKeeper... (2) -> (1)
   [junit4]   2> 3067250 INFO  (jetty-closer-1762-thread-1) [    ] o.e.j.s.h.ContextHandler Stopped o.e.j.s.ServletContextHandler@360ab41{/solr,null,UNAVAILABLE}
   [junit4]   2> 3068425 WARN  (zkCallback-1785-thread-3-processing-n:127.0.0.1:49535_solr) [n:127.0.0.1:49535_solr    ] o.a.s.c.c.ZkStateReader ZooKeeper watch triggered, but Solr cannot talk to ZK: [KeeperErrorCode = Session expired for /live_nodes]
   [junit4]   2> 3068426 INFO  (jetty-closer-1762-thread-7) [    ] o.e.j.s.h.ContextHandler Stopped o.e.j.s.ServletContextHandler@5e4a6d32{/solr,null,UNAVAILABLE}
   [junit4]   2> 3068592 WARN  (zkCallback-1789-thread-5-processing-n:127.0.0.1:36026_solr) [n:127.0.0.1:36026_solr    ] o.a.s.c.c.ZkStateReader ZooKeeper watch triggered, but Solr cannot talk to ZK: [KeeperErrorCode = Session expired for /live_nodes]
   [junit4]   2> 3068593 INFO  (jetty-closer-1762-thread-6) [    ] o.e.j.s.h.ContextHandler Stopped o.e.j.s.ServletContextHandler@cb285ce{/solr,null,UNAVAILABLE}
   [junit4]   2> 3068679 WARN  (zkCallback-1821-thread-2-processing-n:127.0.0.1:57777_solr) [n:127.0.0.1:57777_solr    ] o.a.s.c.c.ZkStateReader ZooKeeper watch triggered, but Solr cannot talk to ZK: [KeeperErrorCode = Session expired for /live_nodes]
   [junit4]   2> 3068680 INFO  (jetty-closer-1762-thread-8) [    ] o.e.j.s.h.ContextHandler Stopped o.e.j.s.ServletContextHandler@246929dd{/solr,null,UNAVAILABLE}
   [junit4]   2> 3068692 WARN  (zkCallback-1818-thread-2-processing-n:127.0.0.1:45163_solr) [n:127.0.0.1:45163_solr    ] o.a.s.c.c.ZkStateReader ZooKeeper watch triggered, but Solr cannot talk to ZK: [KeeperErrorCode = Session expired for /live_nodes]
   [junit4]   2> 3068693 INFO  (jetty-closer-1762-thread-10) [    ] o.e.j.s.h.ContextHandler Stopped o.e.j.s.ServletContextHandler@7bf455a7{/solr,null,UNAVAILABLE}
   [junit4]   2> 3068700 WARN  (zkCallback-1809-thread-3-processing-n:127.0.0.1:44328_solr) [n:127.0.0.1:44328_solr    ] o.a.s.c.c.ZkStateReader ZooKeeper watch triggered, but Solr cannot talk to ZK: [KeeperErrorCode = Session expired for /live_nodes]
   [junit4]   2> 3068701 INFO  (jetty-closer-1762-thread-3) [    ] o.e.j.s.h.ContextHandler Stopped o.e.j.s.ServletContextHandler@6e023497{/solr,null,UNAVAILABLE}
   [junit4]   2> 3068708 WARN  (zkCallback-1808-thread-2-processing-n:127.0.0.1:38356_solr) [n:127.0.0.1:38356_solr    ] o.a.s.c.c.ZkStateReader ZooKeeper watch triggered, but Solr cannot talk to ZK: [KeeperErrorCode = Session expired for /live_nodes]
   [junit4]   2> 3068708 INFO  (jetty-closer-1762-thread-9) [    ] o.e.j.s.h.ContextHandler Stopped o.e.j.s.ServletContextHandler@1d9f46e9{/solr,null,UNAVAILABLE}
   [junit4]   2> 3068709 ERROR (SUITE-TestStressCloudBlindAtomicUpdates-seed#[14D79D4EC8D64DB9]-worker) [    ] o.a.z.s.ZooKeeperServer ZKShutdownHandler is not registered, so ZooKeeper server won't take any action on ERROR or SHUTDOWN server state changes
   [junit4]   2> 3068709 INFO  (SUITE-TestStressCloudBlindAtomicUpdates-seed#[14D79D4EC8D64DB9]-worker) [    ] o.a.s.c.ZkTestServer connecting to 127.0.0.1:58486 58486
   [junit4]   2> 3068810 INFO  (Thread-135902) [    ] o.a.s.c.ZkTestServer connecting to 127.0.0.1:58486 58486
   [junit4]   2> 3068812 WARN  (Thread-135902) [    ] o.a.s.c.ZkTestServer Watch limit violations: 
   [junit4]   2> Maximum concurrent create/delete watches above limit:
   [junit4]   2> 
   [junit4]   2> 	11	/solr/aliases.json
   [junit4]   2> 	11	/solr/clusterprops.json
   [junit4]   2> 	10	/solr/configs/org.apache.solr.cloud.TestStressCloudBlindAtomicUpdates_config-set
   [junit4]   2> 	10	/solr/security.json
   [junit4]   2> 
   [junit4]   2> Maximum concurrent data watches above limit:
   [junit4]   2> 
   [junit4]   2> 	11	/solr/clusterstate.json
   [junit4]   2> 	10	/solr/collections/test_col/state.json
   [junit4]   2> 	2	/solr/overseer_elect/election/97939205595660313-127.0.0.1:44328_solr-n_0000000004
   [junit4]   2> 	2	/solr/overseer_elect/election/97939205595660315-127.0.0.1:52325_solr-n_0000000005
   [junit4]   2> 	2	/solr/overseer_elect/election/97939205595660303-127.0.0.1:37093_solr-n_0000000001
   [junit4]   2> 
   [junit4]   2> Maximum concurrent children watches above limit:
   [junit4]   2> 
   [junit4]   2> 	11	/solr/live_nodes
   [junit4]   2> 	11	/solr/collections
   [junit4]   2> 
   [junit4]   2> 3068812 INFO  (SUITE-TestStressCloudBlindAtomicUpdates-seed#[14D79D4EC8D64DB9]-worker) [    ] o.a.s.SolrTestCaseJ4 ###deleteCore
   [junit4]   2> NOTE: leaving temporary files on disk at: /x1/jenkins/jenkins-slave/workspace/Lucene-Solr-NightlyTests-6.x/checkout/solr/build/solr-core/test/J1/temp/solr.cloud.TestStressCloudBlindAtomicUpdates_14D79D4EC8D64DB9-001
   [junit4]   2> May 10, 2017 4:29:46 PM com.carrotsearch.randomizedtesting.ThreadLeakControl checkThreadLeaks
   [junit4]   2> WARNING: Will linger awaiting termination of 1 leaked thread(s).
   [junit4]   2> NOTE: test params are: codec=Lucene62, sim=RandomSimilarity(queryNorm=true,coord=crazy): {}, locale=sq, timezone=Europe/Luxembourg
   [junit4]   2> NOTE: Linux 3.13.0-88-generic amd64/Oracle Corporation 1.8.0_121 (64-bit)/cpus=4,threads=1,free=87216960,total=531103744
   [junit4]   2> NOTE: All tests run in this JVM: [TestLeaderElectionZkExpiry, DistributedQueueTest, TestRequestForwarding, TestScoreJoinQPScore, HdfsDirectoryFactoryTest, TestConfigReload, SegmentsInfoRequestHandlerTest, RemoteQueryErrorTest, TestSegmentSorting, TestWordDelimiterFilterFactory, TestReqParamsAPI, SampleTest, SolrJmxReporterTest, SharedFSAutoReplicaFailoverUtilsTest, TestSolrDynamicMBean, DistributedDebugComponentTest, SpellCheckComponentTest, DateMathParserTest, JsonValidatorTest, TestBlendedInfixSuggestions, TestElisionMultitermQuery, TermVectorComponentTest, BasicFunctionalityTest, TestStressVersions, CoreAdminRequestStatusTest, TestLockTree, TestDistributedStatsComponentCardinality, BufferStoreTest, HdfsCollectionsAPIDistributedZkTest, TestUpdate, HdfsThreadLeakTest, AnalyticsMergeStrategyTest, IndexSchemaTest, TestRawTransformer, TestQueryTypes, IgnoreCommitOptimizeUpdateProcessorFactoryTest, TestJavabinTupleStreamParser, TestSchemaNameResource, IndexBasedSpellCheckerTest, TestFieldResource, CoreSorterTest, CdcrBootstrapTest, FileUtilsTest, LoggingHandlerTest, SpatialHeatmapFacetsTest, TestCoreContainer, SortSpecParsingTest, SimpleMLTQParserTest, ChangedSchemaMergeTest, CleanupOldIndexTest, DocumentBuilderTest, TestTrie, TestCloudDeleteByQuery, ZkControllerTest, HdfsBasicDistributedZkTest, TestManagedSynonymFilterFactory, TestFuzzyAnalyzedSuggestions, HdfsWriteToMultipleCollectionsTest, BlockJoinFacetRandomTest, CollectionStateFormat2Test, TestCursorMarkWithoutUniqueKey, SolrInfoMBeanTest, TestConfigOverlay, MoveReplicaTest, ClusterStateUpdateTest, HdfsRecoveryZkTest, TestManagedSchemaThreadSafety, TestClusterProperties, VersionInfoTest, TermsComponentTest, RuleEngineTest, TestCollectionAPIs, OpenCloseCoreStressTest, ClassificationUpdateProcessorTest, TestSolrCLIRunExample, SpellCheckCollatorTest, TestXmlQParser, CollectionsAPIDistributedZkTest, MoreLikeThisHandlerTest, DirectSolrConnectionTest, TestEmbeddedSolrServerConstructors, IndexSchemaRuntimeFieldTest, EchoParamsTest, DistributedIntervalFacetingTest, SpellingQueryConverterTest, SaslZkACLProviderTest, TestNumericTerms32, TestTolerantUpdateProcessorCloud, TestBulkSchemaAPI, ShardRoutingTest, TestQueryWrapperFilter, DistributedFacetPivotLargeTest, TestComplexPhraseLeadingWildcard, SolrIndexConfigTest, SimplePostToolTest, DistribCursorPagingTest, TestFieldCacheVsDocValues, SolrCloudExampleTest, OutOfBoxZkACLAndCredentialsProvidersTest, CdcrRequestHandlerTest, TestCharFilters, DataDrivenBlockJoinTest, HLLUtilTest, CSVRequestHandlerTest, TestExactSharedStatsCache, TestSearchPerf, SortByFunctionTest, TestUnifiedSolrHighlighter, TestDynamicFieldCollectionResource, TestReRankQParserPlugin, TestFieldSortValues, TestFiltering, SystemInfoHandlerTest, TriLevelCompositeIdRoutingTest, AddBlockUpdateTest, TestInPlaceUpdatesDistrib, TestStressCloudBlindAtomicUpdates]
   [junit4] Completed [500/711 (2!)] on J1 in 108.05s, 5 tests, 1 error <<< FAILURES!

[...truncated 44092 lines...]

[JENKINS] Lucene-Solr-NightlyTests-6.x - Build # 346 - Still Unstable

Posted by Apache Jenkins Server <je...@builds.apache.org>.
Build: https://builds.apache.org/job/Lucene-Solr-NightlyTests-6.x/346/

3 tests failed.
FAILED:  org.apache.solr.cloud.FullSolrCloudDistribCmdsTest.test

Error Message:
Captured an uncaught exception in thread: Thread[id=4107, name=Thread-942, state=RUNNABLE, group=TGRP-FullSolrCloudDistribCmdsTest]

Stack Trace:
com.carrotsearch.randomizedtesting.UncaughtExceptionError: Captured an uncaught exception in thread: Thread[id=4107, name=Thread-942, state=RUNNABLE, group=TGRP-FullSolrCloudDistribCmdsTest]
Caused by: org.apache.solr.client.solrj.impl.CloudSolrClient$RouteException: Error from server at http://127.0.0.1:55985/b_/collection2_shard3_replica1: Exception writing document id thread2_9_3 to the index; possible analysis error.
	at __randomizedtesting.SeedInfo.seed([A2FEA6BF206E2B5A]:0)
	at org.apache.solr.client.solrj.impl.CloudSolrClient.directUpdate(CloudSolrClient.java:819)
	at org.apache.solr.client.solrj.impl.CloudSolrClient.sendRequest(CloudSolrClient.java:1263)
	at org.apache.solr.client.solrj.impl.CloudSolrClient.requestWithRetryOnStaleState(CloudSolrClient.java:1134)
	at org.apache.solr.client.solrj.impl.CloudSolrClient.request(CloudSolrClient.java:1073)
	at org.apache.solr.client.solrj.SolrRequest.process(SolrRequest.java:160)
	at org.apache.solr.client.solrj.SolrRequest.process(SolrRequest.java:177)
	at org.apache.solr.cloud.FullSolrCloudDistribCmdsTest$1IndexThread.run(FullSolrCloudDistribCmdsTest.java:641)
Caused by: org.apache.solr.client.solrj.impl.HttpSolrClient$RemoteSolrException: Error from server at http://127.0.0.1:55985/b_/collection2_shard3_replica1: Exception writing document id thread2_9_3 to the index; possible analysis error.
	at org.apache.solr.client.solrj.impl.HttpSolrClient.executeMethod(HttpSolrClient.java:610)
	at org.apache.solr.client.solrj.impl.HttpSolrClient.request(HttpSolrClient.java:279)
	at org.apache.solr.client.solrj.impl.HttpSolrClient.request(HttpSolrClient.java:268)
	at org.apache.solr.client.solrj.impl.LBHttpSolrClient.doRequest(LBHttpSolrClient.java:447)
	at org.apache.solr.client.solrj.impl.LBHttpSolrClient.request(LBHttpSolrClient.java:388)
	at org.apache.solr.client.solrj.impl.CloudSolrClient.lambda$directUpdate$0(CloudSolrClient.java:796)
	at java.util.concurrent.FutureTask.run(FutureTask.java:266)
	at org.apache.solr.common.util.ExecutorUtil$MDCAwareThreadPoolExecutor.lambda$execute$0(ExecutorUtil.java:229)
	at java.util.concurrent.ThreadPoolExecutor.runWorker(ThreadPoolExecutor.java:1142)
	at java.util.concurrent.ThreadPoolExecutor$Worker.run(ThreadPoolExecutor.java:617)
	at java.lang.Thread.run(Thread.java:745)


FAILED:  org.apache.solr.handler.TestReplicationHandler.doTestReplicateAfterCoreReload

Error Message:
expected:<[{indexVersion=1494516003384,generation=2,filelist=[_bk.fdt, _bk.fdx, _bk.fnm, _bk.nvd, _bk.nvm, _bk.si, _bk_MockRandom_0.doc, _bk_MockRandom_0.sd, _bk_MockRandom_0.tfp, _bl.fdt, _bl.fdx, _bl.fnm, _bl.nvd, _bl.nvm, _bl.si, _bl_MockRandom_0.doc, _bl_MockRandom_0.sd, _bl_MockRandom_0.tio, _bl_MockRandom_0.tipo, _bm.fdt, _bm.fdx, _bm.fnm, _bm.nvd, _bm.nvm, _bm.si, _bm_MockRandom_0.doc, _bm_MockRandom_0.sd, _bm_MockRandom_0.tbk, _bm_MockRandom_0.tix, _bn.fdt, _bn.fdx, _bn.fnm, _bn.nvd, _bn.nvm, _bn.si, _bn_MockRandom_0.doc, _bn_MockRandom_0.sd, _bn_MockRandom_0.tib, _bn_MockRandom_0.tii, _bo.fdt, _bo.fdx, _bo.fnm, _bo.nvd, _bo.nvm, _bo.si, _bo_MockRandom_0.doc, _bo_MockRandom_0.sd, _bo_MockRandom_0.tio, _bo_MockRandom_0.tipo, _bp.fdt, _bp.fdx, _bp.fnm, _bp.nvd, _bp.nvm, _bp.si, _bp_MockRandom_0.doc, _bp_MockRandom_0.sd, _bp_MockRandom_0.tio, _bp_MockRandom_0.tipo, _bq.fdt, _bq.fdx, _bq.fnm, _bq.nvd, _bq.nvm, _bq.si, _bq_MockRandom_0.doc, _bq_MockRandom_0.sd, _bq_MockRandom_0.tib, _bq_MockRandom_0.tiv, _br.fdt, _br.fdx, _br.fnm, _br.nvd, _br.nvm, _br.si, _br_MockRandom_0.doc, _br_MockRandom_0.sd, _br_MockRandom_0.tim, _br_MockRandom_0.tip, _bs.fdt, _bs.fdx, _bs.fnm, _bs.nvd, _bs.nvm, _bs.si, _bs_MockRandom_0.doc, _bs_MockRandom_0.sd, _bs_MockRandom_0.tfp, _bt.fdt, _bt.fdx, _bt.fnm, _bt.nvd, _bt.nvm, _bt.si, _bt_MockRandom_0.doc, _bt_MockRandom_0.sd, _bt_MockRandom_0.tio, _bt_MockRandom_0.tipo, _bu.fdt, _bu.fdx, _bu.fnm, _bu.nvd, _bu.nvm, _bu.si, _bu_MockRandom_0.doc, _bu_MockRandom_0.sd, _bu_MockRandom_0.tim, _bu_MockRandom_0.tip, _bv.fdt, _bv.fdx, _bv.fnm, _bv.nvd, _bv.nvm, _bv.si, _bv_MockRandom_0.doc, _bv_MockRandom_0.sd, _bv_MockRandom_0.tim, _bv_MockRandom_0.tip, _bw.fdt, _bw.fdx, _bw.fnm, _bw.nvd, _bw.nvm, _bw.si, _bw_MockRandom_0.doc, _bw_MockRandom_0.sd, _bw_MockRandom_0.tib, _bw_MockRandom_0.tiv, _bx.fdt, _bx.fdx, _bx.fnm, _bx.nvd, _bx.nvm, _bx.si, _bx_MockRandom_0.doc, _bx_MockRandom_0.sd, _bx_MockRandom_0.tib, _bx_MockRandom_0.tiv, _by.fdt, _by.fdx, _by.fnm, _by.nvd, _by.nvm, _by.si, _by_MockRandom_0.doc, _by_MockRandom_0.sd, _by_MockRandom_0.tib, _by_MockRandom_0.tii, _bz.fdt, _bz.fdx, _bz.fnm, _bz.nvd, _bz.nvm, _bz.si, _bz_MockRandom_0.doc, _bz_MockRandom_0.sd, _bz_MockRandom_0.tbk, _bz_MockRandom_0.tix, _c0.fdt, _c0.fdx, _c0.fnm, _c0.nvd, _c0.nvm, _c0.si, _c0_MockRandom_0.doc, _c0_MockRandom_0.sd, _c0_MockRandom_0.tib, _c0_MockRandom_0.tii, _c1.fdt, _c1.fdx, _c1.fnm, _c1.nvd, _c1.nvm, _c1.si, _c1_MockRandom_0.doc, _c1_MockRandom_0.sd, _c1_MockRandom_0.tbk, _c1_MockRandom_0.tix, _c2.fdt, _c2.fdx, _c2.fnm, _c2.nvd, _c2.nvm, _c2.si, _c2_MockRandom_0.doc, _c2_MockRandom_0.sd, _c2_MockRandom_0.tbk, _c2_MockRandom_0.tix, _c3.fdt, _c3.fdx, _c3.fnm, _c3.nvd, _c3.nvm, _c3.si, _c3_MockRandom_0.doc, _c3_MockRandom_0.sd, _c3_MockRandom_0.tfp, _c4.fdt, _c4.fdx, _c4.fnm, _c4.nvd, _c4.nvm, _c4.si, _c4_MockRandom_0.doc, _c4_MockRandom_0.sd, _c4_MockRandom_0.tib, _c4_MockRandom_0.tii, _c5.fdt, _c5.fdx, _c5.fnm, _c5.nvd, _c5.nvm, _c5.si, _c5_MockRandom_0.doc, _c5_MockRandom_0.sd, _c5_MockRandom_0.tio, _c5_MockRandom_0.tipo, _c6.fdt, _c6.fdx, _c6.fnm, _c6.nvd, _c6.nvm, _c6.si, _c6_MockRandom_0.doc, _c6_MockRandom_0.sd, _c6_MockRandom_0.tbk, _c6_MockRandom_0.tix, _c7.fdt, _c7.fdx, _c7.fnm, _c7.nvd, _c7.nvm, _c7.si, _c7_MockRandom_0.doc, _c7_MockRandom_0.sd, _c7_MockRandom_0.tio, _c7_MockRandom_0.tipo, _c8.fdt, _c8.fdx, _c8.fnm, _c8.nvd, _c8.nvm, _c8.si, _c8_MockRandom_0.doc, _c8_MockRandom_0.sd, _c8_MockRandom_0.tim, _c8_MockRandom_0.tip, _c9.fdt, _c9.fdx, _c9.fnm, _c9.nvd, _c9.nvm, _c9.si, _c9_MockRandom_0.doc, _c9_MockRandom_0.sd, _c9_MockRandom_0.tfp, _ca.fdt, _ca.fdx, _ca.fnm, _ca.nvd, _ca.nvm, _ca.si, _ca_MockRandom_0.doc, _ca_MockRandom_0.sd, _ca_MockRandom_0.tim, _ca_MockRandom_0.tip, _cb.fdt, _cb.fdx, _cb.fnm, _cb.nvd, _cb.nvm, _cb.si, _cb_MockRandom_0.doc, _cb_MockRandom_0.sd, _cb_MockRandom_0.tfp, _cc.fdt, _cc.fdx, _cc.fnm, _cc.nvd, _cc.nvm, _cc.si, _cc_MockRandom_0.doc, _cc_MockRandom_0.sd, _cc_MockRandom_0.tfp, _cd.fdt, _cd.fdx, _cd.fnm, _cd.nvd, _cd.nvm, _cd.si, _cd_MockRandom_0.doc, _cd_MockRandom_0.sd, _cd_MockRandom_0.tbk, _cd_MockRandom_0.tix, _ce.fdt, _ce.fdx, _ce.fnm, _ce.nvd, _ce.nvm, _ce.si, _ce_MockRandom_0.doc, _ce_MockRandom_0.sd, _ce_MockRandom_0.tib, _ce_MockRandom_0.tiv, _cf.fdt, _cf.fdx, _cf.fnm, _cf.nvd, _cf.nvm, _cf.si, _cf_MockRandom_0.doc, _cf_MockRandom_0.sd, _cf_MockRandom_0.tbk, _cf_MockRandom_0.tix, segments_2]}]> but was:<[{indexVersion=1494516003384,generation=2,filelist=[_bk.fdt, _bk.fdx, _bk.fnm, _bk.nvd, _bk.nvm, _bk.si, _bk_MockRandom_0.doc, _bk_MockRandom_0.sd, _bk_MockRandom_0.tfp, _bl.fdt, _bl.fdx, _bl.fnm, _bl.nvd, _bl.nvm, _bl.si, _bl_MockRandom_0.doc, _bl_MockRandom_0.sd, _bl_MockRandom_0.tio, _bl_MockRandom_0.tipo, _bm.fdt, _bm.fdx, _bm.fnm, _bm.nvd, _bm.nvm, _bm.si, _bm_MockRandom_0.doc, _bm_MockRandom_0.sd, _bm_MockRandom_0.tbk, _bm_MockRandom_0.tix, _bn.fdt, _bn.fdx, _bn.fnm, _bn.nvd, _bn.nvm, _bn.si, _bn_MockRandom_0.doc, _bn_MockRandom_0.sd, _bn_MockRandom_0.tib, _bn_MockRandom_0.tii, _bo.fdt, _bo.fdx, _bo.fnm, _bo.nvd, _bo.nvm, _bo.si, _bo_MockRandom_0.doc, _bo_MockRandom_0.sd, _bo_MockRandom_0.tio, _bo_MockRandom_0.tipo, _bp.fdt, _bp.fdx, _bp.fnm, _bp.nvd, _bp.nvm, _bp.si, _bp_MockRandom_0.doc, _bp_MockRandom_0.sd, _bp_MockRandom_0.tio, _bp_MockRandom_0.tipo, _bq.fdt, _bq.fdx, _bq.fnm, _bq.nvd, _bq.nvm, _bq.si, _bq_MockRandom_0.doc, _bq_MockRandom_0.sd, _bq_MockRandom_0.tib, _bq_MockRandom_0.tiv, _br.fdt, _br.fdx, _br.fnm, _br.nvd, _br.nvm, _br.si, _br_MockRandom_0.doc, _br_MockRandom_0.sd, _br_MockRandom_0.tim, _br_MockRandom_0.tip, _bs.fdt, _bs.fdx, _bs.fnm, _bs.nvd, _bs.nvm, _bs.si, _bs_MockRandom_0.doc, _bs_MockRandom_0.sd, _bs_MockRandom_0.tfp, _bt.fdt, _bt.fdx, _bt.fnm, _bt.nvd, _bt.nvm, _bt.si, _bt_MockRandom_0.doc, _bt_MockRandom_0.sd, _bt_MockRandom_0.tio, _bt_MockRandom_0.tipo, _bu.fdt, _bu.fdx, _bu.fnm, _bu.nvd, _bu.nvm, _bu.si, _bu_MockRandom_0.doc, _bu_MockRandom_0.sd, _bu_MockRandom_0.tim, _bu_MockRandom_0.tip, _bv.fdt, _bv.fdx, _bv.fnm, _bv.nvd, _bv.nvm, _bv.si, _bv_MockRandom_0.doc, _bv_MockRandom_0.sd, _bv_MockRandom_0.tim, _bv_MockRandom_0.tip, _bw.fdt, _bw.fdx, _bw.fnm, _bw.nvd, _bw.nvm, _bw.si, _bw_MockRandom_0.doc, _bw_MockRandom_0.sd, _bw_MockRandom_0.tib, _bw_MockRandom_0.tiv, _bx.fdt, _bx.fdx, _bx.fnm, _bx.nvd, _bx.nvm, _bx.si, _bx_MockRandom_0.doc, _bx_MockRandom_0.sd, _bx_MockRandom_0.tib, _bx_MockRandom_0.tiv, _by.fdt, _by.fdx, _by.fnm, _by.nvd, _by.nvm, _by.si, _by_MockRandom_0.doc, _by_MockRandom_0.sd, _by_MockRandom_0.tib, _by_MockRandom_0.tii, _bz.fdt, _bz.fdx, _bz.fnm, _bz.nvd, _bz.nvm, _bz.si, _bz_MockRandom_0.doc, _bz_MockRandom_0.sd, _bz_MockRandom_0.tbk, _bz_MockRandom_0.tix, _c0.fdt, _c0.fdx, _c0.fnm, _c0.nvd, _c0.nvm, _c0.si, _c0_MockRandom_0.doc, _c0_MockRandom_0.sd, _c0_MockRandom_0.tib, _c0_MockRandom_0.tii, _c1.fdt, _c1.fdx, _c1.fnm, _c1.nvd, _c1.nvm, _c1.si, _c1_MockRandom_0.doc, _c1_MockRandom_0.sd, _c1_MockRandom_0.tbk, _c1_MockRandom_0.tix, _c2.fdt, _c2.fdx, _c2.fnm, _c2.nvd, _c2.nvm, _c2.si, _c2_MockRandom_0.doc, _c2_MockRandom_0.sd, _c2_MockRandom_0.tbk, _c2_MockRandom_0.tix, _c3.fdt, _c3.fdx, _c3.fnm, _c3.nvd, _c3.nvm, _c3.si, _c3_MockRandom_0.doc, _c3_MockRandom_0.sd, _c3_MockRandom_0.tfp, _c4.fdt, _c4.fdx, _c4.fnm, _c4.nvd, _c4.nvm, _c4.si, _c4_MockRandom_0.doc, _c4_MockRandom_0.sd, _c4_MockRandom_0.tib, _c4_MockRandom_0.tii, _c5.fdt, _c5.fdx, _c5.fnm, _c5.nvd, _c5.nvm, _c5.si, _c5_MockRandom_0.doc, _c5_MockRandom_0.sd, _c5_MockRandom_0.tio, _c5_MockRandom_0.tipo, _c6.fdt, _c6.fdx, _c6.fnm, _c6.nvd, _c6.nvm, _c6.si, _c6_MockRandom_0.doc, _c6_MockRandom_0.sd, _c6_MockRandom_0.tbk, _c6_MockRandom_0.tix, _c7.fdt, _c7.fdx, _c7.fnm, _c7.nvd, _c7.nvm, _c7.si, _c7_MockRandom_0.doc, _c7_MockRandom_0.sd, _c7_MockRandom_0.tio, _c7_MockRandom_0.tipo, _c8.fdt, _c8.fdx, _c8.fnm, _c8.nvd, _c8.nvm, _c8.si, _c8_MockRandom_0.doc, _c8_MockRandom_0.sd, _c8_MockRandom_0.tim, _c8_MockRandom_0.tip, _c9.fdt, _c9.fdx, _c9.fnm, _c9.nvd, _c9.nvm, _c9.si, _c9_MockRandom_0.doc, _c9_MockRandom_0.sd, _c9_MockRandom_0.tfp, _ca.fdt, _ca.fdx, _ca.fnm, _ca.nvd, _ca.nvm, _ca.si, _ca_MockRandom_0.doc, _ca_MockRandom_0.sd, _ca_MockRandom_0.tim, _ca_MockRandom_0.tip, _cb.fdt, _cb.fdx, _cb.fnm, _cb.nvd, _cb.nvm, _cb.si, _cb_MockRandom_0.doc, _cb_MockRandom_0.sd, _cb_MockRandom_0.tfp, _cc.fdt, _cc.fdx, _cc.fnm, _cc.nvd, _cc.nvm, _cc.si, _cc_MockRandom_0.doc, _cc_MockRandom_0.sd, _cc_MockRandom_0.tfp, _cd.fdt, _cd.fdx, _cd.fnm, _cd.nvd, _cd.nvm, _cd.si, _cd_MockRandom_0.doc, _cd_MockRandom_0.sd, _cd_MockRandom_0.tbk, _cd_MockRandom_0.tix, _ce.fdt, _ce.fdx, _ce.fnm, _ce.nvd, _ce.nvm, _ce.si, _ce_MockRandom_0.doc, _ce_MockRandom_0.sd, _ce_MockRandom_0.tib, _ce_MockRandom_0.tiv, _cf.fdt, _cf.fdx, _cf.fnm, _cf.nvd, _cf.nvm, _cf.si, _cf_MockRandom_0.doc, _cf_MockRandom_0.sd, _cf_MockRandom_0.tbk, _cf_MockRandom_0.tix, segments_2]}, {indexVersion=1494516003384,generation=3,filelist=[_cg.fdt, _cg.fdx, _cg.fnm, _cg.nvd, _cg.nvm, _cg.si, _cg_MockRandom_0.doc, _cg_MockRandom_0.sd, _cg_MockRandom_0.tio, _cg_MockRandom_0.tipo, segments_3]}]>

Stack Trace:
java.lang.AssertionError: expected:<[{indexVersion=1494516003384,generation=2,filelist=[_bk.fdt, _bk.fdx, _bk.fnm, _bk.nvd, _bk.nvm, _bk.si, _bk_MockRandom_0.doc, _bk_MockRandom_0.sd, _bk_MockRandom_0.tfp, _bl.fdt, _bl.fdx, _bl.fnm, _bl.nvd, _bl.nvm, _bl.si, _bl_MockRandom_0.doc, _bl_MockRandom_0.sd, _bl_MockRandom_0.tio, _bl_MockRandom_0.tipo, _bm.fdt, _bm.fdx, _bm.fnm, _bm.nvd, _bm.nvm, _bm.si, _bm_MockRandom_0.doc, _bm_MockRandom_0.sd, _bm_MockRandom_0.tbk, _bm_MockRandom_0.tix, _bn.fdt, _bn.fdx, _bn.fnm, _bn.nvd, _bn.nvm, _bn.si, _bn_MockRandom_0.doc, _bn_MockRandom_0.sd, _bn_MockRandom_0.tib, _bn_MockRandom_0.tii, _bo.fdt, _bo.fdx, _bo.fnm, _bo.nvd, _bo.nvm, _bo.si, _bo_MockRandom_0.doc, _bo_MockRandom_0.sd, _bo_MockRandom_0.tio, _bo_MockRandom_0.tipo, _bp.fdt, _bp.fdx, _bp.fnm, _bp.nvd, _bp.nvm, _bp.si, _bp_MockRandom_0.doc, _bp_MockRandom_0.sd, _bp_MockRandom_0.tio, _bp_MockRandom_0.tipo, _bq.fdt, _bq.fdx, _bq.fnm, _bq.nvd, _bq.nvm, _bq.si, _bq_MockRandom_0.doc, _bq_MockRandom_0.sd, _bq_MockRandom_0.tib, _bq_MockRandom_0.tiv, _br.fdt, _br.fdx, _br.fnm, _br.nvd, _br.nvm, _br.si, _br_MockRandom_0.doc, _br_MockRandom_0.sd, _br_MockRandom_0.tim, _br_MockRandom_0.tip, _bs.fdt, _bs.fdx, _bs.fnm, _bs.nvd, _bs.nvm, _bs.si, _bs_MockRandom_0.doc, _bs_MockRandom_0.sd, _bs_MockRandom_0.tfp, _bt.fdt, _bt.fdx, _bt.fnm, _bt.nvd, _bt.nvm, _bt.si, _bt_MockRandom_0.doc, _bt_MockRandom_0.sd, _bt_MockRandom_0.tio, _bt_MockRandom_0.tipo, _bu.fdt, _bu.fdx, _bu.fnm, _bu.nvd, _bu.nvm, _bu.si, _bu_MockRandom_0.doc, _bu_MockRandom_0.sd, _bu_MockRandom_0.tim, _bu_MockRandom_0.tip, _bv.fdt, _bv.fdx, _bv.fnm, _bv.nvd, _bv.nvm, _bv.si, _bv_MockRandom_0.doc, _bv_MockRandom_0.sd, _bv_MockRandom_0.tim, _bv_MockRandom_0.tip, _bw.fdt, _bw.fdx, _bw.fnm, _bw.nvd, _bw.nvm, _bw.si, _bw_MockRandom_0.doc, _bw_MockRandom_0.sd, _bw_MockRandom_0.tib, _bw_MockRandom_0.tiv, _bx.fdt, _bx.fdx, _bx.fnm, _bx.nvd, _bx.nvm, _bx.si, _bx_MockRandom_0.doc, _bx_MockRandom_0.sd, _bx_MockRandom_0.tib, _bx_MockRandom_0.tiv, _by.fdt, _by.fdx, _by.fnm, _by.nvd, _by.nvm, _by.si, _by_MockRandom_0.doc, _by_MockRandom_0.sd, _by_MockRandom_0.tib, _by_MockRandom_0.tii, _bz.fdt, _bz.fdx, _bz.fnm, _bz.nvd, _bz.nvm, _bz.si, _bz_MockRandom_0.doc, _bz_MockRandom_0.sd, _bz_MockRandom_0.tbk, _bz_MockRandom_0.tix, _c0.fdt, _c0.fdx, _c0.fnm, _c0.nvd, _c0.nvm, _c0.si, _c0_MockRandom_0.doc, _c0_MockRandom_0.sd, _c0_MockRandom_0.tib, _c0_MockRandom_0.tii, _c1.fdt, _c1.fdx, _c1.fnm, _c1.nvd, _c1.nvm, _c1.si, _c1_MockRandom_0.doc, _c1_MockRandom_0.sd, _c1_MockRandom_0.tbk, _c1_MockRandom_0.tix, _c2.fdt, _c2.fdx, _c2.fnm, _c2.nvd, _c2.nvm, _c2.si, _c2_MockRandom_0.doc, _c2_MockRandom_0.sd, _c2_MockRandom_0.tbk, _c2_MockRandom_0.tix, _c3.fdt, _c3.fdx, _c3.fnm, _c3.nvd, _c3.nvm, _c3.si, _c3_MockRandom_0.doc, _c3_MockRandom_0.sd, _c3_MockRandom_0.tfp, _c4.fdt, _c4.fdx, _c4.fnm, _c4.nvd, _c4.nvm, _c4.si, _c4_MockRandom_0.doc, _c4_MockRandom_0.sd, _c4_MockRandom_0.tib, _c4_MockRandom_0.tii, _c5.fdt, _c5.fdx, _c5.fnm, _c5.nvd, _c5.nvm, _c5.si, _c5_MockRandom_0.doc, _c5_MockRandom_0.sd, _c5_MockRandom_0.tio, _c5_MockRandom_0.tipo, _c6.fdt, _c6.fdx, _c6.fnm, _c6.nvd, _c6.nvm, _c6.si, _c6_MockRandom_0.doc, _c6_MockRandom_0.sd, _c6_MockRandom_0.tbk, _c6_MockRandom_0.tix, _c7.fdt, _c7.fdx, _c7.fnm, _c7.nvd, _c7.nvm, _c7.si, _c7_MockRandom_0.doc, _c7_MockRandom_0.sd, _c7_MockRandom_0.tio, _c7_MockRandom_0.tipo, _c8.fdt, _c8.fdx, _c8.fnm, _c8.nvd, _c8.nvm, _c8.si, _c8_MockRandom_0.doc, _c8_MockRandom_0.sd, _c8_MockRandom_0.tim, _c8_MockRandom_0.tip, _c9.fdt, _c9.fdx, _c9.fnm, _c9.nvd, _c9.nvm, _c9.si, _c9_MockRandom_0.doc, _c9_MockRandom_0.sd, _c9_MockRandom_0.tfp, _ca.fdt, _ca.fdx, _ca.fnm, _ca.nvd, _ca.nvm, _ca.si, _ca_MockRandom_0.doc, _ca_MockRandom_0.sd, _ca_MockRandom_0.tim, _ca_MockRandom_0.tip, _cb.fdt, _cb.fdx, _cb.fnm, _cb.nvd, _cb.nvm, _cb.si, _cb_MockRandom_0.doc, _cb_MockRandom_0.sd, _cb_MockRandom_0.tfp, _cc.fdt, _cc.fdx, _cc.fnm, _cc.nvd, _cc.nvm, _cc.si, _cc_MockRandom_0.doc, _cc_MockRandom_0.sd, _cc_MockRandom_0.tfp, _cd.fdt, _cd.fdx, _cd.fnm, _cd.nvd, _cd.nvm, _cd.si, _cd_MockRandom_0.doc, _cd_MockRandom_0.sd, _cd_MockRandom_0.tbk, _cd_MockRandom_0.tix, _ce.fdt, _ce.fdx, _ce.fnm, _ce.nvd, _ce.nvm, _ce.si, _ce_MockRandom_0.doc, _ce_MockRandom_0.sd, _ce_MockRandom_0.tib, _ce_MockRandom_0.tiv, _cf.fdt, _cf.fdx, _cf.fnm, _cf.nvd, _cf.nvm, _cf.si, _cf_MockRandom_0.doc, _cf_MockRandom_0.sd, _cf_MockRandom_0.tbk, _cf_MockRandom_0.tix, segments_2]}]> but was:<[{indexVersion=1494516003384,generation=2,filelist=[_bk.fdt, _bk.fdx, _bk.fnm, _bk.nvd, _bk.nvm, _bk.si, _bk_MockRandom_0.doc, _bk_MockRandom_0.sd, _bk_MockRandom_0.tfp, _bl.fdt, _bl.fdx, _bl.fnm, _bl.nvd, _bl.nvm, _bl.si, _bl_MockRandom_0.doc, _bl_MockRandom_0.sd, _bl_MockRandom_0.tio, _bl_MockRandom_0.tipo, _bm.fdt, _bm.fdx, _bm.fnm, _bm.nvd, _bm.nvm, _bm.si, _bm_MockRandom_0.doc, _bm_MockRandom_0.sd, _bm_MockRandom_0.tbk, _bm_MockRandom_0.tix, _bn.fdt, _bn.fdx, _bn.fnm, _bn.nvd, _bn.nvm, _bn.si, _bn_MockRandom_0.doc, _bn_MockRandom_0.sd, _bn_MockRandom_0.tib, _bn_MockRandom_0.tii, _bo.fdt, _bo.fdx, _bo.fnm, _bo.nvd, _bo.nvm, _bo.si, _bo_MockRandom_0.doc, _bo_MockRandom_0.sd, _bo_MockRandom_0.tio, _bo_MockRandom_0.tipo, _bp.fdt, _bp.fdx, _bp.fnm, _bp.nvd, _bp.nvm, _bp.si, _bp_MockRandom_0.doc, _bp_MockRandom_0.sd, _bp_MockRandom_0.tio, _bp_MockRandom_0.tipo, _bq.fdt, _bq.fdx, _bq.fnm, _bq.nvd, _bq.nvm, _bq.si, _bq_MockRandom_0.doc, _bq_MockRandom_0.sd, _bq_MockRandom_0.tib, _bq_MockRandom_0.tiv, _br.fdt, _br.fdx, _br.fnm, _br.nvd, _br.nvm, _br.si, _br_MockRandom_0.doc, _br_MockRandom_0.sd, _br_MockRandom_0.tim, _br_MockRandom_0.tip, _bs.fdt, _bs.fdx, _bs.fnm, _bs.nvd, _bs.nvm, _bs.si, _bs_MockRandom_0.doc, _bs_MockRandom_0.sd, _bs_MockRandom_0.tfp, _bt.fdt, _bt.fdx, _bt.fnm, _bt.nvd, _bt.nvm, _bt.si, _bt_MockRandom_0.doc, _bt_MockRandom_0.sd, _bt_MockRandom_0.tio, _bt_MockRandom_0.tipo, _bu.fdt, _bu.fdx, _bu.fnm, _bu.nvd, _bu.nvm, _bu.si, _bu_MockRandom_0.doc, _bu_MockRandom_0.sd, _bu_MockRandom_0.tim, _bu_MockRandom_0.tip, _bv.fdt, _bv.fdx, _bv.fnm, _bv.nvd, _bv.nvm, _bv.si, _bv_MockRandom_0.doc, _bv_MockRandom_0.sd, _bv_MockRandom_0.tim, _bv_MockRandom_0.tip, _bw.fdt, _bw.fdx, _bw.fnm, _bw.nvd, _bw.nvm, _bw.si, _bw_MockRandom_0.doc, _bw_MockRandom_0.sd, _bw_MockRandom_0.tib, _bw_MockRandom_0.tiv, _bx.fdt, _bx.fdx, _bx.fnm, _bx.nvd, _bx.nvm, _bx.si, _bx_MockRandom_0.doc, _bx_MockRandom_0.sd, _bx_MockRandom_0.tib, _bx_MockRandom_0.tiv, _by.fdt, _by.fdx, _by.fnm, _by.nvd, _by.nvm, _by.si, _by_MockRandom_0.doc, _by_MockRandom_0.sd, _by_MockRandom_0.tib, _by_MockRandom_0.tii, _bz.fdt, _bz.fdx, _bz.fnm, _bz.nvd, _bz.nvm, _bz.si, _bz_MockRandom_0.doc, _bz_MockRandom_0.sd, _bz_MockRandom_0.tbk, _bz_MockRandom_0.tix, _c0.fdt, _c0.fdx, _c0.fnm, _c0.nvd, _c0.nvm, _c0.si, _c0_MockRandom_0.doc, _c0_MockRandom_0.sd, _c0_MockRandom_0.tib, _c0_MockRandom_0.tii, _c1.fdt, _c1.fdx, _c1.fnm, _c1.nvd, _c1.nvm, _c1.si, _c1_MockRandom_0.doc, _c1_MockRandom_0.sd, _c1_MockRandom_0.tbk, _c1_MockRandom_0.tix, _c2.fdt, _c2.fdx, _c2.fnm, _c2.nvd, _c2.nvm, _c2.si, _c2_MockRandom_0.doc, _c2_MockRandom_0.sd, _c2_MockRandom_0.tbk, _c2_MockRandom_0.tix, _c3.fdt, _c3.fdx, _c3.fnm, _c3.nvd, _c3.nvm, _c3.si, _c3_MockRandom_0.doc, _c3_MockRandom_0.sd, _c3_MockRandom_0.tfp, _c4.fdt, _c4.fdx, _c4.fnm, _c4.nvd, _c4.nvm, _c4.si, _c4_MockRandom_0.doc, _c4_MockRandom_0.sd, _c4_MockRandom_0.tib, _c4_MockRandom_0.tii, _c5.fdt, _c5.fdx, _c5.fnm, _c5.nvd, _c5.nvm, _c5.si, _c5_MockRandom_0.doc, _c5_MockRandom_0.sd, _c5_MockRandom_0.tio, _c5_MockRandom_0.tipo, _c6.fdt, _c6.fdx, _c6.fnm, _c6.nvd, _c6.nvm, _c6.si, _c6_MockRandom_0.doc, _c6_MockRandom_0.sd, _c6_MockRandom_0.tbk, _c6_MockRandom_0.tix, _c7.fdt, _c7.fdx, _c7.fnm, _c7.nvd, _c7.nvm, _c7.si, _c7_MockRandom_0.doc, _c7_MockRandom_0.sd, _c7_MockRandom_0.tio, _c7_MockRandom_0.tipo, _c8.fdt, _c8.fdx, _c8.fnm, _c8.nvd, _c8.nvm, _c8.si, _c8_MockRandom_0.doc, _c8_MockRandom_0.sd, _c8_MockRandom_0.tim, _c8_MockRandom_0.tip, _c9.fdt, _c9.fdx, _c9.fnm, _c9.nvd, _c9.nvm, _c9.si, _c9_MockRandom_0.doc, _c9_MockRandom_0.sd, _c9_MockRandom_0.tfp, _ca.fdt, _ca.fdx, _ca.fnm, _ca.nvd, _ca.nvm, _ca.si, _ca_MockRandom_0.doc, _ca_MockRandom_0.sd, _ca_MockRandom_0.tim, _ca_MockRandom_0.tip, _cb.fdt, _cb.fdx, _cb.fnm, _cb.nvd, _cb.nvm, _cb.si, _cb_MockRandom_0.doc, _cb_MockRandom_0.sd, _cb_MockRandom_0.tfp, _cc.fdt, _cc.fdx, _cc.fnm, _cc.nvd, _cc.nvm, _cc.si, _cc_MockRandom_0.doc, _cc_MockRandom_0.sd, _cc_MockRandom_0.tfp, _cd.fdt, _cd.fdx, _cd.fnm, _cd.nvd, _cd.nvm, _cd.si, _cd_MockRandom_0.doc, _cd_MockRandom_0.sd, _cd_MockRandom_0.tbk, _cd_MockRandom_0.tix, _ce.fdt, _ce.fdx, _ce.fnm, _ce.nvd, _ce.nvm, _ce.si, _ce_MockRandom_0.doc, _ce_MockRandom_0.sd, _ce_MockRandom_0.tib, _ce_MockRandom_0.tiv, _cf.fdt, _cf.fdx, _cf.fnm, _cf.nvd, _cf.nvm, _cf.si, _cf_MockRandom_0.doc, _cf_MockRandom_0.sd, _cf_MockRandom_0.tbk, _cf_MockRandom_0.tix, segments_2]}, {indexVersion=1494516003384,generation=3,filelist=[_cg.fdt, _cg.fdx, _cg.fnm, _cg.nvd, _cg.nvm, _cg.si, _cg_MockRandom_0.doc, _cg_MockRandom_0.sd, _cg_MockRandom_0.tio, _cg_MockRandom_0.tipo, segments_3]}]>
	at __randomizedtesting.SeedInfo.seed([A2FEA6BF206E2B5A:8729BD8F50262559]:0)
	at org.junit.Assert.fail(Assert.java:93)
	at org.junit.Assert.failNotEquals(Assert.java:647)
	at org.junit.Assert.assertEquals(Assert.java:128)
	at org.junit.Assert.assertEquals(Assert.java:147)
	at org.apache.solr.handler.TestReplicationHandler.doTestReplicateAfterCoreReload(TestReplicationHandler.java:1281)
	at sun.reflect.NativeMethodAccessorImpl.invoke0(Native Method)
	at sun.reflect.NativeMethodAccessorImpl.invoke(NativeMethodAccessorImpl.java:62)
	at sun.reflect.DelegatingMethodAccessorImpl.invoke(DelegatingMethodAccessorImpl.java:43)
	at java.lang.reflect.Method.invoke(Method.java:498)
	at com.carrotsearch.randomizedtesting.RandomizedRunner.invoke(RandomizedRunner.java:1713)
	at com.carrotsearch.randomizedtesting.RandomizedRunner$8.evaluate(RandomizedRunner.java:907)
	at com.carrotsearch.randomizedtesting.RandomizedRunner$9.evaluate(RandomizedRunner.java:943)
	at com.carrotsearch.randomizedtesting.RandomizedRunner$10.evaluate(RandomizedRunner.java:957)
	at com.carrotsearch.randomizedtesting.rules.SystemPropertiesRestoreRule$1.evaluate(SystemPropertiesRestoreRule.java:57)
	at org.apache.lucene.util.TestRuleSetupTeardownChained$1.evaluate(TestRuleSetupTeardownChained.java:49)
	at org.apache.lucene.util.AbstractBeforeAfterRule$1.evaluate(AbstractBeforeAfterRule.java:45)
	at org.apache.lucene.util.TestRuleThreadAndTestName$1.evaluate(TestRuleThreadAndTestName.java:48)
	at org.apache.lucene.util.TestRuleIgnoreAfterMaxFailures$1.evaluate(TestRuleIgnoreAfterMaxFailures.java:64)
	at org.apache.lucene.util.TestRuleMarkFailure$1.evaluate(TestRuleMarkFailure.java:47)
	at com.carrotsearch.randomizedtesting.rules.StatementAdapter.evaluate(StatementAdapter.java:36)
	at com.carrotsearch.randomizedtesting.ThreadLeakControl$StatementRunner.run(ThreadLeakControl.java:368)
	at com.carrotsearch.randomizedtesting.ThreadLeakControl.forkTimeoutingTask(ThreadLeakControl.java:817)
	at com.carrotsearch.randomizedtesting.ThreadLeakControl$3.evaluate(ThreadLeakControl.java:468)
	at com.carrotsearch.randomizedtesting.RandomizedRunner.runSingleTest(RandomizedRunner.java:916)
	at com.carrotsearch.randomizedtesting.RandomizedRunner$5.evaluate(RandomizedRunner.java:802)
	at com.carrotsearch.randomizedtesting.RandomizedRunner$6.evaluate(RandomizedRunner.java:852)
	at com.carrotsearch.randomizedtesting.RandomizedRunner$7.evaluate(RandomizedRunner.java:863)
	at com.carrotsearch.randomizedtesting.rules.StatementAdapter.evaluate(StatementAdapter.java:36)
	at com.carrotsearch.randomizedtesting.rules.SystemPropertiesRestoreRule$1.evaluate(SystemPropertiesRestoreRule.java:57)
	at org.apache.lucene.util.AbstractBeforeAfterRule$1.evaluate(AbstractBeforeAfterRule.java:45)
	at com.carrotsearch.randomizedtesting.rules.StatementAdapter.evaluate(StatementAdapter.java:36)
	at org.apache.lucene.util.TestRuleStoreClassName$1.evaluate(TestRuleStoreClassName.java:41)
	at com.carrotsearch.randomizedtesting.rules.NoShadowingOrOverridesOnMethodsRule$1.evaluate(NoShadowingOrOverridesOnMethodsRule.java:40)
	at com.carrotsearch.randomizedtesting.rules.NoShadowingOrOverridesOnMethodsRule$1.evaluate(NoShadowingOrOverridesOnMethodsRule.java:40)
	at com.carrotsearch.randomizedtesting.rules.StatementAdapter.evaluate(StatementAdapter.java:36)
	at com.carrotsearch.randomizedtesting.rules.StatementAdapter.evaluate(StatementAdapter.java:36)
	at com.carrotsearch.randomizedtesting.rules.StatementAdapter.evaluate(StatementAdapter.java:36)
	at org.apache.lucene.util.TestRuleAssertionsRequired$1.evaluate(TestRuleAssertionsRequired.java:53)
	at org.apache.lucene.util.TestRuleMarkFailure$1.evaluate(TestRuleMarkFailure.java:47)
	at org.apache.lucene.util.TestRuleIgnoreAfterMaxFailures$1.evaluate(TestRuleIgnoreAfterMaxFailures.java:64)
	at org.apache.lucene.util.TestRuleIgnoreTestSuites$1.evaluate(TestRuleIgnoreTestSuites.java:54)
	at com.carrotsearch.randomizedtesting.rules.StatementAdapter.evaluate(StatementAdapter.java:36)
	at com.carrotsearch.randomizedtesting.ThreadLeakControl$StatementRunner.run(ThreadLeakControl.java:368)
	at java.lang.Thread.run(Thread.java:745)


FAILED:  org.apache.solr.update.TestInPlaceUpdatesDistrib.test

Error Message:
Timeout occured while waiting response from server at: http://127.0.0.1:37160/g_i/g/collection1

Stack Trace:
org.apache.solr.client.solrj.SolrServerException: Timeout occured while waiting response from server at: http://127.0.0.1:37160/g_i/g/collection1
	at __randomizedtesting.SeedInfo.seed([A2FEA6BF206E2B5A:2AAA99658E9246A2]:0)
	at org.apache.solr.client.solrj.impl.HttpSolrClient.executeMethod(HttpSolrClient.java:621)
	at org.apache.solr.client.solrj.impl.HttpSolrClient.request(HttpSolrClient.java:279)
	at org.apache.solr.client.solrj.impl.HttpSolrClient.request(HttpSolrClient.java:268)
	at org.apache.solr.client.solrj.impl.LBHttpSolrClient.doRequest(LBHttpSolrClient.java:447)
	at org.apache.solr.client.solrj.impl.LBHttpSolrClient.request(LBHttpSolrClient.java:388)
	at org.apache.solr.client.solrj.impl.CloudSolrClient.sendRequest(CloudSolrClient.java:1383)
	at org.apache.solr.client.solrj.impl.CloudSolrClient.requestWithRetryOnStaleState(CloudSolrClient.java:1134)
	at org.apache.solr.client.solrj.impl.CloudSolrClient.request(CloudSolrClient.java:1073)
	at org.apache.solr.client.solrj.SolrRequest.process(SolrRequest.java:160)
	at org.apache.solr.client.solrj.SolrClient.commit(SolrClient.java:484)
	at org.apache.solr.client.solrj.SolrClient.commit(SolrClient.java:463)
	at org.apache.solr.cloud.AbstractFullDistribZkTestBase.commit(AbstractFullDistribZkTestBase.java:1530)
	at org.apache.solr.update.TestInPlaceUpdatesDistrib.docValuesUpdateTest(TestInPlaceUpdatesDistrib.java:361)
	at org.apache.solr.update.TestInPlaceUpdatesDistrib.test(TestInPlaceUpdatesDistrib.java:154)
	at sun.reflect.NativeMethodAccessorImpl.invoke0(Native Method)
	at sun.reflect.NativeMethodAccessorImpl.invoke(NativeMethodAccessorImpl.java:62)
	at sun.reflect.DelegatingMethodAccessorImpl.invoke(DelegatingMethodAccessorImpl.java:43)
	at java.lang.reflect.Method.invoke(Method.java:498)
	at com.carrotsearch.randomizedtesting.RandomizedRunner.invoke(RandomizedRunner.java:1713)
	at com.carrotsearch.randomizedtesting.RandomizedRunner$8.evaluate(RandomizedRunner.java:907)
	at com.carrotsearch.randomizedtesting.RandomizedRunner$9.evaluate(RandomizedRunner.java:943)
	at com.carrotsearch.randomizedtesting.RandomizedRunner$10.evaluate(RandomizedRunner.java:957)
	at org.apache.solr.BaseDistributedSearchTestCase$ShardsRepeatRule$ShardsFixedStatement.callStatement(BaseDistributedSearchTestCase.java:992)
	at org.apache.solr.BaseDistributedSearchTestCase$ShardsRepeatRule$ShardsStatement.evaluate(BaseDistributedSearchTestCase.java:967)
	at com.carrotsearch.randomizedtesting.rules.SystemPropertiesRestoreRule$1.evaluate(SystemPropertiesRestoreRule.java:57)
	at org.apache.lucene.util.TestRuleSetupTeardownChained$1.evaluate(TestRuleSetupTeardownChained.java:49)
	at org.apache.lucene.util.AbstractBeforeAfterRule$1.evaluate(AbstractBeforeAfterRule.java:45)
	at org.apache.lucene.util.TestRuleThreadAndTestName$1.evaluate(TestRuleThreadAndTestName.java:48)
	at org.apache.lucene.util.TestRuleIgnoreAfterMaxFailures$1.evaluate(TestRuleIgnoreAfterMaxFailures.java:64)
	at org.apache.lucene.util.TestRuleMarkFailure$1.evaluate(TestRuleMarkFailure.java:47)
	at com.carrotsearch.randomizedtesting.rules.StatementAdapter.evaluate(StatementAdapter.java:36)
	at com.carrotsearch.randomizedtesting.ThreadLeakControl$StatementRunner.run(ThreadLeakControl.java:368)
	at com.carrotsearch.randomizedtesting.ThreadLeakControl.forkTimeoutingTask(ThreadLeakControl.java:817)
	at com.carrotsearch.randomizedtesting.ThreadLeakControl$3.evaluate(ThreadLeakControl.java:468)
	at com.carrotsearch.randomizedtesting.RandomizedRunner.runSingleTest(RandomizedRunner.java:916)
	at com.carrotsearch.randomizedtesting.RandomizedRunner$5.evaluate(RandomizedRunner.java:802)
	at com.carrotsearch.randomizedtesting.RandomizedRunner$6.evaluate(RandomizedRunner.java:852)
	at com.carrotsearch.randomizedtesting.RandomizedRunner$7.evaluate(RandomizedRunner.java:863)
	at com.carrotsearch.randomizedtesting.rules.StatementAdapter.evaluate(StatementAdapter.java:36)
	at com.carrotsearch.randomizedtesting.rules.SystemPropertiesRestoreRule$1.evaluate(SystemPropertiesRestoreRule.java:57)
	at org.apache.lucene.util.AbstractBeforeAfterRule$1.evaluate(AbstractBeforeAfterRule.java:45)
	at com.carrotsearch.randomizedtesting.rules.StatementAdapter.evaluate(StatementAdapter.java:36)
	at org.apache.lucene.util.TestRuleStoreClassName$1.evaluate(TestRuleStoreClassName.java:41)
	at com.carrotsearch.randomizedtesting.rules.NoShadowingOrOverridesOnMethodsRule$1.evaluate(NoShadowingOrOverridesOnMethodsRule.java:40)
	at com.carrotsearch.randomizedtesting.rules.NoShadowingOrOverridesOnMethodsRule$1.evaluate(NoShadowingOrOverridesOnMethodsRule.java:40)
	at com.carrotsearch.randomizedtesting.rules.StatementAdapter.evaluate(StatementAdapter.java:36)
	at com.carrotsearch.randomizedtesting.rules.StatementAdapter.evaluate(StatementAdapter.java:36)
	at com.carrotsearch.randomizedtesting.rules.StatementAdapter.evaluate(StatementAdapter.java:36)
	at org.apache.lucene.util.TestRuleAssertionsRequired$1.evaluate(TestRuleAssertionsRequired.java:53)
	at org.apache.lucene.util.TestRuleMarkFailure$1.evaluate(TestRuleMarkFailure.java:47)
	at org.apache.lucene.util.TestRuleIgnoreAfterMaxFailures$1.evaluate(TestRuleIgnoreAfterMaxFailures.java:64)
	at org.apache.lucene.util.TestRuleIgnoreTestSuites$1.evaluate(TestRuleIgnoreTestSuites.java:54)
	at com.carrotsearch.randomizedtesting.rules.StatementAdapter.evaluate(StatementAdapter.java:36)
	at com.carrotsearch.randomizedtesting.ThreadLeakControl$StatementRunner.run(ThreadLeakControl.java:368)
	at java.lang.Thread.run(Thread.java:745)
Caused by: java.net.SocketTimeoutException: Read timed out
	at java.net.SocketInputStream.socketRead0(Native Method)
	at java.net.SocketInputStream.socketRead(SocketInputStream.java:116)
	at java.net.SocketInputStream.read(SocketInputStream.java:171)
	at java.net.SocketInputStream.read(SocketInputStream.java:141)
	at org.apache.http.impl.io.AbstractSessionInputBuffer.fillBuffer(AbstractSessionInputBuffer.java:160)
	at org.apache.http.impl.io.SocketInputBuffer.fillBuffer(SocketInputBuffer.java:84)
	at org.apache.http.impl.io.AbstractSessionInputBuffer.readLine(AbstractSessionInputBuffer.java:273)
	at org.apache.http.impl.conn.DefaultHttpResponseParser.parseHead(DefaultHttpResponseParser.java:140)
	at org.apache.http.impl.conn.DefaultHttpResponseParser.parseHead(DefaultHttpResponseParser.java:57)
	at org.apache.http.impl.io.AbstractMessageParser.parse(AbstractMessageParser.java:261)
	at org.apache.http.impl.AbstractHttpClientConnection.receiveResponseHeader(AbstractHttpClientConnection.java:283)
	at org.apache.http.impl.conn.DefaultClientConnection.receiveResponseHeader(DefaultClientConnection.java:251)
	at org.apache.http.impl.conn.ManagedClientConnectionImpl.receiveResponseHeader(ManagedClientConnectionImpl.java:197)
	at org.apache.http.protocol.HttpRequestExecutor.doReceiveResponse(HttpRequestExecutor.java:272)
	at org.apache.http.protocol.HttpRequestExecutor.execute(HttpRequestExecutor.java:124)
	at org.apache.http.impl.client.DefaultRequestDirector.tryExecute(DefaultRequestDirector.java:685)
	at org.apache.http.impl.client.DefaultRequestDirector.execute(DefaultRequestDirector.java:487)
	at org.apache.http.impl.client.AbstractHttpClient.doExecute(AbstractHttpClient.java:882)
	at org.apache.http.impl.client.CloseableHttpClient.execute(CloseableHttpClient.java:82)
	at org.apache.http.impl.client.CloseableHttpClient.execute(CloseableHttpClient.java:55)
	at org.apache.solr.client.solrj.impl.HttpSolrClient.executeMethod(HttpSolrClient.java:515)
	... 54 more




Build Log:
[...truncated 11961 lines...]
   [junit4] Suite: org.apache.solr.cloud.FullSolrCloudDistribCmdsTest
   [junit4]   2> Creating dataDir: /x1/jenkins/jenkins-slave/workspace/Lucene-Solr-NightlyTests-6.x/checkout/solr/build/solr-core/test/J2/temp/solr.cloud.FullSolrCloudDistribCmdsTest_A2FEA6BF206E2B5A-001/init-core-data-001
   [junit4]   2> 291773 WARN  (SUITE-FullSolrCloudDistribCmdsTest-seed#[A2FEA6BF206E2B5A]-worker) [    ] o.a.s.SolrTestCaseJ4 startTrackingSearchers: numOpens=40 numCloses=40
   [junit4]   2> 291773 INFO  (SUITE-FullSolrCloudDistribCmdsTest-seed#[A2FEA6BF206E2B5A]-worker) [    ] o.a.s.SolrTestCaseJ4 Using TrieFields
   [junit4]   2> 291775 INFO  (SUITE-FullSolrCloudDistribCmdsTest-seed#[A2FEA6BF206E2B5A]-worker) [    ] o.a.s.SolrTestCaseJ4 Randomized ssl (false) and clientAuth (false) via: @org.apache.solr.SolrTestCaseJ4$SuppressSSL(bugUrl=https://issues.apache.org/jira/browse/SOLR-5776)
   [junit4]   2> 291775 INFO  (SUITE-FullSolrCloudDistribCmdsTest-seed#[A2FEA6BF206E2B5A]-worker) [    ] o.a.s.BaseDistributedSearchTestCase Setting hostContext system property: /b_/
   [junit4]   2> 291778 INFO  (TEST-FullSolrCloudDistribCmdsTest.test-seed#[A2FEA6BF206E2B5A]) [    ] o.a.s.c.ZkTestServer STARTING ZK TEST SERVER
   [junit4]   2> 291778 INFO  (Thread-856) [    ] o.a.s.c.ZkTestServer client port:0.0.0.0/0.0.0.0:0
   [junit4]   2> 291778 INFO  (Thread-856) [    ] o.a.s.c.ZkTestServer Starting server
   [junit4]   2> 291780 ERROR (Thread-856) [    ] o.a.z.s.ZooKeeperServer ZKShutdownHandler is not registered, so ZooKeeper server won't take any action on ERROR or SHUTDOWN server state changes
   [junit4]   2> 291878 INFO  (TEST-FullSolrCloudDistribCmdsTest.test-seed#[A2FEA6BF206E2B5A]) [    ] o.a.s.c.ZkTestServer start zk server on port:53172
   [junit4]   2> 291893 INFO  (TEST-FullSolrCloudDistribCmdsTest.test-seed#[A2FEA6BF206E2B5A]) [    ] o.a.s.c.AbstractZkTestCase put /x1/jenkins/jenkins-slave/workspace/Lucene-Solr-NightlyTests-6.x/checkout/solr/core/src/test-files/solr/collection1/conf/solrconfig-tlog.xml to /configs/conf1/solrconfig.xml
   [junit4]   2> 291901 INFO  (TEST-FullSolrCloudDistribCmdsTest.test-seed#[A2FEA6BF206E2B5A]) [    ] o.a.s.c.AbstractZkTestCase put /x1/jenkins/jenkins-slave/workspace/Lucene-Solr-NightlyTests-6.x/checkout/solr/core/src/test-files/solr/collection1/conf/schema15.xml to /configs/conf1/schema.xml
   [junit4]   2> 291902 INFO  (TEST-FullSolrCloudDistribCmdsTest.test-seed#[A2FEA6BF206E2B5A]) [    ] o.a.s.c.AbstractZkTestCase put /x1/jenkins/jenkins-slave/workspace/Lucene-Solr-NightlyTests-6.x/checkout/solr/core/src/test-files/solr/collection1/conf/solrconfig.snippet.randomindexconfig.xml to /configs/conf1/solrconfig.snippet.randomindexconfig.xml
   [junit4]   2> 291904 INFO  (TEST-FullSolrCloudDistribCmdsTest.test-seed#[A2FEA6BF206E2B5A]) [    ] o.a.s.c.AbstractZkTestCase put /x1/jenkins/jenkins-slave/workspace/Lucene-Solr-NightlyTests-6.x/checkout/solr/core/src/test-files/solr/collection1/conf/stopwords.txt to /configs/conf1/stopwords.txt
   [junit4]   2> 291906 INFO  (TEST-FullSolrCloudDistribCmdsTest.test-seed#[A2FEA6BF206E2B5A]) [    ] o.a.s.c.AbstractZkTestCase put /x1/jenkins/jenkins-slave/workspace/Lucene-Solr-NightlyTests-6.x/checkout/solr/core/src/test-files/solr/collection1/conf/protwords.txt to /configs/conf1/protwords.txt
   [junit4]   2> 291907 INFO  (TEST-FullSolrCloudDistribCmdsTest.test-seed#[A2FEA6BF206E2B5A]) [    ] o.a.s.c.AbstractZkTestCase put /x1/jenkins/jenkins-slave/workspace/Lucene-Solr-NightlyTests-6.x/checkout/solr/core/src/test-files/solr/collection1/conf/currency.xml to /configs/conf1/currency.xml
   [junit4]   2> 291909 INFO  (TEST-FullSolrCloudDistribCmdsTest.test-seed#[A2FEA6BF206E2B5A]) [    ] o.a.s.c.AbstractZkTestCase put /x1/jenkins/jenkins-slave/workspace/Lucene-Solr-NightlyTests-6.x/checkout/solr/core/src/test-files/solr/collection1/conf/enumsConfig.xml to /configs/conf1/enumsConfig.xml
   [junit4]   2> 291910 INFO  (TEST-FullSolrCloudDistribCmdsTest.test-seed#[A2FEA6BF206E2B5A]) [    ] o.a.s.c.AbstractZkTestCase put /x1/jenkins/jenkins-slave/workspace/Lucene-Solr-NightlyTests-6.x/checkout/solr/core/src/test-files/solr/collection1/conf/open-exchange-rates.json to /configs/conf1/open-exchange-rates.json
   [junit4]   2> 291912 INFO  (TEST-FullSolrCloudDistribCmdsTest.test-seed#[A2FEA6BF206E2B5A]) [    ] o.a.s.c.AbstractZkTestCase put /x1/jenkins/jenkins-slave/workspace/Lucene-Solr-NightlyTests-6.x/checkout/solr/core/src/test-files/solr/collection1/conf/mapping-ISOLatin1Accent.txt to /configs/conf1/mapping-ISOLatin1Accent.txt
   [junit4]   2> 291913 INFO  (TEST-FullSolrCloudDistribCmdsTest.test-seed#[A2FEA6BF206E2B5A]) [    ] o.a.s.c.AbstractZkTestCase put /x1/jenkins/jenkins-slave/workspace/Lucene-Solr-NightlyTests-6.x/checkout/solr/core/src/test-files/solr/collection1/conf/old_synonyms.txt to /configs/conf1/old_synonyms.txt
   [junit4]   2> 291915 INFO  (TEST-FullSolrCloudDistribCmdsTest.test-seed#[A2FEA6BF206E2B5A]) [    ] o.a.s.c.AbstractZkTestCase put /x1/jenkins/jenkins-slave/workspace/Lucene-Solr-NightlyTests-6.x/checkout/solr/core/src/test-files/solr/collection1/conf/synonyms.txt to /configs/conf1/synonyms.txt
   [junit4]   2> 292039 INFO  (TEST-FullSolrCloudDistribCmdsTest.test-seed#[A2FEA6BF206E2B5A]) [    ] o.a.s.SolrTestCaseJ4 Writing core.properties file to /x1/jenkins/jenkins-slave/workspace/Lucene-Solr-NightlyTests-6.x/checkout/solr/build/solr-core/test/J2/temp/solr.cloud.FullSolrCloudDistribCmdsTest_A2FEA6BF206E2B5A-001/control-001/cores/collection1
   [junit4]   2> 292041 INFO  (TEST-FullSolrCloudDistribCmdsTest.test-seed#[A2FEA6BF206E2B5A]) [    ] o.e.j.s.Server jetty-9.3.14.v20161028
   [junit4]   2> 292042 INFO  (TEST-FullSolrCloudDistribCmdsTest.test-seed#[A2FEA6BF206E2B5A]) [    ] o.e.j.s.h.ContextHandler Started o.e.j.s.ServletContextHandler@94311c6{/b_,null,AVAILABLE}
   [junit4]   2> 292043 INFO  (TEST-FullSolrCloudDistribCmdsTest.test-seed#[A2FEA6BF206E2B5A]) [    ] o.e.j.s.AbstractConnector Started ServerConnector@b1796fe{HTTP/1.1,[http/1.1]}{127.0.0.1:51421}
   [junit4]   2> 292043 INFO  (TEST-FullSolrCloudDistribCmdsTest.test-seed#[A2FEA6BF206E2B5A]) [    ] o.e.j.s.Server Started @295135ms
   [junit4]   2> 292044 INFO  (TEST-FullSolrCloudDistribCmdsTest.test-seed#[A2FEA6BF206E2B5A]) [    ] o.a.s.c.s.e.JettySolrRunner Jetty properties: {solr.data.dir=/x1/jenkins/jenkins-slave/workspace/Lucene-Solr-NightlyTests-6.x/checkout/solr/build/solr-core/test/J2/temp/solr.cloud.FullSolrCloudDistribCmdsTest_A2FEA6BF206E2B5A-001/tempDir-001/control/data, hostContext=/b_, hostPort=51421, coreRootDirectory=/x1/jenkins/jenkins-slave/workspace/Lucene-Solr-NightlyTests-6.x/checkout/solr/build/solr-core/test/J2/temp/solr.cloud.FullSolrCloudDistribCmdsTest_A2FEA6BF206E2B5A-001/control-001/cores}
   [junit4]   2> 292044 ERROR (TEST-FullSolrCloudDistribCmdsTest.test-seed#[A2FEA6BF206E2B5A]) [    ] o.a.s.s.StartupLoggingUtils Missing Java Option solr.log.dir. Logging may be missing or incomplete.
   [junit4]   2> 292044 INFO  (TEST-FullSolrCloudDistribCmdsTest.test-seed#[A2FEA6BF206E2B5A]) [    ] o.a.s.s.SolrDispatchFilter  ___      _       Welcome to Apache Solr? version 6.6.0
   [junit4]   2> 292044 INFO  (TEST-FullSolrCloudDistribCmdsTest.test-seed#[A2FEA6BF206E2B5A]) [    ] o.a.s.s.SolrDispatchFilter / __| ___| |_ _   Starting in cloud mode on port null
   [junit4]   2> 292044 INFO  (TEST-FullSolrCloudDistribCmdsTest.test-seed#[A2FEA6BF206E2B5A]) [    ] o.a.s.s.SolrDispatchFilter \__ \/ _ \ | '_|  Install dir: null
   [junit4]   2> 292044 INFO  (TEST-FullSolrCloudDistribCmdsTest.test-seed#[A2FEA6BF206E2B5A]) [    ] o.a.s.s.SolrDispatchFilter |___/\___/_|_|    Start time: 2017-05-11T15:06:43.166Z
   [junit4]   2> 292051 INFO  (TEST-FullSolrCloudDistribCmdsTest.test-seed#[A2FEA6BF206E2B5A]) [    ] o.a.s.s.SolrDispatchFilter Loading solr.xml from SolrHome (not found in ZooKeeper)
   [junit4]   2> 292051 INFO  (TEST-FullSolrCloudDistribCmdsTest.test-seed#[A2FEA6BF206E2B5A]) [    ] o.a.s.c.SolrXmlConfig Loading container configuration from /x1/jenkins/jenkins-slave/workspace/Lucene-Solr-NightlyTests-6.x/checkout/solr/build/solr-core/test/J2/temp/solr.cloud.FullSolrCloudDistribCmdsTest_A2FEA6BF206E2B5A-001/control-001/solr.xml
   [junit4]   2> 292060 INFO  (TEST-FullSolrCloudDistribCmdsTest.test-seed#[A2FEA6BF206E2B5A]) [    ] o.a.s.u.UpdateShardHandler Creating UpdateShardHandler HTTP client with params: socketTimeout=340000&connTimeout=45000&retry=true
   [junit4]   2> 292061 INFO  (TEST-FullSolrCloudDistribCmdsTest.test-seed#[A2FEA6BF206E2B5A]) [    ] o.a.s.c.ZkContainer Zookeeper client=127.0.0.1:53172/solr
   [junit4]   2> 292087 INFO  (TEST-FullSolrCloudDistribCmdsTest.test-seed#[A2FEA6BF206E2B5A]) [n:127.0.0.1:51421_b_    ] o.a.s.c.Overseer Overseer (id=null) closing
   [junit4]   2> 292087 INFO  (TEST-FullSolrCloudDistribCmdsTest.test-seed#[A2FEA6BF206E2B5A]) [n:127.0.0.1:51421_b_    ] o.a.s.c.OverseerElectionContext I am going to be the leader 127.0.0.1:51421_b_
   [junit4]   2> 292088 INFO  (TEST-FullSolrCloudDistribCmdsTest.test-seed#[A2FEA6BF206E2B5A]) [n:127.0.0.1:51421_b_    ] o.a.s.c.Overseer Overseer (id=97944548337319940-127.0.0.1:51421_b_-n_0000000000) starting
   [junit4]   2> 292097 INFO  (TEST-FullSolrCloudDistribCmdsTest.test-seed#[A2FEA6BF206E2B5A]) [n:127.0.0.1:51421_b_    ] o.a.s.c.ZkController Register node as live in ZooKeeper:/live_nodes/127.0.0.1:51421_b_
   [junit4]   2> 292107 INFO  (zkCallback-1072-thread-1-processing-n:127.0.0.1:51421_b_) [n:127.0.0.1:51421_b_    ] o.a.s.c.c.ZkStateReader Updated live nodes from ZooKeeper... (0) -> (1)
   [junit4]   2> 292241 INFO  (TEST-FullSolrCloudDistribCmdsTest.test-seed#[A2FEA6BF206E2B5A]) [n:127.0.0.1:51421_b_    ] o.a.s.c.CorePropertiesLocator Found 1 core definitions underneath /x1/jenkins/jenkins-slave/workspace/Lucene-Solr-NightlyTests-6.x/checkout/solr/build/solr-core/test/J2/temp/solr.cloud.FullSolrCloudDistribCmdsTest_A2FEA6BF206E2B5A-001/control-001/cores
   [junit4]   2> 292242 INFO  (TEST-FullSolrCloudDistribCmdsTest.test-seed#[A2FEA6BF206E2B5A]) [n:127.0.0.1:51421_b_    ] o.a.s.c.CorePropertiesLocator Cores are: [collection1]
   [junit4]   2> 292242 INFO  (coreLoadExecutor-889-thread-1-processing-n:127.0.0.1:51421_b_) [n:127.0.0.1:51421_b_ c:control_collection   x:collection1] o.a.s.c.TransientSolrCoreCacheDefault Allocating transient cache for 4 transient cores
   [junit4]   2> 292253 INFO  (OverseerStateUpdate-97944548337319940-127.0.0.1:51421_b_-n_0000000000) [n:127.0.0.1:51421_b_    ] o.a.s.c.o.ReplicaMutator Assigning new node to shard shard=shard1
   [junit4]   2> 293271 WARN  (coreLoadExecutor-889-thread-1-processing-n:127.0.0.1:51421_b_) [n:127.0.0.1:51421_b_ c:control_collection   x:collection1] o.a.s.c.Config Beginning with Solr 5.5, <mergePolicy> is deprecated, use <mergePolicyFactory> instead.
   [junit4]   2> 293272 INFO  (coreLoadExecutor-889-thread-1-processing-n:127.0.0.1:51421_b_) [n:127.0.0.1:51421_b_ c:control_collection   x:collection1] o.a.s.c.SolrConfig Using Lucene MatchVersion: 6.6.0
   [junit4]   2> 293285 INFO  (coreLoadExecutor-889-thread-1-processing-n:127.0.0.1:51421_b_) [n:127.0.0.1:51421_b_ c:control_collection   x:collection1] o.a.s.s.IndexSchema [collection1] Schema name=test
   [junit4]   2> 293369 INFO  (coreLoadExecutor-889-thread-1-processing-n:127.0.0.1:51421_b_) [n:127.0.0.1:51421_b_ c:control_collection   x:collection1] o.a.s.s.IndexSchema Loaded schema test/1.6 with uniqueid field id
   [junit4]   2> 293388 INFO  (coreLoadExecutor-889-thread-1-processing-n:127.0.0.1:51421_b_) [n:127.0.0.1:51421_b_ c:control_collection   x:collection1] o.a.s.c.CoreContainer Creating SolrCore 'collection1' using configuration from collection control_collection, trusted=true
   [junit4]   2> 293389 INFO  (coreLoadExecutor-889-thread-1-processing-n:127.0.0.1:51421_b_) [n:127.0.0.1:51421_b_ c:control_collection   x:collection1] o.a.s.c.SolrCore solr.RecoveryStrategy.Builder
   [junit4]   2> 293389 INFO  (coreLoadExecutor-889-thread-1-processing-n:127.0.0.1:51421_b_) [n:127.0.0.1:51421_b_ c:control_collection   x:collection1] o.a.s.c.SolrCore [[collection1] ] Opening new SolrCore at [/x1/jenkins/jenkins-slave/workspace/Lucene-Solr-NightlyTests-6.x/checkout/solr/build/solr-core/test/J2/temp/solr.cloud.FullSolrCloudDistribCmdsTest_A2FEA6BF206E2B5A-001/control-001/cores/collection1], dataDir=[/x1/jenkins/jenkins-slave/workspace/Lucene-Solr-NightlyTests-6.x/checkout/solr/build/solr-core/test/J2/temp/solr.cloud.FullSolrCloudDistribCmdsTest_A2FEA6BF206E2B5A-001/control-001/cores/collection1/data/]
   [junit4]   2> 293389 INFO  (coreLoadExecutor-889-thread-1-processing-n:127.0.0.1:51421_b_) [n:127.0.0.1:51421_b_ c:control_collection   x:collection1] o.a.s.c.JmxMonitoredMap JMX monitoring is enabled. Adding Solr mbeans to JMX Server: com.sun.jmx.mbeanserver.JmxMBeanServer@628bb473
   [junit4]   2> 293390 INFO  (coreLoadExecutor-889-thread-1-processing-n:127.0.0.1:51421_b_) [n:127.0.0.1:51421_b_ c:control_collection   x:collection1] o.a.s.u.RandomMergePolicy RandomMergePolicy wrapping class org.apache.lucene.index.TieredMergePolicy: [TieredMergePolicy: maxMergeAtOnce=21, maxMergeAtOnceExplicit=28, maxMergedSegmentMB=83.0029296875, floorSegmentMB=2.0283203125, forceMergeDeletesPctAllowed=2.5927208682817717, segmentsPerTier=13.0, maxCFSSegmentSizeMB=8.796093022207999E12, noCFSRatio=0.5633674816476807
   [junit4]   2> 293398 WARN  (coreLoadExecutor-889-thread-1-processing-n:127.0.0.1:51421_b_) [n:127.0.0.1:51421_b_ c:control_collection   x:collection1] o.a.s.c.RequestHandlers INVALID paramSet a in requestHandler {type = requestHandler,name = /dump,class = DumpRequestHandler,attributes = {initParams=a, name=/dump, class=DumpRequestHandler},args = {defaults={a=A,b=B}}}
   [junit4]   2> 293457 INFO  (coreLoadExecutor-889-thread-1-processing-n:127.0.0.1:51421_b_) [n:127.0.0.1:51421_b_ c:control_collection   x:collection1] o.a.s.u.UpdateHandler Using UpdateLog implementation: org.apache.solr.update.UpdateLog
   [junit4]   2> 293457 INFO  (coreLoadExecutor-889-thread-1-processing-n:127.0.0.1:51421_b_) [n:127.0.0.1:51421_b_ c:control_collection   x:collection1] o.a.s.u.UpdateLog Initializing UpdateLog: dataDir= defaultSyncLevel=FLUSH numRecordsToKeep=100 maxNumLogsToKeep=10 numVersionBuckets=65536
   [junit4]   2> 293458 INFO  (coreLoadExecutor-889-thread-1-processing-n:127.0.0.1:51421_b_) [n:127.0.0.1:51421_b_ c:control_collection   x:collection1] o.a.s.u.CommitTracker Hard AutoCommit: disabled
   [junit4]   2> 293458 INFO  (coreLoadExecutor-889-thread-1-processing-n:127.0.0.1:51421_b_) [n:127.0.0.1:51421_b_ c:control_collection   x:collection1] o.a.s.u.CommitTracker Soft AutoCommit: disabled
   [junit4]   2> 293458 INFO  (coreLoadExecutor-889-thread-1-processing-n:127.0.0.1:51421_b_) [n:127.0.0.1:51421_b_ c:control_collection   x:collection1] o.a.s.u.RandomMergePolicy RandomMergePolicy wrapping class org.apache.lucene.index.LogByteSizeMergePolicy: [LogByteSizeMergePolicy: minMergeSize=1677721, mergeFactor=37, maxMergeSize=2147483648, maxMergeSizeForForcedMerge=9223372036854775807, calibrateSizeByDeletes=false, maxMergeDocs=2147483647, maxCFSSegmentSizeMB=8.796093022207999E12, noCFSRatio=1.0]
   [junit4]   2> 293459 INFO  (coreLoadExecutor-889-thread-1-processing-n:127.0.0.1:51421_b_) [n:127.0.0.1:51421_b_ c:control_collection   x:collection1] o.a.s.s.SolrIndexSearcher Opening [Searcher@2e8e9a35[collection1] main]
   [junit4]   2> 293461 INFO  (coreLoadExecutor-889-thread-1-processing-n:127.0.0.1:51421_b_) [n:127.0.0.1:51421_b_ c:control_collection   x:collection1] o.a.s.r.ManagedResourceStorage Configured ZooKeeperStorageIO with znodeBase: /configs/conf1
   [junit4]   2> 293461 INFO  (coreLoadExecutor-889-thread-1-processing-n:127.0.0.1:51421_b_) [n:127.0.0.1:51421_b_ c:control_collection   x:collection1] o.a.s.r.ManagedResourceStorage Loaded null at path _rest_managed.json using ZooKeeperStorageIO:path=/configs/conf1
   [junit4]   2> 293461 INFO  (coreLoadExecutor-889-thread-1-processing-n:127.0.0.1:51421_b_) [n:127.0.0.1:51421_b_ c:control_collection   x:collection1] o.a.s.h.ReplicationHandler Commits will be reserved for  10000
   [junit4]   2> 293462 INFO  (coreLoadExecutor-889-thread-1-processing-n:127.0.0.1:51421_b_) [n:127.0.0.1:51421_b_ c:control_collection   x:collection1] o.a.s.u.UpdateLog Could not find max version in index or recent updates, using new clock 1567112775161872384
   [junit4]   2> 293466 INFO  (searcherExecutor-890-thread-1-processing-n:127.0.0.1:51421_b_ x:collection1 c:control_collection) [n:127.0.0.1:51421_b_ c:control_collection   x:collection1] o.a.s.c.SolrCore [collection1] Registered new searcher Searcher@2e8e9a35[collection1] main{ExitableDirectoryReader(UninvertingDirectoryReader())}
   [junit4]   2> 293478 INFO  (coreZkRegister-882-thread-1-processing-n:127.0.0.1:51421_b_ x:collection1 c:control_collection) [n:127.0.0.1:51421_b_ c:control_collection s:shard1 r:core_node1 x:collection1] o.a.s.c.ShardLeaderElectionContext Enough replicas found to continue.
   [junit4]   2> 293478 INFO  (coreZkRegister-882-thread-1-processing-n:127.0.0.1:51421_b_ x:collection1 c:control_collection) [n:127.0.0.1:51421_b_ c:control_collection s:shard1 r:core_node1 x:collection1] o.a.s.c.ShardLeaderElectionContext I may be the new leader - try and sync
   [junit4]   2> 293478 INFO  (coreZkRegister-882-thread-1-processing-n:127.0.0.1:51421_b_ x:collection1 c:control_collection) [n:127.0.0.1:51421_b_ c:control_collection s:shard1 r:core_node1 x:collection1] o.a.s.c.SyncStrategy Sync replicas to http://127.0.0.1:51421/b_/collection1/
   [junit4]   2> 293478 INFO  (coreZkRegister-882-thread-1-processing-n:127.0.0.1:51421_b_ x:collection1 c:control_collection) [n:127.0.0.1:51421_b_ c:control_collection s:shard1 r:core_node1 x:collection1] o.a.s.c.SyncStrategy Sync Success - now sync replicas to me
   [junit4]   2> 293478 INFO  (coreZkRegister-882-thread-1-processing-n:127.0.0.1:51421_b_ x:collection1 c:control_collection) [n:127.0.0.1:51421_b_ c:control_collection s:shard1 r:core_node1 x:collection1] o.a.s.c.SyncStrategy http://127.0.0.1:51421/b_/collection1/ has no replicas
   [junit4]   2> 293478 INFO  (coreZkRegister-882-thread-1-processing-n:127.0.0.1:51421_b_ x:collection1 c:control_collection) [n:127.0.0.1:51421_b_ c:control_collection s:shard1 r:core_node1 x:collection1] o.a.s.c.ShardLeaderElectionContext Found all replicas participating in election, clear LIR
   [junit4]   2> 293482 INFO  (coreZkRegister-882-thread-1-processing-n:127.0.0.1:51421_b_ x:collection1 c:control_collection) [n:127.0.0.1:51421_b_ c:control_collection s:shard1 r:core_node1 x:collection1] o.a.s.c.ShardLeaderElectionContext I am the new leader: http://127.0.0.1:51421/b_/collection1/ shard1
   [junit4]   2> 293633 INFO  (coreZkRegister-882-thread-1-processing-n:127.0.0.1:51421_b_ x:collection1 c:control_collection) [n:127.0.0.1:51421_b_ c:control_collection s:shard1 r:core_node1 x:collection1] o.a.s.c.ZkController I am the leader, no recovery necessary
   [junit4]   2> 293754 INFO  (TEST-FullSolrCloudDistribCmdsTest.test-seed#[A2FEA6BF206E2B5A]) [    ] o.a.s.c.c.ZkStateReader Updated live nodes from ZooKeeper... (0) -> (1)
   [junit4]   2> 293755 INFO  (TEST-FullSolrCloudDistribCmdsTest.test-seed#[A2FEA6BF206E2B5A]) [    ] o.a.s.c.s.i.ZkClientClusterStateProvider Cluster at 127.0.0.1:53172/solr ready
   [junit4]   2> 293755 INFO  (TEST-FullSolrCloudDistribCmdsTest.test-seed#[A2FEA6BF206E2B5A]) [    ] o.a.s.c.ChaosMonkey monkey: init - expire sessions:false cause connection loss:false
   [junit4]   2> 293755 INFO  (TEST-FullSolrCloudDistribCmdsTest.test-seed#[A2FEA6BF206E2B5A]) [    ] o.a.s.c.AbstractFullDistribZkTestBase Creating collection1 with stateFormat=2
   [junit4]   2> 293760 WARN  (NIOServerCxn.Factory:0.0.0.0/0.0.0.0:0) [    ] o.a.z.s.NIOServerCnxn caught end of stream exception
   [junit4]   2> EndOfStreamException: Unable to read additional data from client sessionid 0x15bf80c3b550006, likely client has closed socket
   [junit4]   2> 	at org.apache.zookeeper.server.NIOServerCnxn.doIO(NIOServerCnxn.java:239)
   [junit4]   2> 	at org.apache.zookeeper.server.NIOServerCnxnFactory.run(NIOServerCnxnFactory.java:203)
   [junit4]   2> 	at java.lang.Thread.run(Thread.java:745)
   [junit4]   2> 293880 INFO  (TEST-FullSolrCloudDistribCmdsTest.test-seed#[A2FEA6BF206E2B5A]) [    ] o.a.s.SolrTestCaseJ4 Writing core.properties file to /x1/jenkins/jenkins-slave/workspace/Lucene-Solr-NightlyTests-6.x/checkout/solr/build/solr-core/test/J2/temp/solr.cloud.FullSolrCloudDistribCmdsTest_A2FEA6BF206E2B5A-001/shard-1-001/cores/collection1
   [junit4]   2> 293881 INFO  (TEST-FullSolrCloudDistribCmdsTest.test-seed#[A2FEA6BF206E2B5A]) [    ] o.a.s.c.AbstractFullDistribZkTestBase create jetty 1 in directory /x1/jenkins/jenkins-slave/workspace/Lucene-Solr-NightlyTests-6.x/checkout/solr/build/solr-core/test/J2/temp/solr.cloud.FullSolrCloudDistribCmdsTest_A2FEA6BF206E2B5A-001/shard-1-001
   [junit4]   2> 293881 INFO  (TEST-FullSolrCloudDistribCmdsTest.test-seed#[A2FEA6BF206E2B5A]) [    ] o.e.j.s.Server jetty-9.3.14.v20161028
   [junit4]   2> 293883 INFO  (TEST-FullSolrCloudDistribCmdsTest.test-seed#[A2FEA6BF206E2B5A]) [    ] o.e.j.s.h.ContextHandler Started o.e.j.s.ServletContextHandler@76577477{/b_,null,AVAILABLE}
   [junit4]   2> 293884 INFO  (TEST-FullSolrCloudDistribCmdsTest.test-seed#[A2FEA6BF206E2B5A]) [    ] o.e.j.s.AbstractConnector Started ServerConnector@5f1ed243{HTTP/1.1,[http/1.1]}{127.0.0.1:52034}
   [junit4]   2> 293884 INFO  (TEST-FullSolrCloudDistribCmdsTest.test-seed#[A2FEA6BF206E2B5A]) [    ] o.e.j.s.Server Started @296976ms
   [junit4]   2> 293884 INFO  (TEST-FullSolrCloudDistribCmdsTest.test-seed#[A2FEA6BF206E2B5A]) [    ] o.a.s.c.s.e.JettySolrRunner Jetty properties: {solr.data.dir=/x1/jenkins/jenkins-slave/workspace/Lucene-Solr-NightlyTests-6.x/checkout/solr/build/solr-core/test/J2/temp/solr.cloud.FullSolrCloudDistribCmdsTest_A2FEA6BF206E2B5A-001/tempDir-001/jetty1, solrconfig=solrconfig.xml, hostContext=/b_, hostPort=52034, coreRootDirectory=/x1/jenkins/jenkins-slave/workspace/Lucene-Solr-NightlyTests-6.x/checkout/solr/build/solr-core/test/J2/temp/solr.cloud.FullSolrCloudDistribCmdsTest_A2FEA6BF206E2B5A-001/shard-1-001/cores}
   [junit4]   2> 293885 ERROR (TEST-FullSolrCloudDistribCmdsTest.test-seed#[A2FEA6BF206E2B5A]) [    ] o.a.s.s.StartupLoggingUtils Missing Java Option solr.log.dir. Logging may be missing or incomplete.
   [junit4]   2> 293885 INFO  (TEST-FullSolrCloudDistribCmdsTest.test-seed#[A2FEA6BF206E2B5A]) [    ] o.a.s.s.SolrDispatchFilter  ___      _       Welcome to Apache Solr? version 6.6.0
   [junit4]   2> 293885 INFO  (TEST-FullSolrCloudDistribCmdsTest.test-seed#[A2FEA6BF206E2B5A]) [    ] o.a.s.s.SolrDispatchFilter / __| ___| |_ _   Starting in cloud mode on port null
   [junit4]   2> 293885 INFO  (TEST-FullSolrCloudDistribCmdsTest.test-seed#[A2FEA6BF206E2B5A]) [    ] o.a.s.s.SolrDispatchFilter \__ \/ _ \ | '_|  Install dir: null
   [junit4]   2> 293885 INFO  (TEST-FullSolrCloudDistribCmdsTest.test-seed#[A2FEA6BF206E2B5A]) [    ] o.a.s.s.SolrDispatchFilter |___/\___/_|_|    Start time: 2017-05-11T15:06:45.007Z
   [junit4]   2> 293888 INFO  (TEST-FullSolrCloudDistribCmdsTest.test-seed#[A2FEA6BF206E2B5A]) [    ] o.a.s.s.SolrDispatchFilter Loading solr.xml from SolrHome (not found in ZooKeeper)
   [junit4]   2> 293888 INFO  (TEST-FullSolrCloudDistribCmdsTest.test-seed#[A2FEA6BF206E2B5A]) [    ] o.a.s.c.SolrXmlConfig Loading container configuration from /x1/jenkins/jenkins-slave/workspace/Lucene-Solr-NightlyTests-6.x/checkout/solr/build/solr-core/test/J2/temp/solr.cloud.FullSolrCloudDistribCmdsTest_A2FEA6BF206E2B5A-001/shard-1-001/solr.xml
   [junit4]   2> 293896 INFO  (TEST-FullSolrCloudDistribCmdsTest.test-seed#[A2FEA6BF206E2B5A]) [    ] o.a.s.u.UpdateShardHandler Creating UpdateShardHandler HTTP client with params: socketTimeout=340000&connTimeout=45000&retry=true
   [junit4]   2> 293896 INFO  (TEST-FullSolrCloudDistribCmdsTest.test-seed#[A2FEA6BF206E2B5A]) [    ] o.a.s.c.ZkContainer Zookeeper client=127.0.0.1:53172/solr
   [junit4]   2> 293916 INFO  (TEST-FullSolrCloudDistribCmdsTest.test-seed#[A2FEA6BF206E2B5A]) [n:127.0.0.1:52034_b_    ] o.a.s.c.c.ZkStateReader Updated live nodes from ZooKeeper... (0) -> (1)
   [junit4]   2> 293919 INFO  (TEST-FullSolrCloudDistribCmdsTest.test-seed#[A2FEA6BF206E2B5A]) [n:127.0.0.1:52034_b_    ] o.a.s.c.Overseer Overseer (id=null) closing
   [junit4]   2> 293922 INFO  (TEST-FullSolrCloudDistribCmdsTest.test-seed#[A2FEA6BF206E2B5A]) [n:127.0.0.1:52034_b_    ] o.a.s.c.ZkController Register node as live in ZooKeeper:/live_nodes/127.0.0.1:52034_b_
   [junit4]   2> 293923 INFO  (zkCallback-1072-thread-1-processing-n:127.0.0.1:51421_b_) [n:127.0.0.1:51421_b_    ] o.a.s.c.c.ZkStateReader Updated live nodes from ZooKeeper... (1) -> (2)
   [junit4]   2> 293925 INFO  (zkCallback-1076-thread-1) [    ] o.a.s.c.c.ZkStateReader Updated live nodes from ZooKeeper... (1) -> (2)
   [junit4]   2> 293926 INFO  (zkCallback-1082-thread-1-processing-n:127.0.0.1:52034_b_) [n:127.0.0.1:52034_b_    ] o.a.s.c.c.ZkStateReader Updated live nodes from ZooKeeper... (1) -> (2)
   [junit4]   2> 293993 INFO  (TEST-FullSolrCloudDistribCmdsTest.test-seed#[A2FEA6BF206E2B5A]) [n:127.0.0.1:52034_b_    ] o.a.s.c.CorePropertiesLocator Found 1 core definitions underneath /x1/jenkins/jenkins-slave/workspace/Lucene-Solr-NightlyTests-6.x/checkout/solr/build/solr-core/test/J2/temp/solr.cloud.FullSolrCloudDistribCmdsTest_A2FEA6BF206E2B5A-001/shard-1-001/cores
   [junit4]   2> 293994 INFO  (TEST-FullSolrCloudDistribCmdsTest.test-seed#[A2FEA6BF206E2B5A]) [n:127.0.0.1:52034_b_    ] o.a.s.c.CorePropertiesLocator Cores are: [collection1]
   [junit4]   2> 293995 INFO  (coreLoadExecutor-900-thread-1-processing-n:127.0.0.1:52034_b_) [n:127.0.0.1:52034_b_ c:collection1   x:collection1] o.a.s.c.TransientSolrCoreCacheDefault Allocating transient cache for 4 transient cores
   [junit4]   2> 293996 INFO  (OverseerStateUpdate-97944548337319940-127.0.0.1:51421_b_-n_0000000000) [n:127.0.0.1:51421_b_    ] o.a.s.c.o.ReplicaMutator Assigning new node to shard shard=shard2
   [junit4]   2> 294099 INFO  (zkCallback-1082-thread-1-processing-n:127.0.0.1:52034_b_) [n:127.0.0.1:52034_b_    ] o.a.s.c.c.ZkStateReader A cluster state change: [WatchedEvent state:SyncConnected type:NodeDataChanged path:/collections/collection1/state.json] for collection [collection1] has occurred - updating... (live nodes size: [2])
   [junit4]   2> 295016 WARN  (coreLoadExecutor-900-thread-1-processing-n:127.0.0.1:52034_b_) [n:127.0.0.1:52034_b_ c:collection1   x:collection1] o.a.s.c.Config Beginning with Solr 5.5, <mergePolicy> is deprecated, use <mergePolicyFactory> instead.
   [junit4]   2> 295017 INFO  (coreLoadExecutor-900-thread-1-processing-n:127.0.0.1:52034_b_) [n:127.0.0.1:52034_b_ c:collection1   x:collection1] o.a.s.c.SolrConfig Using Lucene MatchVersion: 6.6.0
   [junit4]   2> 295031 INFO  (coreLoadExecutor-900-thread-1-processing-n:127.0.0.1:52034_b_) [n:127.0.0.1:52034_b_ c:collection1   x:collection1] o.a.s.s.IndexSchema [collection1] Schema name=test
   [junit4]   2> 295110 INFO  (coreLoadExecutor-900-thread-1-processing-n:127.0.0.1:52034_b_) [n:127.0.0.1:52034_b_ c:collection1   x:collection1] o.a.s.s.IndexSchema Loaded schema test/1.6 with uniqueid field id
   [junit4]   2> 295128 INFO  (coreLoadExecutor-900-thread-1-processing-n:127.0.0.1:52034_b_) [n:127.0.0.1:52034_b_ c:collection1   x:collection1] o.a.s.c.CoreContainer Creating SolrCore 'collection1' using configuration from collection collection1, trusted=true
   [junit4]   2> 295129 INFO  (coreLoadExecutor-900-thread-1-processing-n:127.0.0.1:52034_b_) [n:127.0.0.1:52034_b_ c:collection1   x:collection1] o.a.s.c.SolrCore solr.RecoveryStrategy.Builder
   [junit4]   2> 295129 INFO  (coreLoadExecutor-900-thread-1-processing-n:127.0.0.1:52034_b_) [n:127.0.0.1:52034_b_ c:collection1   x:collection1] o.a.s.c.SolrCore [[collection1] ] Opening new SolrCore at [/x1/jenkins/jenkins-slave/workspace/Lucene-Solr-NightlyTests-6.x/checkout/solr/build/solr-core/test/J2/temp/solr.cloud.FullSolrCloudDistribCmdsTest_A2FEA6BF206E2B5A-001/shard-1-001/cores/collection1], dataDir=[/x1/jenkins/jenkins-slave/workspace/Lucene-Solr-NightlyTests-6.x/checkout/solr/build/solr-core/test/J2/temp/solr.cloud.FullSolrCloudDistribCmdsTest_A2FEA6BF206E2B5A-001/shard-1-001/cores/collection1/data/]
   [junit4]   2> 295133 INFO  (coreLoadExecutor-900-thread-1-processing-n:127.0.0.1:52034_b_) [n:127.0.0.1:52034_b_ c:collection1   x:collection1] o.a.s.c.JmxMonitoredMap JMX monitoring is enabled. Adding Solr mbeans to JMX Server: com.sun.jmx.mbeanserver.JmxMBeanServer@628bb473
   [junit4]   2> 295134 INFO  (coreLoadExecutor-900-thread-1-processing-n:127.0.0.1:52034_b_) [n:127.0.0.1:52034_b_ c:collection1   x:collection1] o.a.s.u.RandomMergePolicy RandomMergePolicy wrapping class org.apache.lucene.index.TieredMergePolicy: [TieredMergePolicy: maxMergeAtOnce=21, maxMergeAtOnceExplicit=28, maxMergedSegmentMB=83.0029296875, floorSegmentMB=2.0283203125, forceMergeDeletesPctAllowed=2.5927208682817717, segmentsPerTier=13.0, maxCFSSegmentSizeMB=8.796093022207999E12, noCFSRatio=0.5633674816476807
   [junit4]   2> 295145 WARN  (coreLoadExecutor-900-thread-1-processing-n:127.0.0.1:52034_b_) [n:127.0.0.1:52034_b_ c:collection1   x:collection1] o.a.s.c.RequestHandlers INVALID paramSet a in requestHandler {type = requestHandler,name = /dump,class = DumpRequestHandler,attributes = {initParams=a, name=/dump, class=DumpRequestHandler},args = {defaults={a=A,b=B}}}
   [junit4]   2> 295193 INFO  (coreLoadExecutor-900-thread-1-processing-n:127.0.0.1:52034_b_) [n:127.0.0.1:52034_b_ c:collection1   x:collection1] o.a.s.u.UpdateHandler Using UpdateLog implementation: org.apache.solr.update.UpdateLog
   [junit4]   2> 295193 INFO  (coreLoadExecutor-900-thread-1-processing-n:127.0.0.1:52034_b_) [n:127.0.0.1:52034_b_ c:collection1   x:collection1] o.a.s.u.UpdateLog Initializing UpdateLog: dataDir= defaultSyncLevel=FLUSH numRecordsToKeep=100 maxNumLogsToKeep=10 numVersionBuckets=65536
   [junit4]   2> 295194 INFO  (coreLoadExecutor-900-thread-1-processing-n:127.0.0.1:52034_b_) [n:127.0.0.1:52034_b_ c:collection1   x:collection1] o.a.s.u.CommitTracker Hard AutoCommit: disabled
   [junit4]   2> 295194 INFO  (coreLoadExecutor-900-thread-1-processing-n:127.0.0.1:52034_b_) [n:127.0.0.1:52034_b_ c:collection1   x:collection1] o.a.s.u.CommitTracker Soft AutoCommit: disabled
   [junit4]   2> 295195 INFO  (coreLoadExecutor-900-thread-1-processing-n:127.0.0.1:52034_b_) [n:127.0.0.1:52034_b_ c:collection1   x:collection1] o.a.s.u.RandomMergePolicy RandomMergePolicy wrapping class org.apache.lucene.index.LogByteSizeMergePolicy: [LogByteSizeMergePolicy: minMergeSize=1677721, mergeFactor=37, maxMergeSize=2147483648, maxMergeSizeForForcedMerge=9223372036854775807, calibrateSizeByDeletes=false, maxMergeDocs=2147483647, maxCFSSegmentSizeMB=8.796093022207999E12, noCFSRatio=1.0]
   [junit4]   2> 295196 INFO  (coreLoadExecutor-900-thread-1-processing-n:127.0.0.1:52034_b_) [n:127.0.0.1:52034_b_ c:collection1   x:collection1] o.a.s.s.SolrIndexSearcher Opening [Searcher@5055408b[collection1] main]
   [junit4]   2> 295197 INFO  (coreLoadExecutor-900-thread-1-processing-n:127.0.0.1:52034_b_) [n:127.0.0.1:52034_b_ c:collection1   x:collection1] o.a.s.r.ManagedResourceStorage Configured ZooKeeperStorageIO with znodeBase: /configs/conf1
   [junit4]   2> 295198 INFO  (coreLoadExecutor-900-thread-1-processing-n:127.0.0.1:52034_b_) [n:127.0.0.1:52034_b_ c:collection1   x:collection1] o.a.s.r.ManagedResourceStorage Loaded null at path _rest_managed.json using ZooKeeperStorageIO:path=/configs/conf1
   [junit4]   2> 295198 INFO  (coreLoadExecutor-900-thread-1-processing-n:127.0.0.1:52034_b_) [n:127.0.0.1:52034_b_ c:collection1   x:collection1] o.a.s.h.ReplicationHandler Commits will be reserved for  10000
   [junit4]   2> 295199 INFO  (coreLoadExecutor-900-thread-1-processing-n:127.0.0.1:52034_b_) [n:127.0.0.1:52034_b_ c:collection1   x:collection1] o.a.s.u.UpdateLog Could not find max version in index or recent updates, using new clock 1567112776983248896
   [junit4]   2> 295210 INFO  (searcherExecutor-901-thread-1-processing-n:127.0.0.1:52034_b_ x:collection1 c:collection1) [n:127.0.0.1:52034_b_ c:collection1   x:collection1] o.a.s.c.SolrCore [collection1] Registered new searcher Searcher@5055408b[collection1] main{ExitableDirectoryReader(UninvertingDirectoryReader())}
   [junit4]   2> 295216 INFO  (coreZkRegister-895-thread-1-processing-n:127.0.0.1:52034_b_ x:collection1 c:collection1) [n:127.0.0.1:52034_b_ c:collection1 s:shard2 r:core_node1 x:collection1] o.a.s.c.ShardLeaderElectionContext Enough replicas found to continue.
   [junit4]   2> 295216 INFO  (coreZkRegister-895-thread-1-processing-n:127.0.0.1:52034_b_ x:collection1 c:collection1) [n:127.0.0.1:52034_b_ c:collection1 s:shard2 r:core_node1 x:collection1] o.a.s.c.ShardLeaderElectionContext I may be the new leader - try and sync
   [junit4]   2> 295216 INFO  (coreZkRegister-895-thread-1-processing-n:127.0.0.1:52034_b_ x:collection1 c:collection1) [n:127.0.0.1:52034_b_ c:collection1 s:shard2 r:core_node1 x:collection1] o.a.s.c.SyncStrategy Sync replicas to http://127.0.0.1:52034/b_/collection1/
   [junit4]   2> 295216 INFO  (coreZkRegister-895-thread-1-processing-n:127.0.0.1:52034_b_ x:collection1 c:collection1) [n:127.0.0.1:52034_b_ c:collection1 s:shard2 r:core_node1 x:collection1] o.a.s.c.SyncStrategy Sync Success - now sync replicas to me
   [junit4]   2> 295216 INFO  (coreZkRegister-895-thread-1-processing-n:127.0.0.1:52034_b_ x:collection1 c:collection1) [n:127.0.0.1:52034_b_ c:collection1 s:shard2 r:core_node1 x:collection1] o.a.s.c.SyncStrategy http://127.0.0.1:52034/b_/collection1/ has no replicas
   [junit4]   2> 295216 INFO  (coreZkRegister-895-thread-1-processing-n:127.0.0.1:52034_b_ x:collection1 c:collection1) [n:127.0.0.1:52034_b_ c:collection1 s:shard2 r:core_node1 x:collection1] o.a.s.c.ShardLeaderElectionContext Found all replicas participating in election, clear LIR
   [junit4]   2> 295224 INFO  (coreZkRegister-895-thread-1-processing-n:127.0.0.1:52034_b_ x:collection1 c:collection1) [n:127.0.0.1:52034_b_ c:collection1 s:shard2 r:core_node1 x:collection1] o.a.s.c.ShardLeaderElectionContext I am the new leader: http://127.0.0.1:52034/b_/collection1/ shard2
   [junit4]   2> 295325 INFO  (zkCallback-1082-thread-1-processing-n:127.0.0.1:52034_b_) [n:127.0.0.1:52034_b_    ] o.a.s.c.c.ZkStateReader A cluster state change: [WatchedEvent state:SyncConnected type:NodeDataChanged path:/collections/collection1/state.json] for collection [collection1] has occurred - updating... (live nodes size: [2])
   [junit4]   2> 295375 INFO  (coreZkRegister-895-thread-1-processing-n:127.0.0.1:52034_b_ x:collection1 c:collection1) [n:127.0.0.1:52034_b_ c:collection1 s:shard2 r:core_node1 x:collection1] o.a.s.c.ZkController I am the leader, no recovery necessary
   [junit4]   2> 295479 INFO  (zkCallback-1082-thread-1-processing-n:127.0.0.1:52034_b_) [n:127.0.0.1:52034_b_    ] o.a.s.c.c.ZkStateReader A cluster state change: [WatchedEvent state:SyncConnected type:NodeDataChanged path:/collections/collection1/state.json] for collection [collection1] has occurred - updating... (live nodes size: [2])
   [junit4]   2> 295618 INFO  (TEST-FullSolrCloudDistribCmdsTest.test-seed#[A2FEA6BF206E2B5A]) [    ] o.a.s.SolrTestCaseJ4 Writing core.properties file to /x1/jenkins/jenkins-slave/workspace/Lucene-Solr-NightlyTests-6.x/checkout/solr/build/solr-core/test/J2/temp/solr.cloud.FullSolrCloudDistribCmdsTest_A2FEA6BF206E2B5A-001/shard-2-001/cores/collection1
   [junit4]   2> 295619 INFO  (TEST-FullSolrCloudDistribCmdsTest.test-seed#[A2FEA6BF206E2B5A]) [    ] o.a.s.c.AbstractFullDistribZkTestBase create jetty 2 in directory /x1/jenkins/jenkins-slave/workspace/Lucene-Solr-NightlyTests-6.x/checkout/solr/build/solr-core/test/J2/temp/solr.cloud.FullSolrCloudDistribCmdsTest_A2FEA6BF206E2B5A-001/shard-2-001
   [junit4]   2> 295619 INFO  (TEST-FullSolrCloudDistribCmdsTest.test-seed#[A2FEA6BF206E2B5A]) [    ] o.e.j.s.Server jetty-9.3.14.v20161028
   [junit4]   2> 295621 INFO  (TEST-FullSolrCloudDistribCmdsTest.test-seed#[A2FEA6BF206E2B5A]) [    ] o.e.j.s.h.ContextHandler Started o.e.j.s.ServletContextHandler@682333c1{/b_,null,AVAILABLE}
   [junit4]   2> 295622 INFO  (TEST-FullSolrCloudDistribCmdsTest.test-seed#[A2FEA6BF206E2B5A]) [    ] o.e.j.s.AbstractConnector Started ServerConnector@7fc904a9{HTTP/1.1,[http/1.1]}{127.0.0.1:37145}
   [junit4]   2> 295622 INFO  (TEST-FullSolrCloudDistribCmdsTest.test-seed#[A2FEA6BF206E2B5A]) [    ] o.e.j.s.Server Started @298714ms
   [junit4]   2> 295622 INFO  (TEST-FullSolrCloudDistribCmdsTest.test-seed#[A2FEA6BF206E2B5A]) [    ] o.a.s.c.s.e.JettySolrRunner Jetty properties: {solr.data.dir=/x1/jenkins/jenkins-slave/workspace/Lucene-Solr-NightlyTests-6.x/checkout/solr/build/solr-core/test/J2/temp/solr.cloud.FullSolrCloudDistribCmdsTest_A2FEA6BF206E2B5A-001/tempDir-001/jetty2, solrconfig=solrconfig.xml, hostContext=/b_, hostPort=37145, coreRootDirectory=/x1/jenkins/jenkins-slave/workspace/Lucene-Solr-NightlyTests-6.x/checkout/solr/build/solr-core/test/J2/temp/solr.cloud.FullSolrCloudDistribCmdsTest_A2FEA6BF206E2B5A-001/shard-2-001/cores}
   [junit4]   2> 295623 ERROR (TEST-FullSolrCloudDistribCmdsTest.test-seed#[A2FEA6BF206E2B5A]) [    ] o.a.s.s.StartupLoggingUtils Missing Java Option solr.log.dir. Logging may be missing or incomplete.
   [junit4]   2> 295624 INFO  (TEST-FullSolrCloudDistribCmdsTest.test-seed#[A2FEA6BF206E2B5A]) [    ] o.a.s.s.SolrDispatchFilter  ___      _       Welcome to Apache Solr? version 6.6.0
   [junit4]   2> 295624 INFO  (TEST-FullSolrCloudDistribCmdsTest.test-seed#[A2FEA6BF206E2B5A]) [    ] o.a.s.s.SolrDispatchFilter / __| ___| |_ _   Starting in cloud mode on port null
   [junit4]   2> 295624 INFO  (TEST-FullSolrCloudDistribCmdsTest.test-seed#[A2FEA6BF206E2B5A]) [    ] o.a.s.s.SolrDispatchFilter \__ \/ _ \ | '_|  Install dir: null
   [junit4]   2> 295624 INFO  (TEST-FullSolrCloudDistribCmdsTest.test-seed#[A2FEA6BF206E2B5A]) [    ] o.a.s.s.SolrDispatchFilter |___/\___/_|_|    Start time: 2017-05-11T15:06:46.746Z
   [junit4]   2> 295627 INFO  (TEST-FullSolrCloudDistribCmdsTest.test-seed#[A2FEA6BF206E2B5A]) [    ] o.a.s.s.SolrDispatchFilter Loading solr.xml from SolrHome (not found in ZooKeeper)
   [junit4]   2> 295627 INFO  (TEST-FullSolrCloudDistribCmdsTest.test-seed#[A2FEA6BF206E2B5A]) [    ] o.a.s.c.SolrXmlConfig Loading container configuration from /x1/jenkins/jenkins-slave/workspace/Lucene-Solr-NightlyTests-6.x/checkout/solr/build/solr-core/test/J2/temp/solr.cloud.FullSolrCloudDistribCmdsTest_A2FEA6BF206E2B5A-001/shard-2-001/solr.xml
   [junit4]   2> 295634 INFO  (TEST-FullSolrCloudDistribCmdsTest.test-seed#[A2FEA6BF206E2B5A]) [    ] o.a.s.u.UpdateShardHandler Creating UpdateShardHandler HTTP client with params: socketTimeout=340000&connTimeout=45000&retry=true
   [junit4]   2> 295635 INFO  (TEST-FullSolrCloudDistribCmdsTest.test-seed#[A2FEA6BF206E2B5A]) [    ] o.a.s.c.ZkContainer Zookeeper client=127.0.0.1:53172/solr
   [junit4]   2> 295648 INFO  (TEST-FullSolrCloudDistribCmdsTest.test-seed#[A2FEA6BF206E2B5A]) [n:127.0.0.1:37145_b_    ] o.a.s.c.c.ZkStateReader Updated live nodes from ZooKeeper... (0) -> (2)
   [junit4]   2> 295651 INFO  (TEST-FullSolrCloudDistribCmdsTest.test-seed#[A2FEA6BF206E2B5A]) [n:127.0.0.1:37145_b_    ] o.a.s.c.Overseer Overseer (id=null) closing
   [junit4]   2> 295653 INFO  (TEST-FullSolrCloudDistribCmdsTest.test-seed#[A2FEA6BF206E2B5A]) [n:127.0.0.1:37145_b_    ] o.a.s.c.ZkController Register node as live in ZooKeeper:/live_nodes/127.0.0.1:37145_b_
   [junit4]   2> 295655 INFO  (zkCallback-1076-thread-1) [    ] o.a.s.c.c.ZkStateReader Updated live nodes from ZooKeeper... (2) -> (3)
   [junit4]   2> 295655 INFO  (zkCallback-1082-thread-1-processing-n:127.0.0.1:52034_b_) [n:127.0.0.1:52034_b_    ] o.a.s.c.c.ZkStateReader Updated live nodes from ZooKeeper... (2) -> (3)
   [junit4]   2> 295656 INFO  (zkCallback-1072-thread-1-processing-n:127.0.0.1:51421_b_) [n:127.0.0.1:51421_b_    ] o.a.s.c.c.ZkStateReader Updated live nodes from ZooKeeper... (2) -> (3)
   [junit4]   2> 295656 INFO  (zkCallback-1088-thread-1-processing-n:127.0.0.1:37145_b_) [n:127.0.0.1:37145_b_    ] o.a.s.c.c.ZkStateReader Updated live nodes from ZooKeeper... (2) -> (3)
   [junit4]   2> 295756 INFO  (TEST-FullSolrCloudDistribCmdsTest.test-seed#[A2FEA6BF206E2B5A]) [n:127.0.0.1:37145_b_    ] o.a.s.c.CorePropertiesLocator Found 1 core definitions underneath /x1/jenkins/jenkins-slave/workspace/Lucene-Solr-NightlyTests-6.x/checkout/solr/build/solr-core/test/J2/temp/solr.cloud.FullSolrCloudDistribCmdsTest_A2FEA6BF206E2B5A-001/shard-2-001/cores
   [junit4]   2> 295756 INFO  (TEST-FullSolrCloudDistribCmdsTest.test-seed#[A2FEA6BF206E2B5A]) [n:127.0.0.1:37145_b_    ] o.a.s.c.CorePropertiesLocator Cores are: [collection1]
   [junit4]   2> 295757 INFO  (coreLoadExecutor-911-thread-1-processing-n:127.0.0.1:37145_b_) [n:127.0.0.1:37145_b_ c:collection1   x:collection1] o.a.s.c.TransientSolrCoreCacheDefault Allocating transient cache for 4 transient cores
   [junit4]   2> 295758 INFO  (OverseerStateUpdate-97944548337319940-127.0.0.1:51421_b_-n_0000000000) [n:127.0.0.1:51421_b_    ] o.a.s.c.o.ReplicaMutator Assigning new node to shard shard=shard3
   [junit4]   2> 295861 INFO  (zkCallback-1088-thread-1-processing-n:127.0.0.1:37145_b_) [n:127.0.0.1:37145_b_    ] o.a.s.c.c.ZkStateReader A cluster state change: [WatchedEvent state:SyncConnected type:NodeDataChanged path:/collections/collection1/state.json] for collection [collection1] has occurred - updating... (live nodes size: [3])
   [junit4]   2> 295861 INFO  (zkCallback-1082-thread-1-processing-n:127.0.0.1:52034_b_) [n:127.0.0.1:52034_b_    ] o.a.s.c.c.ZkStateReader A cluster state change: [WatchedEvent state:SyncConnected type:NodeDataChanged path:/collections/collection1/state.json] for collection [collection1] has occurred - updating... (live nodes size: [3])
   [junit4]   2> 296775 WARN  (coreLoadExecutor-911-thread-1-processing-n:127.0.0.1:37145_b_) [n:127.0.0.1:37145_b_ c:collection1   x:collection1] o.a.s.c.Config Beginning with Solr 5.5, <mergePolicy> is deprecated, use <mergePolicyFactory> instead.
   [junit4]   2> 296776 INFO  (coreLoadExecutor-911-thread-1-processing-n:127.0.0.1:37145_b_) [n:127.0.0.1:37145_b_ c:collection1   x:collection1] o.a.s.c.SolrConfig Using Lucene MatchVersion: 6.6.0
   [junit4]   2> 296789 INFO  (coreLoadExecutor-911-thread-1-processing-n:127.0.0.1:37145_b_) [n:127.0.0.1:37145_b_ c:collection1   x:collection1] o.a.s.s.IndexSchema [collection1] Schema name=test
   [junit4]   2> 296870 INFO  (coreLoadExecutor-911-thread-1-processing-n:127.0.0.1:37145_b_) [n:127.0.0.1:37145_b_ c:collection1   x:collection1] o.a.s.s.IndexSchema Loaded schema test/1.6 with uniqueid field id
   [junit4]   2> 296888 INFO  (coreLoadExecutor-911-thread-1-processing-n:127.0.0.1:37145_b_) [n:127.0.0.1:37145_b_ c:collection1   x:collection1] o.a.s.c.CoreContainer Creating SolrCore 'collection1' using configuration from collection collection1, trusted=true
   [junit4]   2> 296888 INFO  (coreLoadExecutor-911-thread-1-processing-n:127.0.0.1:37145_b_) [n:127.0.0.1:37145_b_ c:collection1   x:collection1] o.a.s.c.SolrCore solr.RecoveryStrategy.Builder
   [junit4]   2> 296888 INFO  (coreLoadExecutor-911-thread-1-processing-n:127.0.0.1:37145_b_) [n:127.0.0.1:37145_b_ c:collection1   x:collection1] o.a.s.c.SolrCore [[collection1] ] Opening new SolrCore at [/x1/jenkins/jenkins-slave/workspace/Lucene-Solr-NightlyTests-6.x/checkout/solr/build/solr-core/test/J2/temp/solr.cloud.FullSolrCloudDistribCmdsTest_A2FEA6BF206E2B5A-001/shard-2-001/cores/collection1], dataDir=[/x1/jenkins/jenkins-slave/workspace/Lucene-Solr-NightlyTests-6.x/checkout/solr/build/solr-core/test/J2/temp/solr.cloud.FullSolrCloudDistribCmdsTest_A2FEA6BF206E2B5A-001/shard-2-001/cores/collection1/data/]
   [junit4]   2> 296889 INFO  (coreLoadExecutor-911-thread-1-processing-n:127.0.0.1:37145_b_) [n:127.0.0.1:37145_b_ c:collection1   x:collection1] o.a.s.c.JmxMonitoredMap JMX monitoring is enabled. Adding Solr mbeans to JMX Server: com.sun.jmx.mbeanserver.JmxMBeanServer@628bb473
   [junit4]   2> 296890 INFO  (coreLoadExecutor-911-thread-1-processing-n:127.0.0.1:37145_b_) [n:127.0.0.1:37145_b_ c:collection1   x:collection1] o.a.s.u.RandomMergePolicy RandomMergePolicy wrapping class org.apache.lucene.index.TieredMergePolicy: [TieredMergePolicy: maxMergeAtOnce=21, maxMergeAtOnceExplicit=28, maxMergedSegmentMB=83.0029296875, floorSegmentMB=2.0283203125, forceMergeDeletesPctAllowed=2.5927208682817717, segmentsPerTier=13.0, maxCFSSegmentSizeMB=8.796093022207999E12, noCFSRatio=0.5633674816476807
   [junit4]   2> 296897 WARN  (coreLoadExecutor-911-thread-1-processing-n:127.0.0.1:37145_b_) [n:127.0.0.1:37145_b_ c:collection1   x:collection1] o.a.s.c.RequestHandlers INVALID paramSet a in requestHandler {type = requestHandler,name = /dump,class = DumpRequestHandler,attributes = {initParams=a, name=/dump, class=DumpRequestHandler},args = {defaults={a=A,b=B}}}
   [junit4]   2> 296943 INFO  (coreLoadExecutor-911-thread-1-processing-n:127.0.0.1:37145_b_) [n:127.0.0.1:37145_b_ c:collection1   x:collection1] o.a.s.u.UpdateHandler Using UpdateLog implementation: org.apache.solr.update.UpdateLog
   [junit4]   2> 296943 INFO  (coreLoadExecutor-911-thread-1-processing-n:127.0.0.1:37145_b_) [n:127.0.0.1:37145_b_ c:collection1   x:collection1] o.a.s.u.UpdateLog Initializing UpdateLog: dataDir= defaultSyncLevel=FLUSH numRecordsToKeep=100 maxNumLogsToKeep=10 numVersionBuckets=65536
   [junit4]   2> 296944 INFO  (coreLoadExecutor-911-thread-1-processing-n:127.0.0.1:37145_b_) [n:127.0.0.1:37145_b_ c:collection1   x:collection1] o.a.s.u.CommitTracker Hard AutoCommit: disabled
   [junit4]   2> 296944 INFO  (coreLoadExecutor-911-thread-1-processing-n:127.0.0.1:37145_b_) [n:127.0.0.1:37145_b_ c:collection1   x:collection1] o.a.s.u.CommitTracker Soft AutoCommit: disabled
   [junit4]   2> 296945 INFO  (coreLoadExecutor-911-thread-1-processing-n:127.0.0.1:37145_b_) [n:127.0.0.1:37145_b_ c:collection1   x:collection1] o.a.s.u.RandomMergePolicy RandomMergePolicy wrapping class org.apache.lucene.index.LogByteSizeMergePolicy: [LogByteSizeMergePolicy: minMergeSize=1677721, mergeFactor=37, maxMergeSize=2147483648, maxMergeSizeForForcedMerge=9223372036854775807, calibrateSizeByDeletes=false, maxMergeDocs=2147483647, maxCFSSegmentSizeMB=8.796093022207999E12, noCFSRatio=1.0]
   [junit4]   2> 296946 INFO  (coreLoadExecutor-911-thread-1-processing-n:127.0.0.1:37145_b_) [n:127.0.0.1:37145_b_ c:collection1   x:collection1] o.a.s.s.SolrIndexSearcher Opening [Searcher@440b1b81[collection1] main]
   [junit4]   2> 296947 INFO  (coreLoadExecutor-911-thread-1-processing-n:127.0.0.1:37145_b_) [n:127.0.0.1:37145_b_ c:collection1   x:collection1] o.a.s.r.ManagedResourceStorage Configured ZooKeeperStorageIO with znodeBase: /configs/conf1
   [junit4]   2> 296947 INFO  (coreLoadExecutor-911-thread-1-processing-n:127.0.0.1:37145_b_) [n:127.0.0.1:37145_b_ c:collection1   x:collection1] o.a.s.r.ManagedResourceStorage Loaded null at path _rest_managed.json using ZooKeeperStorageIO:path=/configs/conf1
   [junit4]   2> 296947 INFO  (coreLoadExecutor-911-thread-1-processing-n:127.0.0.1:37145_b_) [n:127.0.0.1:37145_b_ c:collection1   x:collection1] o.a.s.h.ReplicationHandler Commits will be reserved for  10000
   [junit4]   2> 296949 INFO  (searcherExecutor-912-thread-1-processing-n:127.0.0.1:37145_b_ x:collection1 c:collection1) [n:127.0.0.1:37145_b_ c:collection1   x:collection1] o.a.s.c.SolrCore [collection1] Registered new searcher Searcher@440b1b81[collection1] main{ExitableDirectoryReader(UninvertingDirectoryReader())}
   [junit4]   2> 296949 INFO  (coreLoadExecutor-911-thread-1-processing-n:127.0.0.1:37145_b_) [n:127.0.0.1:37145_b_ c:collection1   x:collection1] o.a.s.u.UpdateLog Could not find max version in index or recent updates, using new clock 1567112778818256896
   [junit4]   2> 296956 INFO  (coreZkRegister-906-thread-1-processing-n:127.0.0.1:37145_b_ x:collection1 c:collection1) [n:127.0.0.1:37145_b_ c:collection1 s:shard3 r:core_node2 x:collection1] o.a.s.c.ShardLeaderElectionContext Enough replicas found to continue.
   [junit4]   2> 296956 INFO  (coreZkRegister-906-thread-1-processing-n:127.0.0.1:37145_b_ x:collection1 c:collection1) [n:127.0.0.1:37145_b_ c:collection1 s:shard3 r:core_node2 x:collection1] o.a.s.c.ShardLeaderElectionContext I may be the new leader - try and sync
   [junit4]   2> 296956 INFO  (coreZkRegister-906-thread-1-processing-n:127.0.0.1:37145_b_ x:collection1 c:collection1) [n:127.0.0.1:37145_b_ c:collection1 s:shard3 r:core_node2 x:collection1] o.a.s.c.SyncStrategy Sync replicas to http://127.0.0.1:37145/b_/collection1/
   [junit4]   2> 296956 INFO  (coreZkRegister-906-thread-1-processing-n:127.0.0.1:37145_b_ x:collection1 c:collection1) [n:127.0.0.1:37145_b_ c:collection1 s:shard3 r:core_node2 x:collection1] o.a.s.c.SyncStrategy Sync Success - now sync replicas to me
   [junit4]   2> 296956 INFO  (coreZkRegister-906-thread-1-processing-n:127.0.0.1:37145_b_ x:collection1 c:collection1) [n:127.0.0.1:37145_b_ c:collection1 s:shard3 r:core_node2 x:collection1] o.a.s.c.SyncStrategy http://127.0.0.1:37145/b_/collection1/ has no replicas
   [junit4]   2> 296956 INFO  (coreZkRegister-906-thread-1-processing-n:127.0.0.1:37145_b_ x:collection1 c:collection1) [n:127.0.0.1:37145_b_ c:collection1 s:shard3 r:core_node2 x:collection1] o.a.s.c.ShardLeaderElectionContext Found all replicas participating in election, clear LIR
   [junit4]   2> 296961 INFO  (coreZkRegister-906-thread-1-processing-n:127.0.0.1:37145_b_ x:collection1 c:collection1) [n:127.0.0.1:37145_b_ c:collection1 s:shard3 r:core_node2 x:collection1] o.a.s.c.ShardLeaderElectionContext I am the new leader: http://127.0.0.1:37145/b_/collection1/ shard3
   [junit4]   2> 297063 INFO  (zkCallback-1082-thread-1-processing-n:127.0.0.1:52034_b_) [n:127.0.0.1:52034_b_    ] o.a.s.c.c.ZkStateReader A cluster state change: [WatchedEvent state:SyncConnected type:NodeDataChanged path:/collections/collection1/state.json] for collection [collection1] has occurred - updating... (live nodes size: [3])
   [junit4]   2> 297063 INFO  (zkCallback-1088-thread-1-processing-n:127.0.0.1:37145_b_) [n:127.0.0.1:37145_b_    ] o.a.s.c.c.ZkStateReader A cluster state change: [WatchedEvent state:SyncConnected type:NodeDataChanged path:/collections/collection1/state.json] for collection [collection1] has occurred - updating... (live nodes size: [3])
   [junit4]   2> 297112 INFO  (coreZkRegister-906-thread-1-processing-n:127.0.0.1:37145_b_ x:collection1 c:collection1) [n:127.0.0.1:37145_b_ c:collection1 s:shard3 r:core_node2 x:collection1] o.a.s.c.ZkController I am the leader, no recovery necessary
   [junit4]   2> 297216 INFO  (zkCallback-1082-thread-1-processing-n:127.0.0.1:52034_b_) [n:127.0.0.1:52034_b_    ] o.a.s.c.c.ZkStateReader A cluster state change: [WatchedEvent state:SyncConnected type:NodeDataChanged path:/collections/collection1/state.json] for collection [collection1] has occurred - updating... (live nodes size: [3])
   [junit4]   2> 297216 INFO  (zkCallback-1088-thread-1-processing-n:127.0.0.1:37145_b_) [n:127.0.0.1:37145_b_    ] o.a.s.c.c.ZkStateReader A cluster state change: [WatchedEvent state:SyncConnected type:NodeDataChanged path:/collections/collection1/state.json] for collection [collection1] has occurred - updating... (live nodes size: [3])
   [junit4]   2> 297384 INFO  (TEST-FullSolrCloudDistribCmdsTest.test-seed#[A2FEA6BF206E2B5A]) [    ] o.a.s.SolrTestCaseJ4 Writing core.properties file to /x1/jenkins/jenkins-slave/workspace/Lucene-Solr-NightlyTests-6.x/checkout/solr/build/solr-core/test/J2/temp/solr.cloud.FullSolrCloudDistribCmdsTest_A2FEA6BF206E2B5A-001/shard-3-001/cores/collection1
   [junit4]   2> 297385 INFO  (TEST-FullSolrCloudDistribCmdsTest.test-seed#[A2FEA6BF206E2B5A]) [    ] o.a.s.c.AbstractFullDistribZkTestBase create jetty 3 in directory /x1/jenkins/jenkins-slave/workspace/Lucene-Solr-NightlyTests-6.x/checkout/solr/build/solr-core/test/J2/temp/solr.cloud.FullSolrCloudDistribCmdsTest_A2FEA6BF206E2B5A-001/shard-3-001
   [junit4]   2> 297386 INFO  (TEST-FullSolrCloudDistribCmdsTest.test-seed#[A2FEA6BF206E2B5A]) [    ] o.e.j.s.Server jetty-9.3.14.v20161028
   [junit4]   2> 297388 INFO  (TEST-FullSolrCloudDistribCmdsTest.test-seed#[A2FEA6BF206E2B5A]) [    ] o.e.j.s.h.ContextHandler Started o.e.j.s.ServletContextHandler@b23ff0a{/b_,null,AVAILABLE}
   [junit4]   2> 297388 INFO  (TEST-FullSolrCloudDistribCmdsTest.test-seed#[A2FEA6BF206E2B5A]) [    ] o.e.j.s.AbstractConnector Started ServerConnector@3bc98a78{HTTP/1.1,[http/1.1]}{127.0.0.1:51951}
   [junit4]   2> 297388 INFO  (TEST-FullSolrCloudDistribCmdsTest.test-seed#[A2FEA6BF206E2B5A]) [    ] o.e.j.s.Server Started @300480ms
   [junit4]   2> 297388 INFO  (TEST-FullSolrCloudDistribCmdsTest.test-seed#[A2FEA6BF206E2B5A]) [    ] o.a.s.c.s.e.JettySolrRunner Jetty properties: {solr.data.dir=/x1/jenkins/jenkins-slave/workspace/Lucene-Solr-NightlyTests-6.x/checkout/solr/build/solr-core/test/J2/temp/solr.cloud.FullSolrCloudDistribCmdsTest_A2FEA6BF206E2B5A-001/tempDir-001/jetty3, solrconfig=solrconfig.xml, hostContext=/b_, hostPort=51951, coreRootDirectory=/x1/jenkins/jenkins-slave/workspace/Lucene-Solr-NightlyTests-6.x/checkout/solr/build/solr-core/test/J2/../../../../../../../../../../../x1/jenkins/jenkins-slave/workspace/Lucene-Solr-NightlyTests-6.x/checkout/solr/build/solr-core/test/J2/temp/solr.cloud.FullSolrCloudDistribCmdsTest_A2FEA6BF206E2B5A-001/shard-3-001/cores}
   [junit4]   2> 297389 ERROR (TEST-FullSolrCloudDistribCmdsTest.test-seed#[A2FEA6BF206E2B5A]) [    ] o.a.s.s.StartupLoggingUtils Missing Java Option solr.log.dir. Logging may be missing or incomplete.
   [junit4]   2> 297389 INFO  (TEST-FullSolrCloudDistribCmdsTest.test-seed#[A2FEA6BF206E2B5A]) [    ] o.a.s.s.SolrDispatchFilter  ___      _       Welcome to Apache Solr? version 6.6.0
   [junit4]   2> 297390 INFO  (TEST-FullSolrCloudDistribCmdsTest.test-seed#[A2FEA6BF206E2B5A]) [    ] o.a.s.s.SolrDispatchFilter / __| ___| |_ _   Starting in cloud mode on port null
   [junit4]   2> 297390 INFO  (TEST-FullSolrCloudDistribCmdsTest.test-seed#[A2FEA6BF206E2B5A]) [    ] o.a.s.s.SolrDispatchFilter \__ \/ _ \ | '_|  Install dir: null
   [junit4]   2> 297390 INFO  (TEST-FullSolrCloudDistribCmdsTest.test-seed#[A2FEA6BF206E2B5A]) [    ] o.a.s.s.SolrDispatchFilter |___/\___/_|_|    Start time: 2017-05-11T15:06:48.512Z
   [junit4]   2> 297394 INFO  (TEST-FullSolrCloudDistribCmdsTest.test-seed#[A2FEA6BF206E2B5A]) [    ] o.a.s.s.SolrDispatchFilter Loading solr.xml from SolrHome (not found in ZooKeeper)
   [junit4]   2> 297401 INFO  (TEST-FullSolrCloudDistribCmdsTest.test-seed#[A2FEA6BF206E2B5A]) [    ] o.a.s.c.SolrXmlConfig Loading container configuration from /x1/jenkins/jenkins-slave/workspace/Lucene-Solr-NightlyTests-6.x/checkout/solr/build/solr-core/test/J2/temp/solr.cloud.FullSolrCloudDistribCmdsTest_A2FEA6BF206E2B5A-001/shard-3-001/solr.xml
   [junit4]   2> 297408 INFO  (TEST-FullSolrCloudDistribCmdsTest.test-seed#[A2FEA6BF206E2B5A]) [    ] o.a.s.u.UpdateShardHandler Creating UpdateShardHandler HTTP client with params: socketTimeout=340000&connTimeout=45000&retry=true
   [junit4]   2> 297409 INFO  (TEST-FullSolrCloudDistribCmdsTest.test-seed#[A2FEA6BF206E2B5A]) [    ] o.a.s.c.ZkContainer Zookeeper client=127.0.0.1:53172/solr
   [junit4]   2> 297421 INFO  (TEST-FullSolrCloudDistribCmdsTest.test-seed#[A2FEA6BF206E2B5A]) [n:127.0.0.1:51951_b_    ] o.a.s.c.c.ZkStateReader Updated live nodes from ZooKeeper... (0) -> (3)
   [junit4]   2> 297424 INFO  (TEST-FullSolrCloudDistribCmdsTest.test-seed#[A2FEA6BF206E2B5A]) [n:127.0.0.1:51951_b_    ] o.a.s.c.Overseer Overseer (id=null) closing
   [junit4]   2> 297427 INFO  (TEST-FullSolrCloudDistribCmdsTest.test-seed#[A2FEA6BF206E2B5A]) [n:127.0.0.1:51951_b_    ] o.a.s.c.ZkController Register node as live in ZooKeeper:/live_nodes/127.0.0.1:51951_b_
   [junit4]   2> 297429 INFO  (zkCallback-1076-thread-1) [    ] o.a.s.c.c.ZkStateReader Updated live nodes from ZooKeeper... (3) -> (4)
   [junit4]   2> 297429 INFO  (zkCallback-1072-thread-1-processing-n:127.0.0.1:51421_b_) [n:127.0.0.1:51421_b_    ] o.a.s.c.c.ZkStateReader Updated live nodes from ZooKeeper... (3) -> (4)
   [junit4]   2> 297430 INFO  (zkCallback-1082-thread-1-processing-n:127.0.0.1:52034_b_) [n:127.0.0.1:52034_b_    ] o.a.s.c.c.ZkStateReader Updated live nodes from ZooKeeper... (3) -> (4)
   [junit4]   2> 297430 INFO  (zkCallback-1088-thread-1-processing-n:127.0.0.1:37145_b_) [n:127.0.0.1:37145_b_    ] o.a.s.c.c.ZkStateReader Updated live nodes from ZooKeeper... (3) -> (4)
   [junit4]   2> 297431 INFO  (zkCallback-1094-thread-1-processing-n:127.0.0.1:51951_b_) [n:127.0.0.1:51951_b_    ] o.a.s.c.c.ZkStateReader Updated live nodes from ZooKeeper... (3) -> (4)
   [junit4]   2> 297580 INFO  (TEST-FullSolrCloudDistribCmdsTest.test-s

[...truncated too long message...]

sageParser.parse(AbstractMessageParser.java:261)
   [junit4]    > 	at org.apache.http.impl.AbstractHttpClientConnection.receiveResponseHeader(AbstractHttpClientConnection.java:283)
   [junit4]    > 	at org.apache.http.impl.conn.DefaultClientConnection.receiveResponseHeader(DefaultClientConnection.java:251)
   [junit4]    > 	at org.apache.http.impl.conn.ManagedClientConnectionImpl.receiveResponseHeader(ManagedClientConnectionImpl.java:197)
   [junit4]    > 	at org.apache.http.protocol.HttpRequestExecutor.doReceiveResponse(HttpRequestExecutor.java:272)
   [junit4]    > 	at org.apache.http.protocol.HttpRequestExecutor.execute(HttpRequestExecutor.java:124)
   [junit4]    > 	at org.apache.http.impl.client.DefaultRequestDirector.tryExecute(DefaultRequestDirector.java:685)
   [junit4]    > 	at org.apache.http.impl.client.DefaultRequestDirector.execute(DefaultRequestDirector.java:487)
   [junit4]    > 	at org.apache.http.impl.client.AbstractHttpClient.doExecute(AbstractHttpClient.java:882)
   [junit4]    > 	at org.apache.http.impl.client.CloseableHttpClient.execute(CloseableHttpClient.java:82)
   [junit4]    > 	at org.apache.http.impl.client.CloseableHttpClient.execute(CloseableHttpClient.java:55)
   [junit4]    > 	at org.apache.solr.client.solrj.impl.HttpSolrClient.executeMethod(HttpSolrClient.java:515)
   [junit4]    > 	... 54 more
   [junit4]   2> 4737739 INFO  (SUITE-TestInPlaceUpdatesDistrib-seed#[A2FEA6BF206E2B5A]-worker) [    ] o.a.s.SolrTestCaseJ4 ###deleteCore
   [junit4]   2> 4737739 INFO  (SUITE-TestInPlaceUpdatesDistrib-seed#[A2FEA6BF206E2B5A]-worker) [    ] o.a.s.c.CoreContainer Shutting down CoreContainer instance=1248537383
   [junit4]   2> 4737739 INFO  (SUITE-TestInPlaceUpdatesDistrib-seed#[A2FEA6BF206E2B5A]-worker) [    ] o.a.s.m.SolrMetricManager Closing metric reporters for: solr.node
   [junit4]   2> 4737740 INFO  (SUITE-TestInPlaceUpdatesDistrib-seed#[A2FEA6BF206E2B5A]-worker) [    ] o.a.s.m.SolrMetricManager Closing metric reporters for: solr.jvm
   [junit4]   2> 4737742 INFO  (SUITE-TestInPlaceUpdatesDistrib-seed#[A2FEA6BF206E2B5A]-worker) [    ] o.a.s.m.SolrMetricManager Closing metric reporters for: solr.jetty
   [junit4]   2> 4737743 INFO  (coreCloseExecutor-10790-thread-1) [    x:collection1] o.a.s.c.SolrCore [collection1]  CLOSING SolrCore org.apache.solr.core.SolrCore@7678df19
   [junit4]   2> 4737759 INFO  (coreCloseExecutor-10790-thread-1) [    x:collection1] o.a.s.m.SolrMetricManager Closing metric reporters for: solr.core.collection1
   [junit4]   2> NOTE: leaving temporary files on disk at: /x1/jenkins/jenkins-slave/workspace/Lucene-Solr-NightlyTests-6.x/checkout/solr/build/solr-core/test/J1/temp/solr.update.TestInPlaceUpdatesDistrib_A2FEA6BF206E2B5A-001
   [junit4]   2> May 11, 2017 4:20:48 PM com.carrotsearch.randomizedtesting.ThreadLeakControl checkThreadLeaks
   [junit4]   2> WARNING: Will linger awaiting termination of 1 leaked thread(s).
   [junit4]   2> NOTE: test params are: codec=Asserting(Lucene62): {title_s=FSTOrd50, id=PostingsFormat(name=Asserting), id_field_copy_that_does_not_support_in_place_update_s=FSTOrd50}, docValues:{inplace_updatable_float=DocValuesFormat(name=Direct), id_i=DocValuesFormat(name=Lucene54), _version_=DocValuesFormat(name=Direct), id=DocValuesFormat(name=Asserting), inplace_updatable_int_with_default=DocValuesFormat(name=Direct), inplace_updatable_float_with_default=DocValuesFormat(name=Lucene54)}, maxPointsInLeafNode=381, maxMBSortInHeap=5.484827748650903, sim=RandomSimilarity(queryNorm=true,coord=yes): {}, locale=mt-MT, timezone=Asia/Kamchatka
   [junit4]   2> NOTE: Linux 3.13.0-88-generic amd64/Oracle Corporation 1.8.0_121 (64-bit)/cpus=4,threads=1,free=168511552,total=523239424
   [junit4]   2> NOTE: All tests run in this JVM: [TestSolrCloudWithDelegationTokens, WordBreakSolrSpellCheckerTest, TestDistributedStatsComponentCardinality, TestSystemIdResolver, DistanceFunctionTest, TestFuzzyAnalyzedSuggestions, TestHashPartitioner, SchemaVersionSpecificBehaviorTest, TestSQLHandlerNonCloud, SimplePostToolTest, ChaosMonkeySafeLeaderTest, CoreSorterTest, SolrCmdDistributorTest, CdcrBootstrapTest, TestTrie, SpatialRPTFieldTypeTest, TestXmlQParser, DocumentBuilderTest, CleanupOldIndexTest, DateMathParserTest, JsonValidatorTest, ForceLeaderTest, TestCollectionAPIs, TestHalfAndHalfDocValues, SpellCheckComponentTest, TestSearcherReuse, TestBulkSchemaAPI, URLClassifyProcessorTest, TestSubQueryTransformer, TestDeleteCollectionOnDownNodes, TestSystemCollAutoCreate, TestExactSharedStatsCache, TestElisionMultitermQuery, HLLUtilTest, HdfsWriteToMultipleCollectionsTest, TestStandardQParsers, SimpleMLTQParserTest, TestLockTree, SolrMetricsIntegrationTest, CopyFieldTest, TestSchemalessBufferedUpdates, TestRequestForwarding, CdcrRequestHandlerTest, TestQueryTypes, TermVectorComponentTest, TestConfigSetsAPIExclusivity, TestStressCloudBlindAtomicUpdates, DeleteInactiveReplicaTest, SearchHandlerTest, TestSurroundQueryParser, TestFieldResource, MultiTermTest, TestSha256AuthenticationProvider, SegmentsInfoRequestHandlerTest, ClassificationUpdateProcessorTest, OverseerTaskQueueTest, TestFieldCacheSanityChecker, TestManagedSynonymFilterFactory, ConnectionManagerTest, TermsComponentTest, DistributedIntervalFacetingTest, DistributedMLTComponentTest, TestQueryUtils, TestWordDelimiterFilterFactory, DistributedDebugComponentTest, RAMDirectoryFactoryTest, TestCSVResponseWriter, BufferStoreTest, TestExclusionRuleCollectionAccess, SharedFSAutoReplicaFailoverUtilsTest, TestStressVersions, TestLeaderElectionZkExpiry, HdfsDirectoryFactoryTest, HdfsBasicDistributedZkTest, TestBM25SimilarityFactory, TestHashQParserPlugin, TestBlendedInfixSuggestions, TestDynamicLoading, FileUtilsTest, TestSimpleTrackingShardHandler, SolrIndexSplitterTest, TestMiniSolrCloudClusterSSL, TestCloudNestedDocsSort, TestSchemaNameResource, SaslZkACLProviderTest, TolerantUpdateProcessorTest, RestartWhileUpdatingTest, CSVRequestHandlerTest, SuggesterFSTTest, TestLMDirichletSimilarityFactory, TriLevelCompositeIdRoutingTest, TestJavabinTupleStreamParser, SampleTest, TestDocTermOrds, TestScoreJoinQPScore, ExplicitHLLTest, TestQuerySenderListener, InfixSuggestersTest, TestManagedResource, TestCloudPivotFacet, UpdateRequestProcessorFactoryTest, TestDynamicFieldCollectionResource, TestQueryWrapperFilter, IndexSchemaRuntimeFieldTest, ZkSolrClientTest, CollectionStateFormat2Test, DataDrivenBlockJoinTest, TestCoreContainer, DirectSolrSpellCheckerTest, SliceStateTest, TestUnifiedSolrHighlighter, CollectionsAPISolrJTest, SystemInfoHandlerTest, TestRTGBase, TestSolrIndexConfig, TestSolrCloudWithHadoopAuthPlugin, RuleEngineTest, TestSolr4Spatial, StatsComponentTest, TestGroupingSearch, QueryElevationComponentTest, PeerSyncTest, BadIndexSchemaTest, ConvertedLegacyTest, TestFiltering, BasicFunctionalityTest, TestLazyCores, HighlighterTest, SoftAutoCommitTest, SuggesterTSTTest, SpatialFilterTest, SolrCoreCheckLockOnStartupTest, TestUpdate, TestAtomicUpdateErrorCases, SortByFunctionTest, TestSolrDeletionPolicy1, XsltUpdateRequestHandlerTest, IndexBasedSpellCheckerTest, TestReversedWildcardFilterFactory, TestOmitPositions, RequestHandlersTest, FieldAnalysisRequestHandlerTest, FastVectorHighlighterTest, RegexBoostProcessorTest, TestJmxIntegration, MBeansHandlerTest, JsonLoaderTest, TestBinaryResponseWriter, HighlighterConfigTest, SOLR749Test, UpdateParamsTest, AlternateDirectoryTest, SolrIndexConfigTest, BadComponentTest, TestMergePolicyConfig, TestSearchPerf, ExternalFileFieldSortTest, NotRequiredUniqueKeyTest, SpellPossibilityIteratorTest, TestCharFilters, TestXIncludeConfig, EchoParamsTest, TestLMJelinekMercerSimilarityFactory, TestJmxMonitoredMap, TestSuggestSpellingConverter, ClusterStateTest, TestLRUCache, TestCursorMarkWithoutUniqueKey, ConnectionReuseTest, CollectionReloadTest, CollectionsAPIAsyncDistributedZkTest, DistributedQueueTest, DocValuesNotIndexedTest, LeaderFailoverAfterPartitionTest, LeaderInitiatedRecoveryOnShardRestartTest, MigrateRouteKeyTest, OverseerRolesTest, RollingRestartTest, TestMiniSolrCloudCluster, TestRebalanceLeaders, TestShortCircuitedRequests, TestSizeLimitedDistributedMap, TestTolerantUpdateProcessorCloud, TlogReplayBufferedWhileIndexingTest, HdfsUnloadDistributedZkTest, StressHdfsTest, ConfigureRecoveryStrategyTest, DirectoryFactoryTest, TestBackupRepositoryFactory, TestConfigOverlay, TestConfigSets, TestCorePropertiesReload, TestImplicitCoreProperties, TestInfoStreamLogging, TestInitParams, TestNRTOpen, TestShardHandlerFactory, TestSolrConfigHandler, TestSolrCoreSnapshots, TestConfigReload, V2ApiIntegrationTest, CoreAdminRequestStatusTest, CoreMergeIndexesAdminHandlerTest, MetricsHandlerTest, PropertiesRequestHandlerTest, SecurityConfHandlerTest, StatsReloadRaceTest, DistributedExpandComponentTest, DistributedFacetExistsSmallTest, DistributedFacetPivotLargeTest, DistributedQueryComponentCustomSortTest, TestExpandComponent, TestPivotHelperCode, TestTrackingShardHandlerFactory, SolrCoreMetricManagerTest, SolrGraphiteReporterTest, SolrJmxReporterTest, SmileWriterTest, SubstringBytesRefFilterTest, TestMacroExpander, JSONWriterTest, SmileWriterTest, TestBinaryResponseWriter, TestExportWriter, TestGeoJSONResponseWriter, TestGraphMLResponseWriter, TestSolrQueryResponse, TestSubQueryTransformerCrossCore, TestSubQueryTransformerDistrib, PreAnalyzedFieldManagedSchemaCloudTest, TestCollationFieldDocValues, TestManagedSchema, TestPointFields, TestReRankQParserPlugin, TestReloadDeadlock, TestMinMaxOnMultiValuedField, TestOrdValues, TestSortByMinMaxFunction, BlockJoinFacetRandomTest, BlockJoinFacetSimpleTest, GraphQueryTest, TestScoreJoinQPNoScore, TestDFISimilarityFactory, TestNonDefinedSimilarityFactory, TestPerFieldSimilarityWithDefaultOverride, TestDefaultStatsCache, TestLRUStatsCache, BasicAuthStandaloneTest, TestAuthorizationFramework, TestFieldCacheWithThreads, TestInPlaceUpdatesDistrib]
   [junit4] Completed [711/711 (3!)] on J1 in 653.38s, 1 test, 1 error <<< FAILURES!

[...truncated 43414 lines...]