You are viewing a plain text version of this content. The canonical link for it is here.
Posted to dev@brooklyn.apache.org by Apache Jenkins Server <je...@builds.apache.org> on 2018/04/09 23:14:27 UTC
Build failed in Jenkins: brooklyn-master-build-docker #343
See <https://builds.apache.org/job/brooklyn-master-build-docker/343/display/redirect>
------------------------------------------
[...truncated 8.17 MB...]
2018-04-09 23:13:45,990 INFO - TESTNG PASSED CONFIGURATION: "Surefire test" - @BeforeMethod org.apache.brooklyn.rest.resources.UsageResourceTest.setUp() finished in 0 ms
2018-04-09 23:13:45,990 INFO - TESTNG INVOKING: "Surefire test" - org.apache.brooklyn.rest.resources.UsageResourceTest.testGetMachineUsagesForNonExistantMachine()
2018-04-09 23:13:45,996 INFO - TESTNG PASSED: "Surefire test" - org.apache.brooklyn.rest.resources.UsageResourceTest.testGetMachineUsagesForNonExistantMachine() finished in 6 ms
2018-04-09 23:13:45,996 INFO - TESTNG INVOKING CONFIGURATION: "Surefire test" - @AfterMethod org.apache.brooklyn.rest.testing.BrooklynRestApiTest.tearDownMethod()
2018-04-09 23:13:45,996 INFO - TESTNG PASSED CONFIGURATION: "Surefire test" - @AfterMethod org.apache.brooklyn.rest.testing.BrooklynRestApiTest.tearDownMethod() finished in 0 ms
2018-04-09 23:13:45,997 INFO - TESTNG INVOKING CONFIGURATION: "Surefire test" - @BeforeMethod org.apache.brooklyn.rest.testing.BrooklynRestApiTest.setUpMethod()
2018-04-09 23:13:45,997 INFO - TESTNG PASSED CONFIGURATION: "Surefire test" - @BeforeMethod org.apache.brooklyn.rest.testing.BrooklynRestApiTest.setUpMethod() finished in 0 ms
2018-04-09 23:13:45,997 INFO - TESTNG INVOKING CONFIGURATION: "Surefire test" - @BeforeMethod org.apache.brooklyn.rest.resources.UsageResourceTest.setUp()
2018-04-09 23:13:45,997 INFO - TESTNG PASSED CONFIGURATION: "Surefire test" - @BeforeMethod org.apache.brooklyn.rest.resources.UsageResourceTest.setUp() finished in 0 ms
2018-04-09 23:13:45,997 INFO - TESTNG INVOKING: "Surefire test" - org.apache.brooklyn.rest.resources.UsageResourceTest.testGetMachineUsagesInitiallyEmpty()
2018-04-09 23:13:46,009 INFO - TESTNG PASSED: "Surefire test" - org.apache.brooklyn.rest.resources.UsageResourceTest.testGetMachineUsagesInitiallyEmpty() finished in 12 ms
2018-04-09 23:13:46,009 INFO - TESTNG INVOKING CONFIGURATION: "Surefire test" - @AfterMethod org.apache.brooklyn.rest.testing.BrooklynRestApiTest.tearDownMethod()
2018-04-09 23:13:46,009 INFO - TESTNG PASSED CONFIGURATION: "Surefire test" - @AfterMethod org.apache.brooklyn.rest.testing.BrooklynRestApiTest.tearDownMethod() finished in 0 ms
2018-04-09 23:13:46,009 INFO - TESTNG INVOKING CONFIGURATION: "Surefire test" - @BeforeMethod org.apache.brooklyn.rest.testing.BrooklynRestApiTest.setUpMethod()
2018-04-09 23:13:46,009 INFO - TESTNG PASSED CONFIGURATION: "Surefire test" - @BeforeMethod org.apache.brooklyn.rest.testing.BrooklynRestApiTest.setUpMethod() finished in 0 ms
2018-04-09 23:13:46,010 INFO - TESTNG INVOKING CONFIGURATION: "Surefire test" - @BeforeMethod org.apache.brooklyn.rest.resources.UsageResourceTest.setUp()
2018-04-09 23:13:46,010 INFO - TESTNG PASSED CONFIGURATION: "Surefire test" - @BeforeMethod org.apache.brooklyn.rest.resources.UsageResourceTest.setUp() finished in 1 ms
2018-04-09 23:13:46,010 INFO - TESTNG INVOKING: "Surefire test" - org.apache.brooklyn.rest.resources.UsageResourceTest.testListAndGetMachineUsage()
2018-04-09 23:13:46,041 INFO - Starting MyServiceImpl{id=wor1m7awmm} on machine SshMachineLocation[LocalhostMachine:ehqy:null@/172.17.0.2:22(id=ehqy72cuhx)]
2018-04-09 23:13:46,229 INFO - TESTNG PASSED: "Surefire test" - org.apache.brooklyn.rest.resources.UsageResourceTest.testListAndGetMachineUsage() finished in 219 ms
2018-04-09 23:13:46,230 INFO - TESTNG INVOKING CONFIGURATION: "Surefire test" - @AfterMethod org.apache.brooklyn.rest.testing.BrooklynRestApiTest.tearDownMethod()
2018-04-09 23:13:46,230 INFO - TESTNG PASSED CONFIGURATION: "Surefire test" - @AfterMethod org.apache.brooklyn.rest.testing.BrooklynRestApiTest.tearDownMethod() finished in 1 ms
2018-04-09 23:13:46,230 INFO - TESTNG INVOKING CONFIGURATION: "Surefire test" - @BeforeMethod org.apache.brooklyn.rest.testing.BrooklynRestApiTest.setUpMethod()
2018-04-09 23:13:46,230 INFO - TESTNG PASSED CONFIGURATION: "Surefire test" - @BeforeMethod org.apache.brooklyn.rest.testing.BrooklynRestApiTest.setUpMethod() finished in 0 ms
2018-04-09 23:13:46,230 INFO - TESTNG INVOKING CONFIGURATION: "Surefire test" - @BeforeMethod org.apache.brooklyn.rest.resources.UsageResourceTest.setUp()
2018-04-09 23:13:46,230 INFO - TESTNG PASSED CONFIGURATION: "Surefire test" - @BeforeMethod org.apache.brooklyn.rest.resources.UsageResourceTest.setUp() finished in 0 ms
2018-04-09 23:13:46,230 INFO - TESTNG INVOKING: "Surefire test" - org.apache.brooklyn.rest.resources.UsageResourceTest.testListApplicationUsages()
2018-04-09 23:13:46,239 INFO - Entity type 'org.apache.brooklyn.rest.testing.mocks.RestMockSimpleEntity' not defined in catalog but is on classpath; continuing
2018-04-09 23:13:46,241 WARN - Using deprecated functionality (as of 0.9.0), ApplicationSpec style (pre CAMP plans). Transition to actively supported spec plans.
2018-04-09 23:13:46,242 INFO - REST creating instance for entity org.apache.brooklyn.rest.testing.mocks.RestMockSimpleEntity
2018-04-09 23:13:46,242 INFO - Catalog does not contain item for type org.apache.brooklyn.rest.testing.mocks.RestMockSimpleEntity; loaded class directly instead
2018-04-09 23:13:46,242 INFO - REST placing 'simple-app' under management
2018-04-09 23:13:46,270 INFO - Starting RestMockSimpleEntity{id=e9loxqih0o} on machine SshMachineLocation[localhost:null@/172.17.0.2:22(id=xmxujjvko8)]
2018-04-09 23:13:46,405 INFO UhgXDsCN-[xmqjwyk5ea] Started application BasicApplicationImpl{id=xmqjwyk5ea}
2018-04-09 23:13:46,497 INFO - TESTNG PASSED: "Surefire test" - org.apache.brooklyn.rest.resources.UsageResourceTest.testListApplicationUsages() finished in 267 ms
2018-04-09 23:13:46,498 INFO - TESTNG INVOKING CONFIGURATION: "Surefire test" - @AfterMethod org.apache.brooklyn.rest.testing.BrooklynRestApiTest.tearDownMethod()
2018-04-09 23:13:46,498 INFO - TESTNG PASSED CONFIGURATION: "Surefire test" - @AfterMethod org.apache.brooklyn.rest.testing.BrooklynRestApiTest.tearDownMethod() finished in 0 ms
2018-04-09 23:13:46,498 INFO - TESTNG INVOKING CONFIGURATION: "Surefire test" - @BeforeMethod org.apache.brooklyn.rest.testing.BrooklynRestApiTest.setUpMethod()
2018-04-09 23:13:46,499 INFO - TESTNG PASSED CONFIGURATION: "Surefire test" - @BeforeMethod org.apache.brooklyn.rest.testing.BrooklynRestApiTest.setUpMethod() finished in 1 ms
2018-04-09 23:13:46,499 INFO - TESTNG INVOKING CONFIGURATION: "Surefire test" - @BeforeMethod org.apache.brooklyn.rest.resources.UsageResourceTest.setUp()
2018-04-09 23:13:46,499 INFO - TESTNG PASSED CONFIGURATION: "Surefire test" - @BeforeMethod org.apache.brooklyn.rest.resources.UsageResourceTest.setUp() finished in 0 ms
2018-04-09 23:13:46,499 INFO - TESTNG INVOKING: "Surefire test" - org.apache.brooklyn.rest.resources.UsageResourceTest.testListMachinesUsageForApp()
2018-04-09 23:13:46,517 INFO - Starting MyServiceImpl{id=ivjnn9nr8n} on machine SshMachineLocation[LocalhostMachine:gyt0:null@/172.17.0.2:22(id=gyt0hx1liy)]
2018-04-09 23:13:46,656 INFO gfUTwHWh-[ein41x2ofk,ivjnn9nr8n] Stopping MyServiceImpl{id=ivjnn9nr8n} in [SshMachineLocation[LocalhostMachine:gyt0:null@a5afb0f3d271/172.17.0.2:22(id=gyt0hx1liy)]]
2018-04-09 23:13:46,682 INFO - TESTNG PASSED: "Surefire test" - org.apache.brooklyn.rest.resources.UsageResourceTest.testListMachinesUsageForApp() finished in 183 ms
2018-04-09 23:13:46,682 INFO - TESTNG INVOKING CONFIGURATION: "Surefire test" - @AfterMethod org.apache.brooklyn.rest.testing.BrooklynRestApiTest.tearDownMethod()
2018-04-09 23:13:46,683 INFO - TESTNG PASSED CONFIGURATION: "Surefire test" - @AfterMethod org.apache.brooklyn.rest.testing.BrooklynRestApiTest.tearDownMethod() finished in 0 ms
2018-04-09 23:13:46,683 INFO - TESTNG INVOKING CONFIGURATION: "Surefire test" - @AfterClass org.apache.brooklyn.rest.testing.BrooklynRestApiTest.tearDownClass()
2018-04-09 23:13:46,687 INFO Q7Vs30iV-[ku4p9i6fkn,wor1m7awmm] Stopping MyServiceImpl{id=wor1m7awmm} in [SshMachineLocation[LocalhostMachine:ehqy:null@a5afb0f3d271/172.17.0.2:22(id=ehqy72cuhx)]]
2018-04-09 23:13:46,696 INFO - TESTNG PASSED CONFIGURATION: "Surefire test" - @AfterClass org.apache.brooklyn.rest.testing.BrooklynRestApiTest.tearDownClass() finished in 13 ms
2018-04-09 23:13:46,699 INFO - TESTNG
===============================================
Surefire test
Tests run: 242, Failures: 1, Skips: 0
===============================================
[GC (Allocation Failure) 249237K->65228K(748032K), 0.0157531 secs]
Tests run: 242, Failures: 1, Errors: 0, Skipped: 0, Time elapsed: 38.275 sec <<< FAILURE! - in TestSuite
testInvokeEffectorWithTimeoutTimesOut(org.apache.brooklyn.rest.resources.EffectorResourceTest) Time elapsed: 0.03 sec <<< FAILURE!
java.lang.AssertionError:
responseMap={id=fyFpoIur, displayName=sleepEffector, description=Invoking effector sleepEffector on TestEntity:rcnx with parameters {duration=5m}, entityId=rcnxov4bvr, entityDisplayName=TestEntity:rcnx, tags=[EFFECTOR, {wrappingType=targetEntity, entity={type=org.apache.brooklyn.api.entity.Entity, id=rcnxov4bvr}}, {entityId=rcnxov4bvr, effectorName=sleepEffector}, {wrappingType=contextEntity, entity={type=org.apache.brooklyn.api.entity.Entity, id=rcnxov4bvr}}, {type=org.apache.brooklyn.api.mgmt.ManagementContext}], submitTimeUtc=1.523315610384E12, startTimeUtc=1.523315610384E12, endTimeUtc=null, currentStatus=In progress, result=null, isError=false, isCancelled=false, children=[], submittedByTask=null, detailedStatus=Task[sleepEffector]@fyFpoIur
In progress (RUNNABLE)
At: com.google.common.collect.RegularImmutableBiMap.get(RegularImmutableBiMap.java:189)
org.apache.brooklyn.util.javalang.coerce.TypeCoercerExtensible.tryCoerceInternal(TypeCoercerExtensible.java:171)
org.apache.brooklyn.util.javalang.coerce.TypeCoercerExtensible.tryCoerce(TypeCoercerExtensible.java:112)
org.apache.brooklyn.util.javalang.coerce.TypeCoercerExtensible.coerce(TypeCoercerExtensible.java:102)
org.apache.brooklyn.util.javalang.coerce.TypeCoercerExtensible.coerce(TypeCoercerExtensible.java:98)
org.apache.brooklyn.util.core.flags.TypeCoercions.coerce(TypeCoercions.java:81)
org.apache.brooklyn.core.mgmt.internal.EffectorUtils.prepareArgsForEffectorFromMap(EffectorUtils.java:167)
org.apache.brooklyn.core.mgmt.internal.EffectorUtils.prepareArgsForEffector(EffectorUtils.java:75)
org.apache.brooklyn.core.mgmt.internal.AbstractManagementContext.invokeEffectorMethodLocal(AbstractManagementContext.java:324)
org.apache.brooklyn.core.mgmt.internal.AbstractManagementContext.invokeEffectorMethodSync(AbstractManagementContext.java:366)
org.apache.brooklyn.core.mgmt.internal.EffectorUtils.invokeMethodEffector(EffectorUtils.java:274)
org.apache.brooklyn.core.effector.MethodEffector.call(MethodEffector.java:153)
org.apache.brooklyn.core.effector.AbstractEffector.call(AbstractEffector.java:61)
org.apache.brooklyn.core.effector.AbstractEffector$1$1.call(AbstractEffector.java:79)
org.apache.brooklyn.util.core.task.DynamicSequentialTask$DstJob.call(DynamicSequentialTask.java:364)
org.apache.brooklyn.util.core.task.BasicExecutionManager$SubmissionCallable.call(BasicExecutionManager.java:565), streams={}, links={self=/activities/fyFpoIur, children=/activities/fyFpoIur/children, entity=/applications/sjd1km0s5k/entities/rcnxov4bvr}} expected [true] but found [false]
at org.apache.brooklyn.rest.resources.EffectorResourceTest.testInvokeEffectorWithTimeoutTimesOut(EffectorResourceTest.java:135)
Results :
Failed tests:
EffectorResourceTest.testInvokeEffectorWithTimeoutTimesOut:135 responseMap={id=fyFpoIur, displayName=sleepEffector, description=Invoking effector sleepEffector on TestEntity:rcnx with parameters {duration=5m}, entityId=rcnxov4bvr, entityDisplayName=TestEntity:rcnx, tags=[EFFECTOR, {wrappingType=targetEntity, entity={type=org.apache.brooklyn.api.entity.Entity, id=rcnxov4bvr}}, {entityId=rcnxov4bvr, effectorName=sleepEffector}, {wrappingType=contextEntity, entity={type=org.apache.brooklyn.api.entity.Entity, id=rcnxov4bvr}}, {type=org.apache.brooklyn.api.mgmt.ManagementContext}], submitTimeUtc=1.523315610384E12, startTimeUtc=1.523315610384E12, endTimeUtc=null, currentStatus=In progress, result=null, isError=false, isCancelled=false, children=[], submittedByTask=null, detailedStatus=Task[sleepEffector]@fyFpoIur
In progress (RUNNABLE)
At: com.google.common.collect.RegularImmutableBiMap.get(RegularImmutableBiMap.java:189)
org.apache.brooklyn.util.javalang.coerce.TypeCoercerExtensible.tryCoerceInternal(TypeCoercerExtensible.java:171)
org.apache.brooklyn.util.javalang.coerce.TypeCoercerExtensible.tryCoerce(TypeCoercerExtensible.java:112)
org.apache.brooklyn.util.javalang.coerce.TypeCoercerExtensible.coerce(TypeCoercerExtensible.java:102)
org.apache.brooklyn.util.javalang.coerce.TypeCoercerExtensible.coerce(TypeCoercerExtensible.java:98)
org.apache.brooklyn.util.core.flags.TypeCoercions.coerce(TypeCoercions.java:81)
org.apache.brooklyn.core.mgmt.internal.EffectorUtils.prepareArgsForEffectorFromMap(EffectorUtils.java:167)
org.apache.brooklyn.core.mgmt.internal.EffectorUtils.prepareArgsForEffector(EffectorUtils.java:75)
org.apache.brooklyn.core.mgmt.internal.AbstractManagementContext.invokeEffectorMethodLocal(AbstractManagementContext.java:324)
org.apache.brooklyn.core.mgmt.internal.AbstractManagementContext.invokeEffectorMethodSync(AbstractManagementContext.java:366)
org.apache.brooklyn.core.mgmt.internal.EffectorUtils.invokeMethodEffector(EffectorUtils.java:274)
org.apache.brooklyn.core.effector.MethodEffector.call(MethodEffector.java:153)
org.apache.brooklyn.core.effector.AbstractEffector.call(AbstractEffector.java:61)
org.apache.brooklyn.core.effector.AbstractEffector$1$1.call(AbstractEffector.java:79)
org.apache.brooklyn.util.core.task.DynamicSequentialTask$DstJob.call(DynamicSequentialTask.java:364)
org.apache.brooklyn.util.core.task.BasicExecutionManager$SubmissionCallable.call(BasicExecutionManager.java:565), streams={}, links={self=/activities/fyFpoIur, children=/activities/fyFpoIur/children, entity=/applications/sjd1km0s5k/entities/rcnxov4bvr}} expected [true] but found [false]
Tests run: 242, Failures: 1, Errors: 0, Skipped: 0
[INFO] ------------------------------------------------------------------------
[INFO] Reactor Summary:
[INFO]
[INFO] Brooklyn REST JavaScript Web GUI ................... SUCCESS [ 32.723 s]
[INFO] Brooklyn Server Root ............................... SUCCESS [ 0.132 s]
[INFO] Brooklyn Parent Project ............................ SUCCESS [ 2.790 s]
[INFO] Brooklyn Test Support Utilities .................... SUCCESS [ 3.543 s]
[INFO] Brooklyn Logback Includable Configuration .......... SUCCESS [ 0.350 s]
[INFO] Brooklyn Common Utilities .......................... SUCCESS [ 20.719 s]
[INFO] Brooklyn API ....................................... SUCCESS [ 1.515 s]
[INFO] CAMP Server Parent Project ......................... SUCCESS [ 0.402 s]
[INFO] CAMP Base .......................................... SUCCESS [ 2.434 s]
[INFO] Brooklyn Test Support .............................. SUCCESS [ 0.958 s]
[INFO] Brooklyn REST Swagger Apidoc Utilities ............. SUCCESS [ 1.134 s]
[INFO] Brooklyn Logback Configuration ..................... SUCCESS [ 0.227 s]
[INFO] CAMP Server ........................................ SUCCESS [ 4.953 s]
[INFO] Brooklyn Felix Runtime ............................. SUCCESS [ 2.722 s]
[INFO] Brooklyn Groovy Utilities .......................... SUCCESS [ 2.051 s]
[INFO] Brooklyn Core ...................................... SUCCESS [02:56 min]
[INFO] Brooklyn Policies .................................. SUCCESS [ 27.514 s]
[INFO] Brooklyn WinRM Software Entities ................... SUCCESS [ 8.558 s]
[INFO] Brooklyn Secure JMXMP Agent ........................ SUCCESS [ 8.821 s]
[INFO] Brooklyn JMX RMI Agent ............................. SUCCESS [ 0.452 s]
[INFO] Brooklyn Jclouds Location Targets .................. SUCCESS [ 34.855 s]
[INFO] Brooklyn Software Base ............................. SUCCESS [01:06 min]
[INFO] Brooklyn CAMP ...................................... SUCCESS [02:06 min]
[INFO] Brooklyn Launcher Common ........................... SUCCESS [ 4.229 s]
[INFO] Brooklyn REST API .................................. SUCCESS [ 7.670 s]
[INFO] Brooklyn REST Resources ............................ FAILURE [ 44.314 s]
[INFO] Brooklyn REST Server ............................... SKIPPED
[INFO] Brooklyn Launcher .................................. SKIPPED
[INFO] Brooklyn Container Location Targets ................ SKIPPED
[INFO] Brooklyn Command Line Interface .................... SKIPPED
[INFO] Brooklyn Test Framework ............................ SKIPPED
[INFO] Brooklyn OSGi init ................................. SKIPPED
[INFO] Brooklyn OSGi start ................................ SKIPPED
[INFO] Brooklyn Karaf ..................................... SKIPPED
[INFO] Jetty config fragment .............................. SKIPPED
[INFO] Apache Http Component extension .................... SKIPPED
[INFO] Brooklyn Karaf Features ............................ SKIPPED
[INFO] Brooklyn Karaf Shell Commands ...................... SKIPPED
[INFO] Brooklyn Library Root .............................. SKIPPED
[INFO] Brooklyn CM Chef ................................... SKIPPED
[INFO] Brooklyn CM SaltStack .............................. SKIPPED
[INFO] Brooklyn CM Ansible ................................ SKIPPED
[INFO] Brooklyn CM Integration Root ....................... SKIPPED
[INFO] Brooklyn Network Software Entities ................. SKIPPED
[INFO] Brooklyn OSGi Software Entities .................... SKIPPED
[INFO] Brooklyn Database Software Entities ................ SKIPPED
[INFO] Brooklyn Web App Software Entities ................. SKIPPED
[INFO] Brooklyn Messaging Software Entities ............... SKIPPED
[INFO] Brooklyn NoSQL Data Store Software Entities ........ SKIPPED
[INFO] Brooklyn Monitoring Software Entities .............. SKIPPED
[INFO] Brooklyn Web App Software Entities ................. SKIPPED
[INFO] Brooklyn QA ........................................ SKIPPED
[INFO] Brooklyn Examples Aggregator Project ............... SKIPPED
[INFO] Brooklyn Examples Aggregator Project - Webapps ..... SKIPPED
[INFO] hello-world-webapp Maven Webapp .................... SKIPPED
[INFO] hello-world-sql-webapp Maven Webapp ................ SKIPPED
[INFO] Brooklyn Simple Web Cluster Example ................ SKIPPED
[INFO] Brooklyn Library Karaf integration ................. SKIPPED
[INFO] Brooklyn Library Catalog ........................... SKIPPED
[INFO] Brooklyn Library Karaf Features .................... SKIPPED
[INFO] Brooklyn Client .................................... SKIPPED
[INFO] Brooklyn Client Command Line Interface ............. SKIPPED
[INFO] Brooklyn REST java Client .......................... SKIPPED
[INFO] Brooklyn Downstream Project Parent ................. SKIPPED
[INFO] Brooklyn Dist Root ................................. SKIPPED
[INFO] Brooklyn All Things ................................ SKIPPED
[INFO] Brooklyn Distribution .............................. SKIPPED
[INFO] Brooklyn Karaf Distribution Parent ................. SKIPPED
[INFO] Brooklyn Karaf Server Configuration ................ SKIPPED
[INFO] Brooklyn Dist Karaf Features ....................... SKIPPED
[INFO] Brooklyn Karaf Distribution ........................ SKIPPED
[INFO] Brooklyn Karaf pax-exam itest ...................... SKIPPED
[INFO] Brooklyn Vagrant Getting Started Environment ....... SKIPPED
[INFO] Brooklyn Quick-Start Project Archetype ............. SKIPPED
[INFO] Brooklyn Shared Package Files ...................... SKIPPED
[INFO] Brooklyn RPM Package ............................... SKIPPED
[INFO] Brooklyn DEB Package ............................... SKIPPED
[INFO] Brooklyn Root ...................................... SKIPPED
[INFO] ------------------------------------------------------------------------
[INFO] BUILD FAILURE
[INFO] ------------------------------------------------------------------------
[INFO] Total time: 09:59 min
[INFO] Finished at: 2018-04-09T23:13:47Z
[INFO] Final Memory: 142M/837M
[INFO] ------------------------------------------------------------------------
[ERROR] Failed to execute goal org.apache.maven.plugins:maven-surefire-plugin:2.19.1:test (default-test) on project brooklyn-rest-resources: There are test failures.
[ERROR]
[ERROR] Please refer to /usr/build/brooklyn-server/rest/rest-resources/target/surefire-reports for the individual test results.
[ERROR] -> [Help 1]
[ERROR]
[ERROR] To see the full stack trace of the errors, re-run Maven with the -e switch.
[ERROR] Re-run Maven using the -X switch to enable full debug logging.
[ERROR]
[ERROR] For more information about the errors and possible solutions, please read the following articles:
[ERROR] [Help 1] http://cwiki.apache.org/confluence/display/MAVEN/MojoFailureException
[ERROR]
[ERROR] After correcting the problems, you can resume the build with the command
[ERROR] mvn <goals> -rf :brooklyn-rest-resources
Build step 'Execute shell' marked build as failure
Recording test results
TestNG Reports Processing: START
Looking for TestNG results report in workspace using pattern: **/testng-results.xml
testng-results.xml was last modified before this build started. Ignoring it.
testng-results.xml was last modified before this build started. Ignoring it.
testng-results.xml was last modified before this build started. Ignoring it.
testng-results.xml was last modified before this build started. Ignoring it.
testng-results.xml was last modified before this build started. Ignoring it.
testng-results.xml was last modified before this build started. Ignoring it.
testng-results.xml was last modified before this build started. Ignoring it.
testng-results.xml was last modified before this build started. Ignoring it.
testng-results.xml was last modified before this build started. Ignoring it.
testng-results.xml was last modified before this build started. Ignoring it.
testng-results.xml was last modified before this build started. Ignoring it.
testng-results.xml was last modified before this build started. Ignoring it.
testng-results.xml was last modified before this build started. Ignoring it.
testng-results.xml was last modified before this build started. Ignoring it.
testng-results.xml was last modified before this build started. Ignoring it.
testng-results.xml was last modified before this build started. Ignoring it.
testng-results.xml was last modified before this build started. Ignoring it.
testng-results.xml was last modified before this build started. Ignoring it.
testng-results.xml was last modified before this build started. Ignoring it.
testng-results.xml was last modified before this build started. Ignoring it.
Saving reports...
Processing '/x1/jenkins/jenkins-home/jobs/brooklyn-master-build-docker/builds/343/testng/testng-results-1.xml'
Processing '/x1/jenkins/jenkins-home/jobs/brooklyn-master-build-docker/builds/343/testng/testng-results-10.xml'
Processing '/x1/jenkins/jenkins-home/jobs/brooklyn-master-build-docker/builds/343/testng/testng-results-11.xml'
Processing '/x1/jenkins/jenkins-home/jobs/brooklyn-master-build-docker/builds/343/testng/testng-results-12.xml'
Processing '/x1/jenkins/jenkins-home/jobs/brooklyn-master-build-docker/builds/343/testng/testng-results-13.xml'
Processing '/x1/jenkins/jenkins-home/jobs/brooklyn-master-build-docker/builds/343/testng/testng-results-14.xml'
Processing '/x1/jenkins/jenkins-home/jobs/brooklyn-master-build-docker/builds/343/testng/testng-results-2.xml'
Processing '/x1/jenkins/jenkins-home/jobs/brooklyn-master-build-docker/builds/343/testng/testng-results-3.xml'
Processing '/x1/jenkins/jenkins-home/jobs/brooklyn-master-build-docker/builds/343/testng/testng-results-4.xml'
Processing '/x1/jenkins/jenkins-home/jobs/brooklyn-master-build-docker/builds/343/testng/testng-results-5.xml'
Processing '/x1/jenkins/jenkins-home/jobs/brooklyn-master-build-docker/builds/343/testng/testng-results-6.xml'
Processing '/x1/jenkins/jenkins-home/jobs/brooklyn-master-build-docker/builds/343/testng/testng-results-7.xml'
Processing '/x1/jenkins/jenkins-home/jobs/brooklyn-master-build-docker/builds/343/testng/testng-results-8.xml'
Processing '/x1/jenkins/jenkins-home/jobs/brooklyn-master-build-docker/builds/343/testng/testng-results-9.xml'
Processing '/x1/jenkins/jenkins-home/jobs/brooklyn-master-build-docker/builds/343/testng/testng-results.xml'
0.021872% of tests failed, which exceeded threshold of 0%. Marking build as UNSTABLE
TestNG Reports Processing: FINISH
Jenkins build is back to normal : brooklyn-master-build-docker #345
Posted by Apache Jenkins Server <je...@builds.apache.org>.
See <https://builds.apache.org/job/brooklyn-master-build-docker/345/display/redirect>
Re: Build failed in Jenkins: brooklyn-master-build-docker #344
Posted by Joel Gil León <jo...@gil.com>.
thanks! apologies for the noise.
Joel
On Tue, Apr 10, 2018 at 1:13 PM Richard Downer <ri...@apache.org> wrote:
> Joel,
>
> To unsubscribe, send a blank email to: dev-unsubscribe@brooklyn.apache.org
>
> If you're having trouble unsubscribing, you can email
> dev-owner@brooklyn.apache.org which will reach a human who can assist you.
>
> Richard.
>
>
> On 10 April 2018 at 11:10, Joel Gil León <jo...@gil.com> wrote:
>
> > unsubscribe
> >
> > On Tue, Apr 10, 2018 at 12:22 PM Apache Jenkins Server <
> > jenkins@builds.apache.org> wrote:
> >
> > > See <
> > > https://builds.apache.org/job/brooklyn-master-build-docker/
> > 344/display/redirect
> > > >
> > >
> > > ------------------------------------------
> > > [...truncated 7.26 MB...]
> > > at
> > > org.apache.brooklyn.core.test.entity.LocalManagementContextForTests
> > .<init>(LocalManagementContextForTests.java:45)
> > > at
> > > org.apache.brooklyn.core.test.entity.LocalManagementContextForTests
> > $Builder.build(LocalManagementContextForTests.java:185)
> > > at
> > > org.apache.brooklyn.camp.brooklyn.AbstractYamlTest.
> > newTestManagementContext(AbstractYamlTest.java:117)
> > > at
> > > org.apache.brooklyn.camp.brooklyn.AbstractYamlTest$1.newMgmtContext(
> > AbstractYamlTest.java:103)
> > > at
> > > org.apache.brooklyn.camp.brooklyn.BrooklynCampPlatformLauncherAb
> > stract.launch(BrooklynCampPlatformLauncherAbstract.java:48)
> > > at
> > > org.apache.brooklyn.camp.brooklyn.AbstractYamlTest.setUpPlatform(
> > AbstractYamlTest.java:106)
> > > at
> > > org.apache.brooklyn.camp.brooklyn.AbstractYamlTest.
> > setUp(AbstractYamlTest.java:95)
> > > at sun.reflect.GeneratedMethodAccessor24.invoke(Unknown Source)
> > > at
> > > sun.reflect.DelegatingMethodAccessorImpl.invoke(
> > DelegatingMethodAccessorImpl.java:43)
> > > at java.lang.reflect.Method.invoke(Method.java:498)
> > > at
> > > org.testng.internal.MethodInvocationHelper.invokeMethod(
> > MethodInvocationHelper.java:104)
> > > at
> > > org.testng.internal.Invoker.invokeConfigurationMethod(Invoker.java:515)
> > > at
> > > org.testng.internal.Invoker.invokeConfigurations(Invoker.java:217)
> > > at org.testng.internal.Invoker.invokeMethod(Invoker.java:590)
> > > at org.testng.internal.Invoker.invokeTestMethod(Invoker.java:
> > 851)
> > > at org.testng.internal.Invoker.invokeTestMethods(Invoker.
> > java:1177)
> > > at
> > > org.testng.internal.TestMethodWorker.invokeTestMethods(
> > TestMethodWorker.java:129)
> > > at
> > > org.testng.internal.TestMethodWorker.run(TestMethodWorker.java:112)
> > > at org.testng.TestRunner.privateRun(TestRunner.java:756)
> > > at org.testng.TestRunner.run(TestRunner.java:610)
> > > at org.testng.SuiteRunner.runTest(SuiteRunner.java:387)
> > > at org.testng.SuiteRunner.runSequentially(SuiteRunner.java:382)
> > > at org.testng.SuiteRunner.privateRun(SuiteRunner.java:340)
> > > at org.testng.SuiteRunner.run(SuiteRunner.java:289)
> > > at org.testng.SuiteRunnerWorker.runSuite(SuiteRunnerWorker.
> > java:52)
> > > at org.testng.SuiteRunnerWorker.run(SuiteRunnerWorker.java:86)
> > > at org.testng.TestNG.runSuitesSequentially(TestNG.java:1293)
> > > at org.testng.TestNG.runSuitesLocally(TestNG.java:1218)
> > > at org.testng.TestNG.runSuites(TestNG.java:1133)
> > > at org.testng.TestNG.run(TestNG.java:1104)
> > > at
> > > org.apache.maven.surefire.testng.TestNGExecutor.run(
> > TestNGExecutor.java:132)
> > > at
> > > org.apache.maven.surefire.testng.TestNGDirectoryTestSuite.executeMulti(
> > TestNGDirectoryTestSuite.java:193)
> > > at
> > > org.apache.maven.surefire.testng.TestNGDirectoryTestSuite.execute(
> > TestNGDirectoryTestSuite.java:94)
> > > at
> > > org.apache.maven.surefire.testng.TestNGProvider.invoke(
> > TestNGProvider.java:147)
> > > at
> > > org.apache.maven.surefire.booter.ForkedBooter.
> > invokeProviderInSameClassLoader(ForkedBooter.java:290)
> > > at
> > > org.apache.maven.surefire.booter.ForkedBooter.runSuitesInProcess(
> > ForkedBooter.java:242)
> > > at
> > > org.apache.maven.surefire.booter.ForkedBooter.main(
> > ForkedBooter.java:121)
> > >
> > > 2018-04-10 09:21:39,388 WARN - Management Context
> > > LocalManagementContext[?-WoqhFMe5] running, creation stacktrace:
> > > java.lang.Throwable: for construction stacktrace
> > > at
> > > org.apache.brooklyn.core.mgmt.internal.LocalManagementContext.<init>(
> > LocalManagementContext.java:141)
> > > at
> > > org.apache.brooklyn.core.mgmt.internal.LocalManagementContext.<init>(
> > LocalManagementContext.java:163)
> > > at
> > > org.apache.brooklyn.core.mgmt.internal.LocalManagementContext.<init>(
> > LocalManagementContext.java:159)
> > > at
> > > org.apache.brooklyn.core.test.entity.LocalManagementContextForTests
> > .<init>(LocalManagementContextForTests.java:45)
> > > at
> > > org.apache.brooklyn.core.test.entity.LocalManagementContextForTests
> > $Builder.build(LocalManagementContextForTests.java:185)
> > > at
> > > org.apache.brooklyn.camp.brooklyn.AbstractYamlTest.
> > newTestManagementContext(AbstractYamlTest.java:117)
> > > at
> > > org.apache.brooklyn.camp.brooklyn.AbstractYamlTest$1.newMgmtContext(
> > AbstractYamlTest.java:103)
> > > at
> > > org.apache.brooklyn.camp.brooklyn.BrooklynCampPlatformLauncherAb
> > stract.launch(BrooklynCampPlatformLauncherAbstract.java:48)
> > > at
> > > org.apache.brooklyn.camp.brooklyn.AbstractYamlTest.setUpPlatform(
> > AbstractYamlTest.java:106)
> > > at
> > > org.apache.brooklyn.camp.brooklyn.AbstractYamlTest.
> > setUp(AbstractYamlTest.java:95)
> > > at sun.reflect.GeneratedMethodAccessor24.invoke(Unknown Source)
> > > at
> > > sun.reflect.DelegatingMethodAccessorImpl.invoke(
> > DelegatingMethodAccessorImpl.java:43)
> > > at java.lang.reflect.Method.invoke(Method.java:498)
> > > at
> > > org.testng.internal.MethodInvocationHelper.invokeMethod(
> > MethodInvocationHelper.java:104)
> > > at
> > > org.testng.internal.Invoker.invokeConfigurationMethod(Invoker.java:515)
> > > at
> > > org.testng.internal.Invoker.invokeConfigurations(Invoker.java:217)
> > > at org.testng.internal.Invoker.invokeMethod(Invoker.java:590)
> > > at org.testng.internal.Invoker.invokeTestMethod(Invoker.java:
> > 851)
> > > at org.testng.internal.Invoker.invokeTestMethods(Invoker.
> > java:1177)
> > > at
> > > org.testng.internal.TestMethodWorker.invokeTestMethods(
> > TestMethodWorker.java:129)
> > > at
> > > org.testng.internal.TestMethodWorker.run(TestMethodWorker.java:112)
> > > at org.testng.TestRunner.privateRun(TestRunner.java:756)
> > > at org.testng.TestRunner.run(TestRunner.java:610)
> > > at org.testng.SuiteRunner.runTest(SuiteRunner.java:387)
> > > at org.testng.SuiteRunner.runSequentially(SuiteRunner.java:382)
> > > at org.testng.SuiteRunner.privateRun(SuiteRunner.java:340)
> > > at org.testng.SuiteRunner.run(SuiteRunner.java:289)
> > > at org.testng.SuiteRunnerWorker.runSuite(SuiteRunnerWorker.
> > java:52)
> > > at org.testng.SuiteRunnerWorker.run(SuiteRunnerWorker.java:86)
> > > at org.testng.TestNG.runSuitesSequentially(TestNG.java:1293)
> > > at org.testng.TestNG.runSuitesLocally(TestNG.java:1218)
> > > at org.testng.TestNG.runSuites(TestNG.java:1133)
> > > at org.testng.TestNG.run(TestNG.java:1104)
> > > at
> > > org.apache.maven.surefire.testng.TestNGExecutor.run(
> > TestNGExecutor.java:132)
> > > at
> > > org.apache.maven.surefire.testng.TestNGDirectoryTestSuite.executeMulti(
> > TestNGDirectoryTestSuite.java:193)
> > > at
> > > org.apache.maven.surefire.testng.TestNGDirectoryTestSuite.execute(
> > TestNGDirectoryTestSuite.java:94)
> > > at
> > > org.apache.maven.surefire.testng.TestNGProvider.invoke(
> > TestNGProvider.java:147)
> > > at
> > > org.apache.maven.surefire.booter.ForkedBooter.
> > invokeProviderInSameClassLoader(ForkedBooter.java:290)
> > > at
> > > org.apache.maven.surefire.booter.ForkedBooter.runSuitesInProcess(
> > ForkedBooter.java:242)
> > > at
> > > org.apache.maven.surefire.booter.ForkedBooter.main(
> > ForkedBooter.java:121)
> > >
> > > 2018-04-10 09:21:39,389 INFO - BrooklynLeakListener.onFinish
> attempting
> > > to terminate all extant ManagementContexts: name=Surefire test;
> > > includedGroups=[]; excludedGroups=[Integration, Acceptance, Live,
> > > Live-sanity, WIP, Broken]; suiteName=Surefire suite;
> > > outDir=/usr/build/brooklyn-server/camp/camp-brooklyn/
> > target/surefire-reports/Surefire
> > > suite: 4 ManagementContexts terminated
> > > 2018-04-10 09:21:39,390 INFO - TESTNG
> > > ===============================================
> > > Surefire test
> > > Tests run: 796, Failures: 1, Skips: 0
> > > ===============================================
> > > Tests run: 796, Failures: 1, Errors: 0, Skipped: 0, Time elapsed:
> 166.254
> > > sec <<< FAILURE! - in TestSuite
> > > testAlternativeServiceUpPolling(org.apache.brooklyn.camp.brooklyn.
> > VanillaSoftwareProcessYamlTest)
> > > Time elapsed: 30.327 sec <<< FAILURE!
> > > java.lang.AssertionError: failed succeeds-eventually, 75 attempts,
> > 30000ms
> > > elapsed: AssertionError: actual=[starting, running]; expected=[created,
> > > starting, running]: lists don't have the same size expected [3] but
> found
> > > [2]
> > > at
> > > org.apache.brooklyn.camp.brooklyn.VanillaSoftwareProcessYamlTest
> > .assertEventsEqualEventually(VanillaSoftwareProcessYamlTest.java:261)
> > > at
> > > org.apache.brooklyn.camp.brooklyn.VanillaSoftwareProcessYamlTest.
> > testAlternativeServiceUpPolling(VanillaSoftwareProcessYamlTest.java:249)
> > > Caused by: java.lang.AssertionError: actual=[starting, running];
> > > expected=[created, starting, running]: lists don't have the same size
> > > expected [3] but found [2]
> > > at
> > > org.apache.brooklyn.camp.brooklyn.VanillaSoftwareProcessYamlTest
> > .assertIterablesEqual(VanillaSoftwareProcessYamlTest.java:278)
> > > at
> > > org.apache.brooklyn.camp.brooklyn.VanillaSoftwareProcessYamlTest
> > .access$100(VanillaSoftwareProcessYamlTest.java:64)
> > > at
> > > org.apache.brooklyn.camp.brooklyn.VanillaSoftwareProcessYamlTest
> > .assertEventsEqualEventually(VanillaSoftwareProcessYamlTest.java:261)
> > > at
> > > org.apache.brooklyn.camp.brooklyn.VanillaSoftwareProcessYamlTest.
> > testAlternativeServiceUpPolling(VanillaSoftwareProcessYamlTest.java:249)
> > >
> > >
> > > Results :
> > >
> > > Failed tests:
> > >
> > > VanillaSoftwareProcessYamlTest.testAlternativeServiceUpPolling:249->
> > assertEventsEqualEventually:261
> > > failed succeeds-eventually, 75 attempts, 30000ms elapsed:
> AssertionError:
> > > actual=[starting, running]; expected=[created, starting, running]:
> lists
> > > don't have the same size expected [3] but found [2]
> > >
> > > Tests run: 796, Failures: 1, Errors: 0, Skipped: 0
> > >
> > > [INFO]
> > >
> ------------------------------------------------------------------------
> > > [INFO] Reactor Summary:
> > > [INFO]
> > > [INFO] Brooklyn REST JavaScript Web GUI ................... SUCCESS [
> > > 31.702 s]
> > > [INFO] Brooklyn Server Root ............................... SUCCESS [
> > > 0.145 s]
> > > [INFO] Brooklyn Parent Project ............................ SUCCESS [
> > > 2.759 s]
> > > [INFO] Brooklyn Test Support Utilities .................... SUCCESS [
> > > 3.979 s]
> > > [INFO] Brooklyn Logback Includable Configuration .......... SUCCESS [
> > > 0.445 s]
> > > [INFO] Brooklyn Common Utilities .......................... SUCCESS [
> > > 24.800 s]
> > > [INFO] Brooklyn API ....................................... SUCCESS [
> > > 1.858 s]
> > > [INFO] CAMP Server Parent Project ......................... SUCCESS [
> > > 0.279 s]
> > > [INFO] CAMP Base .......................................... SUCCESS [
> > > 3.029 s]
> > > [INFO] Brooklyn Test Support .............................. SUCCESS [
> > > 1.225 s]
> > > [INFO] Brooklyn REST Swagger Apidoc Utilities ............. SUCCESS [
> > > 1.116 s]
> > > [INFO] Brooklyn Logback Configuration ..................... SUCCESS [
> > > 0.209 s]
> > > [INFO] CAMP Server ........................................ SUCCESS [
> > > 5.473 s]
> > > [INFO] Brooklyn Felix Runtime ............................. SUCCESS [
> > > 2.805 s]
> > > [INFO] Brooklyn Groovy Utilities .......................... SUCCESS [
> > > 1.955 s]
> > > [INFO] Brooklyn Core ...................................... SUCCESS
> > [03:33
> > > min]
> > > [INFO] Brooklyn Policies .................................. SUCCESS [
> > > 37.231 s]
> > > [INFO] Brooklyn WinRM Software Entities ................... SUCCESS [
> > > 10.748 s]
> > > [INFO] Brooklyn Secure JMXMP Agent ........................ SUCCESS [
> > > 8.968 s]
> > > [INFO] Brooklyn JMX RMI Agent ............................. SUCCESS [
> > > 0.608 s]
> > > [INFO] Brooklyn Jclouds Location Targets .................. SUCCESS
> > [01:00
> > > min]
> > > [INFO] Brooklyn Software Base ............................. SUCCESS
> > [01:26
> > > min]
> > > [INFO] Brooklyn CAMP ...................................... FAILURE
> > [02:54
> > > min]
> > > [INFO] Brooklyn Launcher Common ........................... SKIPPED
> > > [INFO] Brooklyn REST API .................................. SKIPPED
> > > [INFO] Brooklyn REST Resources ............................ SKIPPED
> > > [INFO] Brooklyn REST Server ............................... SKIPPED
> > > [INFO] Brooklyn Launcher .................................. SKIPPED
> > > [INFO] Brooklyn Container Location Targets ................ SKIPPED
> > > [INFO] Brooklyn Command Line Interface .................... SKIPPED
> > > [INFO] Brooklyn Test Framework ............................ SKIPPED
> > > [INFO] Brooklyn OSGi init ................................. SKIPPED
> > > [INFO] Brooklyn OSGi start ................................ SKIPPED
> > > [INFO] Brooklyn Karaf ..................................... SKIPPED
> > > [INFO] Jetty config fragment .............................. SKIPPED
> > > [INFO] Apache Http Component extension .................... SKIPPED
> > > [INFO] Brooklyn Karaf Features ............................ SKIPPED
> > > [INFO] Brooklyn Karaf Shell Commands ...................... SKIPPED
> > > [INFO] Brooklyn Library Root .............................. SKIPPED
> > > [INFO] Brooklyn CM Chef ................................... SKIPPED
> > > [INFO] Brooklyn CM SaltStack .............................. SKIPPED
> > > [INFO] Brooklyn CM Ansible ................................ SKIPPED
> > > [INFO] Brooklyn CM Integration Root ....................... SKIPPED
> > > [INFO] Brooklyn Network Software Entities ................. SKIPPED
> > > [INFO] Brooklyn OSGi Software Entities .................... SKIPPED
> > > [INFO] Brooklyn Database Software Entities ................ SKIPPED
> > > [INFO] Brooklyn Web App Software Entities ................. SKIPPED
> > > [INFO] Brooklyn Messaging Software Entities ............... SKIPPED
> > > [INFO] Brooklyn NoSQL Data Store Software Entities ........ SKIPPED
> > > [INFO] Brooklyn Monitoring Software Entities .............. SKIPPED
> > > [INFO] Brooklyn Web App Software Entities ................. SKIPPED
> > > [INFO] Brooklyn QA ........................................ SKIPPED
> > > [INFO] Brooklyn Examples Aggregator Project ............... SKIPPED
> > > [INFO] Brooklyn Examples Aggregator Project - Webapps ..... SKIPPED
> > > [INFO] hello-world-webapp Maven Webapp .................... SKIPPED
> > > [INFO] hello-world-sql-webapp Maven Webapp ................ SKIPPED
> > > [INFO] Brooklyn Simple Web Cluster Example ................ SKIPPED
> > > [INFO] Brooklyn Library Karaf integration ................. SKIPPED
> > > [INFO] Brooklyn Library Catalog ........................... SKIPPED
> > > [INFO] Brooklyn Library Karaf Features .................... SKIPPED
> > > [INFO] Brooklyn Client .................................... SKIPPED
> > > [INFO] Brooklyn Client Command Line Interface ............. SKIPPED
> > > [INFO] Brooklyn REST java Client .......................... SKIPPED
> > > [INFO] Brooklyn Downstream Project Parent ................. SKIPPED
> > > [INFO] Brooklyn Dist Root ................................. SKIPPED
> > > [INFO] Brooklyn All Things ................................ SKIPPED
> > > [INFO] Brooklyn Distribution .............................. SKIPPED
> > > [INFO] Brooklyn Karaf Distribution Parent ................. SKIPPED
> > > [INFO] Brooklyn Karaf Server Configuration ................ SKIPPED
> > > [INFO] Brooklyn Dist Karaf Features ....................... SKIPPED
> > > [INFO] Brooklyn Karaf Distribution ........................ SKIPPED
> > > [INFO] Brooklyn Karaf pax-exam itest ...................... SKIPPED
> > > [INFO] Brooklyn Vagrant Getting Started Environment ....... SKIPPED
> > > [INFO] Brooklyn Quick-Start Project Archetype ............. SKIPPED
> > > [INFO] Brooklyn Shared Package Files ...................... SKIPPED
> > > [INFO] Brooklyn RPM Package ............................... SKIPPED
> > > [INFO] Brooklyn DEB Package ............................... SKIPPED
> > > [INFO] Brooklyn Root ...................................... SKIPPED
> > > [INFO]
> > >
> ------------------------------------------------------------------------
> > > [INFO] BUILD FAILURE
> > > [INFO]
> > >
> ------------------------------------------------------------------------
> > > [INFO] Total time: 11:18 min
> > > [INFO] Finished at: 2018-04-10T09:21:40Z
> > > [INFO] Final Memory: 128M/940M
> > > [INFO]
> > >
> ------------------------------------------------------------------------
> > > [ERROR] Failed to execute goal
> > > org.apache.maven.plugins:maven-surefire-plugin:2.19.1:test
> > (default-test)
> > > on project brooklyn-camp: There are test failures.
> > > [ERROR]
> > > [ERROR] Please refer to
> > > /usr/build/brooklyn-server/camp/camp-brooklyn/target/surefire-reports
> > for
> > > the individual test results.
> > > [ERROR] -> [Help 1]
> > > [ERROR]
> > > [ERROR] To see the full stack trace of the errors, re-run Maven with
> the
> > > -e switch.
> > > [ERROR] Re-run Maven using the -X switch to enable full debug logging.
> > > [ERROR]
> > > [ERROR] For more information about the errors and possible solutions,
> > > please read the following articles:
> > > [ERROR] [Help 1]
> > > http://cwiki.apache.org/confluence/display/MAVEN/MojoFailureException
> > > [ERROR]
> > > [ERROR] After correcting the problems, you can resume the build with
> the
> > > command
> > > [ERROR] mvn <goals> -rf :brooklyn-camp
> > > Build step 'Execute shell' marked build as failure
> > > Recording test results
> > > TestNG Reports Processing: START
> > > Looking for TestNG results report in workspace using pattern:
> > > **/testng-results.xml
> > > testng-results.xml was last modified before this build started.
> Ignoring
> > > it.
> > > testng-results.xml was last modified before this build started.
> Ignoring
> > > it.
> > > testng-results.xml was last modified before this build started.
> Ignoring
> > > it.
> > > testng-results.xml was last modified before this build started.
> Ignoring
> > > it.
> > > testng-results.xml was last modified before this build started.
> Ignoring
> > > it.
> > > testng-results.xml was last modified before this build started.
> Ignoring
> > > it.
> > > testng-results.xml was last modified before this build started.
> Ignoring
> > > it.
> > > testng-results.xml was last modified before this build started.
> Ignoring
> > > it.
> > > testng-results.xml was last modified before this build started.
> Ignoring
> > > it.
> > > testng-results.xml was last modified before this build started.
> Ignoring
> > > it.
> > > testng-results.xml was last modified before this build started.
> Ignoring
> > > it.
> > > testng-results.xml was last modified before this build started.
> Ignoring
> > > it.
> > > testng-results.xml was last modified before this build started.
> Ignoring
> > > it.
> > > testng-results.xml was last modified before this build started.
> Ignoring
> > > it.
> > > testng-results.xml was last modified before this build started.
> Ignoring
> > > it.
> > > testng-results.xml was last modified before this build started.
> Ignoring
> > > it.
> > > testng-results.xml was last modified before this build started.
> Ignoring
> > > it.
> > > testng-results.xml was last modified before this build started.
> Ignoring
> > > it.
> > > testng-results.xml was last modified before this build started.
> Ignoring
> > > it.
> > > testng-results.xml was last modified before this build started.
> Ignoring
> > > it.
> > > testng-results.xml was last modified before this build started.
> Ignoring
> > > it.
> > > testng-results.xml was last modified before this build started.
> Ignoring
> > > it.
> > > testng-results.xml was last modified before this build started.
> Ignoring
> > > it.
> > > Saving reports...
> > > Processing
> > > '/x1/jenkins/jenkins-home/jobs/brooklyn-master-build-
> > docker/builds/344/testng/testng-results-1.xml'
> > > Processing
> > > '/x1/jenkins/jenkins-home/jobs/brooklyn-master-build-
> > docker/builds/344/testng/testng-results-10.xml'
> > > Processing
> > > '/x1/jenkins/jenkins-home/jobs/brooklyn-master-build-
> > docker/builds/344/testng/testng-results-11.xml'
> > > Processing
> > > '/x1/jenkins/jenkins-home/jobs/brooklyn-master-build-
> > docker/builds/344/testng/testng-results-2.xml'
> > > Processing
> > > '/x1/jenkins/jenkins-home/jobs/brooklyn-master-build-
> > docker/builds/344/testng/testng-results-3.xml'
> > > Processing
> > > '/x1/jenkins/jenkins-home/jobs/brooklyn-master-build-
> > docker/builds/344/testng/testng-results-4.xml'
> > > Processing
> > > '/x1/jenkins/jenkins-home/jobs/brooklyn-master-build-
> > docker/builds/344/testng/testng-results-5.xml'
> > > Processing
> > > '/x1/jenkins/jenkins-home/jobs/brooklyn-master-build-
> > docker/builds/344/testng/testng-results-6.xml'
> > > Processing
> > > '/x1/jenkins/jenkins-home/jobs/brooklyn-master-build-
> > docker/builds/344/testng/testng-results-7.xml'
> > > Processing
> > > '/x1/jenkins/jenkins-home/jobs/brooklyn-master-build-
> > docker/builds/344/testng/testng-results-8.xml'
> > > Processing
> > > '/x1/jenkins/jenkins-home/jobs/brooklyn-master-build-
> > docker/builds/344/testng/testng-results-9.xml'
> > > Processing
> > > '/x1/jenkins/jenkins-home/jobs/brooklyn-master-build-
> > docker/builds/344/testng/testng-results.xml'
> > > 0.023223% of tests failed, which exceeded threshold of 0%. Marking
> build
> > > as UNSTABLE
> > > TestNG Reports Processing: FINISH
> > >
> >
>
Re: Build failed in Jenkins: brooklyn-master-build-docker #344
Posted by Richard Downer <ri...@apache.org>.
Joel,
To unsubscribe, send a blank email to: dev-unsubscribe@brooklyn.apache.org
If you're having trouble unsubscribing, you can email
dev-owner@brooklyn.apache.org which will reach a human who can assist you.
Richard.
On 10 April 2018 at 11:10, Joel Gil León <jo...@gil.com> wrote:
> unsubscribe
>
> On Tue, Apr 10, 2018 at 12:22 PM Apache Jenkins Server <
> jenkins@builds.apache.org> wrote:
>
> > See <
> > https://builds.apache.org/job/brooklyn-master-build-docker/
> 344/display/redirect
> > >
> >
> > ------------------------------------------
> > [...truncated 7.26 MB...]
> > at
> > org.apache.brooklyn.core.test.entity.LocalManagementContextForTests
> .<init>(LocalManagementContextForTests.java:45)
> > at
> > org.apache.brooklyn.core.test.entity.LocalManagementContextForTests
> $Builder.build(LocalManagementContextForTests.java:185)
> > at
> > org.apache.brooklyn.camp.brooklyn.AbstractYamlTest.
> newTestManagementContext(AbstractYamlTest.java:117)
> > at
> > org.apache.brooklyn.camp.brooklyn.AbstractYamlTest$1.newMgmtContext(
> AbstractYamlTest.java:103)
> > at
> > org.apache.brooklyn.camp.brooklyn.BrooklynCampPlatformLauncherAb
> stract.launch(BrooklynCampPlatformLauncherAbstract.java:48)
> > at
> > org.apache.brooklyn.camp.brooklyn.AbstractYamlTest.setUpPlatform(
> AbstractYamlTest.java:106)
> > at
> > org.apache.brooklyn.camp.brooklyn.AbstractYamlTest.
> setUp(AbstractYamlTest.java:95)
> > at sun.reflect.GeneratedMethodAccessor24.invoke(Unknown Source)
> > at
> > sun.reflect.DelegatingMethodAccessorImpl.invoke(
> DelegatingMethodAccessorImpl.java:43)
> > at java.lang.reflect.Method.invoke(Method.java:498)
> > at
> > org.testng.internal.MethodInvocationHelper.invokeMethod(
> MethodInvocationHelper.java:104)
> > at
> > org.testng.internal.Invoker.invokeConfigurationMethod(Invoker.java:515)
> > at
> > org.testng.internal.Invoker.invokeConfigurations(Invoker.java:217)
> > at org.testng.internal.Invoker.invokeMethod(Invoker.java:590)
> > at org.testng.internal.Invoker.invokeTestMethod(Invoker.java:
> 851)
> > at org.testng.internal.Invoker.invokeTestMethods(Invoker.
> java:1177)
> > at
> > org.testng.internal.TestMethodWorker.invokeTestMethods(
> TestMethodWorker.java:129)
> > at
> > org.testng.internal.TestMethodWorker.run(TestMethodWorker.java:112)
> > at org.testng.TestRunner.privateRun(TestRunner.java:756)
> > at org.testng.TestRunner.run(TestRunner.java:610)
> > at org.testng.SuiteRunner.runTest(SuiteRunner.java:387)
> > at org.testng.SuiteRunner.runSequentially(SuiteRunner.java:382)
> > at org.testng.SuiteRunner.privateRun(SuiteRunner.java:340)
> > at org.testng.SuiteRunner.run(SuiteRunner.java:289)
> > at org.testng.SuiteRunnerWorker.runSuite(SuiteRunnerWorker.
> java:52)
> > at org.testng.SuiteRunnerWorker.run(SuiteRunnerWorker.java:86)
> > at org.testng.TestNG.runSuitesSequentially(TestNG.java:1293)
> > at org.testng.TestNG.runSuitesLocally(TestNG.java:1218)
> > at org.testng.TestNG.runSuites(TestNG.java:1133)
> > at org.testng.TestNG.run(TestNG.java:1104)
> > at
> > org.apache.maven.surefire.testng.TestNGExecutor.run(
> TestNGExecutor.java:132)
> > at
> > org.apache.maven.surefire.testng.TestNGDirectoryTestSuite.executeMulti(
> TestNGDirectoryTestSuite.java:193)
> > at
> > org.apache.maven.surefire.testng.TestNGDirectoryTestSuite.execute(
> TestNGDirectoryTestSuite.java:94)
> > at
> > org.apache.maven.surefire.testng.TestNGProvider.invoke(
> TestNGProvider.java:147)
> > at
> > org.apache.maven.surefire.booter.ForkedBooter.
> invokeProviderInSameClassLoader(ForkedBooter.java:290)
> > at
> > org.apache.maven.surefire.booter.ForkedBooter.runSuitesInProcess(
> ForkedBooter.java:242)
> > at
> > org.apache.maven.surefire.booter.ForkedBooter.main(
> ForkedBooter.java:121)
> >
> > 2018-04-10 09:21:39,388 WARN - Management Context
> > LocalManagementContext[?-WoqhFMe5] running, creation stacktrace:
> > java.lang.Throwable: for construction stacktrace
> > at
> > org.apache.brooklyn.core.mgmt.internal.LocalManagementContext.<init>(
> LocalManagementContext.java:141)
> > at
> > org.apache.brooklyn.core.mgmt.internal.LocalManagementContext.<init>(
> LocalManagementContext.java:163)
> > at
> > org.apache.brooklyn.core.mgmt.internal.LocalManagementContext.<init>(
> LocalManagementContext.java:159)
> > at
> > org.apache.brooklyn.core.test.entity.LocalManagementContextForTests
> .<init>(LocalManagementContextForTests.java:45)
> > at
> > org.apache.brooklyn.core.test.entity.LocalManagementContextForTests
> $Builder.build(LocalManagementContextForTests.java:185)
> > at
> > org.apache.brooklyn.camp.brooklyn.AbstractYamlTest.
> newTestManagementContext(AbstractYamlTest.java:117)
> > at
> > org.apache.brooklyn.camp.brooklyn.AbstractYamlTest$1.newMgmtContext(
> AbstractYamlTest.java:103)
> > at
> > org.apache.brooklyn.camp.brooklyn.BrooklynCampPlatformLauncherAb
> stract.launch(BrooklynCampPlatformLauncherAbstract.java:48)
> > at
> > org.apache.brooklyn.camp.brooklyn.AbstractYamlTest.setUpPlatform(
> AbstractYamlTest.java:106)
> > at
> > org.apache.brooklyn.camp.brooklyn.AbstractYamlTest.
> setUp(AbstractYamlTest.java:95)
> > at sun.reflect.GeneratedMethodAccessor24.invoke(Unknown Source)
> > at
> > sun.reflect.DelegatingMethodAccessorImpl.invoke(
> DelegatingMethodAccessorImpl.java:43)
> > at java.lang.reflect.Method.invoke(Method.java:498)
> > at
> > org.testng.internal.MethodInvocationHelper.invokeMethod(
> MethodInvocationHelper.java:104)
> > at
> > org.testng.internal.Invoker.invokeConfigurationMethod(Invoker.java:515)
> > at
> > org.testng.internal.Invoker.invokeConfigurations(Invoker.java:217)
> > at org.testng.internal.Invoker.invokeMethod(Invoker.java:590)
> > at org.testng.internal.Invoker.invokeTestMethod(Invoker.java:
> 851)
> > at org.testng.internal.Invoker.invokeTestMethods(Invoker.
> java:1177)
> > at
> > org.testng.internal.TestMethodWorker.invokeTestMethods(
> TestMethodWorker.java:129)
> > at
> > org.testng.internal.TestMethodWorker.run(TestMethodWorker.java:112)
> > at org.testng.TestRunner.privateRun(TestRunner.java:756)
> > at org.testng.TestRunner.run(TestRunner.java:610)
> > at org.testng.SuiteRunner.runTest(SuiteRunner.java:387)
> > at org.testng.SuiteRunner.runSequentially(SuiteRunner.java:382)
> > at org.testng.SuiteRunner.privateRun(SuiteRunner.java:340)
> > at org.testng.SuiteRunner.run(SuiteRunner.java:289)
> > at org.testng.SuiteRunnerWorker.runSuite(SuiteRunnerWorker.
> java:52)
> > at org.testng.SuiteRunnerWorker.run(SuiteRunnerWorker.java:86)
> > at org.testng.TestNG.runSuitesSequentially(TestNG.java:1293)
> > at org.testng.TestNG.runSuitesLocally(TestNG.java:1218)
> > at org.testng.TestNG.runSuites(TestNG.java:1133)
> > at org.testng.TestNG.run(TestNG.java:1104)
> > at
> > org.apache.maven.surefire.testng.TestNGExecutor.run(
> TestNGExecutor.java:132)
> > at
> > org.apache.maven.surefire.testng.TestNGDirectoryTestSuite.executeMulti(
> TestNGDirectoryTestSuite.java:193)
> > at
> > org.apache.maven.surefire.testng.TestNGDirectoryTestSuite.execute(
> TestNGDirectoryTestSuite.java:94)
> > at
> > org.apache.maven.surefire.testng.TestNGProvider.invoke(
> TestNGProvider.java:147)
> > at
> > org.apache.maven.surefire.booter.ForkedBooter.
> invokeProviderInSameClassLoader(ForkedBooter.java:290)
> > at
> > org.apache.maven.surefire.booter.ForkedBooter.runSuitesInProcess(
> ForkedBooter.java:242)
> > at
> > org.apache.maven.surefire.booter.ForkedBooter.main(
> ForkedBooter.java:121)
> >
> > 2018-04-10 09:21:39,389 INFO - BrooklynLeakListener.onFinish attempting
> > to terminate all extant ManagementContexts: name=Surefire test;
> > includedGroups=[]; excludedGroups=[Integration, Acceptance, Live,
> > Live-sanity, WIP, Broken]; suiteName=Surefire suite;
> > outDir=/usr/build/brooklyn-server/camp/camp-brooklyn/
> target/surefire-reports/Surefire
> > suite: 4 ManagementContexts terminated
> > 2018-04-10 09:21:39,390 INFO - TESTNG
> > ===============================================
> > Surefire test
> > Tests run: 796, Failures: 1, Skips: 0
> > ===============================================
> > Tests run: 796, Failures: 1, Errors: 0, Skipped: 0, Time elapsed: 166.254
> > sec <<< FAILURE! - in TestSuite
> > testAlternativeServiceUpPolling(org.apache.brooklyn.camp.brooklyn.
> VanillaSoftwareProcessYamlTest)
> > Time elapsed: 30.327 sec <<< FAILURE!
> > java.lang.AssertionError: failed succeeds-eventually, 75 attempts,
> 30000ms
> > elapsed: AssertionError: actual=[starting, running]; expected=[created,
> > starting, running]: lists don't have the same size expected [3] but found
> > [2]
> > at
> > org.apache.brooklyn.camp.brooklyn.VanillaSoftwareProcessYamlTest
> .assertEventsEqualEventually(VanillaSoftwareProcessYamlTest.java:261)
> > at
> > org.apache.brooklyn.camp.brooklyn.VanillaSoftwareProcessYamlTest.
> testAlternativeServiceUpPolling(VanillaSoftwareProcessYamlTest.java:249)
> > Caused by: java.lang.AssertionError: actual=[starting, running];
> > expected=[created, starting, running]: lists don't have the same size
> > expected [3] but found [2]
> > at
> > org.apache.brooklyn.camp.brooklyn.VanillaSoftwareProcessYamlTest
> .assertIterablesEqual(VanillaSoftwareProcessYamlTest.java:278)
> > at
> > org.apache.brooklyn.camp.brooklyn.VanillaSoftwareProcessYamlTest
> .access$100(VanillaSoftwareProcessYamlTest.java:64)
> > at
> > org.apache.brooklyn.camp.brooklyn.VanillaSoftwareProcessYamlTest
> .assertEventsEqualEventually(VanillaSoftwareProcessYamlTest.java:261)
> > at
> > org.apache.brooklyn.camp.brooklyn.VanillaSoftwareProcessYamlTest.
> testAlternativeServiceUpPolling(VanillaSoftwareProcessYamlTest.java:249)
> >
> >
> > Results :
> >
> > Failed tests:
> >
> > VanillaSoftwareProcessYamlTest.testAlternativeServiceUpPolling:249->
> assertEventsEqualEventually:261
> > failed succeeds-eventually, 75 attempts, 30000ms elapsed: AssertionError:
> > actual=[starting, running]; expected=[created, starting, running]: lists
> > don't have the same size expected [3] but found [2]
> >
> > Tests run: 796, Failures: 1, Errors: 0, Skipped: 0
> >
> > [INFO]
> > ------------------------------------------------------------------------
> > [INFO] Reactor Summary:
> > [INFO]
> > [INFO] Brooklyn REST JavaScript Web GUI ................... SUCCESS [
> > 31.702 s]
> > [INFO] Brooklyn Server Root ............................... SUCCESS [
> > 0.145 s]
> > [INFO] Brooklyn Parent Project ............................ SUCCESS [
> > 2.759 s]
> > [INFO] Brooklyn Test Support Utilities .................... SUCCESS [
> > 3.979 s]
> > [INFO] Brooklyn Logback Includable Configuration .......... SUCCESS [
> > 0.445 s]
> > [INFO] Brooklyn Common Utilities .......................... SUCCESS [
> > 24.800 s]
> > [INFO] Brooklyn API ....................................... SUCCESS [
> > 1.858 s]
> > [INFO] CAMP Server Parent Project ......................... SUCCESS [
> > 0.279 s]
> > [INFO] CAMP Base .......................................... SUCCESS [
> > 3.029 s]
> > [INFO] Brooklyn Test Support .............................. SUCCESS [
> > 1.225 s]
> > [INFO] Brooklyn REST Swagger Apidoc Utilities ............. SUCCESS [
> > 1.116 s]
> > [INFO] Brooklyn Logback Configuration ..................... SUCCESS [
> > 0.209 s]
> > [INFO] CAMP Server ........................................ SUCCESS [
> > 5.473 s]
> > [INFO] Brooklyn Felix Runtime ............................. SUCCESS [
> > 2.805 s]
> > [INFO] Brooklyn Groovy Utilities .......................... SUCCESS [
> > 1.955 s]
> > [INFO] Brooklyn Core ...................................... SUCCESS
> [03:33
> > min]
> > [INFO] Brooklyn Policies .................................. SUCCESS [
> > 37.231 s]
> > [INFO] Brooklyn WinRM Software Entities ................... SUCCESS [
> > 10.748 s]
> > [INFO] Brooklyn Secure JMXMP Agent ........................ SUCCESS [
> > 8.968 s]
> > [INFO] Brooklyn JMX RMI Agent ............................. SUCCESS [
> > 0.608 s]
> > [INFO] Brooklyn Jclouds Location Targets .................. SUCCESS
> [01:00
> > min]
> > [INFO] Brooklyn Software Base ............................. SUCCESS
> [01:26
> > min]
> > [INFO] Brooklyn CAMP ...................................... FAILURE
> [02:54
> > min]
> > [INFO] Brooklyn Launcher Common ........................... SKIPPED
> > [INFO] Brooklyn REST API .................................. SKIPPED
> > [INFO] Brooklyn REST Resources ............................ SKIPPED
> > [INFO] Brooklyn REST Server ............................... SKIPPED
> > [INFO] Brooklyn Launcher .................................. SKIPPED
> > [INFO] Brooklyn Container Location Targets ................ SKIPPED
> > [INFO] Brooklyn Command Line Interface .................... SKIPPED
> > [INFO] Brooklyn Test Framework ............................ SKIPPED
> > [INFO] Brooklyn OSGi init ................................. SKIPPED
> > [INFO] Brooklyn OSGi start ................................ SKIPPED
> > [INFO] Brooklyn Karaf ..................................... SKIPPED
> > [INFO] Jetty config fragment .............................. SKIPPED
> > [INFO] Apache Http Component extension .................... SKIPPED
> > [INFO] Brooklyn Karaf Features ............................ SKIPPED
> > [INFO] Brooklyn Karaf Shell Commands ...................... SKIPPED
> > [INFO] Brooklyn Library Root .............................. SKIPPED
> > [INFO] Brooklyn CM Chef ................................... SKIPPED
> > [INFO] Brooklyn CM SaltStack .............................. SKIPPED
> > [INFO] Brooklyn CM Ansible ................................ SKIPPED
> > [INFO] Brooklyn CM Integration Root ....................... SKIPPED
> > [INFO] Brooklyn Network Software Entities ................. SKIPPED
> > [INFO] Brooklyn OSGi Software Entities .................... SKIPPED
> > [INFO] Brooklyn Database Software Entities ................ SKIPPED
> > [INFO] Brooklyn Web App Software Entities ................. SKIPPED
> > [INFO] Brooklyn Messaging Software Entities ............... SKIPPED
> > [INFO] Brooklyn NoSQL Data Store Software Entities ........ SKIPPED
> > [INFO] Brooklyn Monitoring Software Entities .............. SKIPPED
> > [INFO] Brooklyn Web App Software Entities ................. SKIPPED
> > [INFO] Brooklyn QA ........................................ SKIPPED
> > [INFO] Brooklyn Examples Aggregator Project ............... SKIPPED
> > [INFO] Brooklyn Examples Aggregator Project - Webapps ..... SKIPPED
> > [INFO] hello-world-webapp Maven Webapp .................... SKIPPED
> > [INFO] hello-world-sql-webapp Maven Webapp ................ SKIPPED
> > [INFO] Brooklyn Simple Web Cluster Example ................ SKIPPED
> > [INFO] Brooklyn Library Karaf integration ................. SKIPPED
> > [INFO] Brooklyn Library Catalog ........................... SKIPPED
> > [INFO] Brooklyn Library Karaf Features .................... SKIPPED
> > [INFO] Brooklyn Client .................................... SKIPPED
> > [INFO] Brooklyn Client Command Line Interface ............. SKIPPED
> > [INFO] Brooklyn REST java Client .......................... SKIPPED
> > [INFO] Brooklyn Downstream Project Parent ................. SKIPPED
> > [INFO] Brooklyn Dist Root ................................. SKIPPED
> > [INFO] Brooklyn All Things ................................ SKIPPED
> > [INFO] Brooklyn Distribution .............................. SKIPPED
> > [INFO] Brooklyn Karaf Distribution Parent ................. SKIPPED
> > [INFO] Brooklyn Karaf Server Configuration ................ SKIPPED
> > [INFO] Brooklyn Dist Karaf Features ....................... SKIPPED
> > [INFO] Brooklyn Karaf Distribution ........................ SKIPPED
> > [INFO] Brooklyn Karaf pax-exam itest ...................... SKIPPED
> > [INFO] Brooklyn Vagrant Getting Started Environment ....... SKIPPED
> > [INFO] Brooklyn Quick-Start Project Archetype ............. SKIPPED
> > [INFO] Brooklyn Shared Package Files ...................... SKIPPED
> > [INFO] Brooklyn RPM Package ............................... SKIPPED
> > [INFO] Brooklyn DEB Package ............................... SKIPPED
> > [INFO] Brooklyn Root ...................................... SKIPPED
> > [INFO]
> > ------------------------------------------------------------------------
> > [INFO] BUILD FAILURE
> > [INFO]
> > ------------------------------------------------------------------------
> > [INFO] Total time: 11:18 min
> > [INFO] Finished at: 2018-04-10T09:21:40Z
> > [INFO] Final Memory: 128M/940M
> > [INFO]
> > ------------------------------------------------------------------------
> > [ERROR] Failed to execute goal
> > org.apache.maven.plugins:maven-surefire-plugin:2.19.1:test
> (default-test)
> > on project brooklyn-camp: There are test failures.
> > [ERROR]
> > [ERROR] Please refer to
> > /usr/build/brooklyn-server/camp/camp-brooklyn/target/surefire-reports
> for
> > the individual test results.
> > [ERROR] -> [Help 1]
> > [ERROR]
> > [ERROR] To see the full stack trace of the errors, re-run Maven with the
> > -e switch.
> > [ERROR] Re-run Maven using the -X switch to enable full debug logging.
> > [ERROR]
> > [ERROR] For more information about the errors and possible solutions,
> > please read the following articles:
> > [ERROR] [Help 1]
> > http://cwiki.apache.org/confluence/display/MAVEN/MojoFailureException
> > [ERROR]
> > [ERROR] After correcting the problems, you can resume the build with the
> > command
> > [ERROR] mvn <goals> -rf :brooklyn-camp
> > Build step 'Execute shell' marked build as failure
> > Recording test results
> > TestNG Reports Processing: START
> > Looking for TestNG results report in workspace using pattern:
> > **/testng-results.xml
> > testng-results.xml was last modified before this build started. Ignoring
> > it.
> > testng-results.xml was last modified before this build started. Ignoring
> > it.
> > testng-results.xml was last modified before this build started. Ignoring
> > it.
> > testng-results.xml was last modified before this build started. Ignoring
> > it.
> > testng-results.xml was last modified before this build started. Ignoring
> > it.
> > testng-results.xml was last modified before this build started. Ignoring
> > it.
> > testng-results.xml was last modified before this build started. Ignoring
> > it.
> > testng-results.xml was last modified before this build started. Ignoring
> > it.
> > testng-results.xml was last modified before this build started. Ignoring
> > it.
> > testng-results.xml was last modified before this build started. Ignoring
> > it.
> > testng-results.xml was last modified before this build started. Ignoring
> > it.
> > testng-results.xml was last modified before this build started. Ignoring
> > it.
> > testng-results.xml was last modified before this build started. Ignoring
> > it.
> > testng-results.xml was last modified before this build started. Ignoring
> > it.
> > testng-results.xml was last modified before this build started. Ignoring
> > it.
> > testng-results.xml was last modified before this build started. Ignoring
> > it.
> > testng-results.xml was last modified before this build started. Ignoring
> > it.
> > testng-results.xml was last modified before this build started. Ignoring
> > it.
> > testng-results.xml was last modified before this build started. Ignoring
> > it.
> > testng-results.xml was last modified before this build started. Ignoring
> > it.
> > testng-results.xml was last modified before this build started. Ignoring
> > it.
> > testng-results.xml was last modified before this build started. Ignoring
> > it.
> > testng-results.xml was last modified before this build started. Ignoring
> > it.
> > Saving reports...
> > Processing
> > '/x1/jenkins/jenkins-home/jobs/brooklyn-master-build-
> docker/builds/344/testng/testng-results-1.xml'
> > Processing
> > '/x1/jenkins/jenkins-home/jobs/brooklyn-master-build-
> docker/builds/344/testng/testng-results-10.xml'
> > Processing
> > '/x1/jenkins/jenkins-home/jobs/brooklyn-master-build-
> docker/builds/344/testng/testng-results-11.xml'
> > Processing
> > '/x1/jenkins/jenkins-home/jobs/brooklyn-master-build-
> docker/builds/344/testng/testng-results-2.xml'
> > Processing
> > '/x1/jenkins/jenkins-home/jobs/brooklyn-master-build-
> docker/builds/344/testng/testng-results-3.xml'
> > Processing
> > '/x1/jenkins/jenkins-home/jobs/brooklyn-master-build-
> docker/builds/344/testng/testng-results-4.xml'
> > Processing
> > '/x1/jenkins/jenkins-home/jobs/brooklyn-master-build-
> docker/builds/344/testng/testng-results-5.xml'
> > Processing
> > '/x1/jenkins/jenkins-home/jobs/brooklyn-master-build-
> docker/builds/344/testng/testng-results-6.xml'
> > Processing
> > '/x1/jenkins/jenkins-home/jobs/brooklyn-master-build-
> docker/builds/344/testng/testng-results-7.xml'
> > Processing
> > '/x1/jenkins/jenkins-home/jobs/brooklyn-master-build-
> docker/builds/344/testng/testng-results-8.xml'
> > Processing
> > '/x1/jenkins/jenkins-home/jobs/brooklyn-master-build-
> docker/builds/344/testng/testng-results-9.xml'
> > Processing
> > '/x1/jenkins/jenkins-home/jobs/brooklyn-master-build-
> docker/builds/344/testng/testng-results.xml'
> > 0.023223% of tests failed, which exceeded threshold of 0%. Marking build
> > as UNSTABLE
> > TestNG Reports Processing: FINISH
> >
>
Re: Build failed in Jenkins: brooklyn-master-build-docker #344
Posted by Joel Gil León <jo...@gil.com>.
unsubscribe
On Tue, Apr 10, 2018 at 12:22 PM Apache Jenkins Server <
jenkins@builds.apache.org> wrote:
> See <
> https://builds.apache.org/job/brooklyn-master-build-docker/344/display/redirect
> >
>
> ------------------------------------------
> [...truncated 7.26 MB...]
> at
> org.apache.brooklyn.core.test.entity.LocalManagementContextForTests.<init>(LocalManagementContextForTests.java:45)
> at
> org.apache.brooklyn.core.test.entity.LocalManagementContextForTests$Builder.build(LocalManagementContextForTests.java:185)
> at
> org.apache.brooklyn.camp.brooklyn.AbstractYamlTest.newTestManagementContext(AbstractYamlTest.java:117)
> at
> org.apache.brooklyn.camp.brooklyn.AbstractYamlTest$1.newMgmtContext(AbstractYamlTest.java:103)
> at
> org.apache.brooklyn.camp.brooklyn.BrooklynCampPlatformLauncherAbstract.launch(BrooklynCampPlatformLauncherAbstract.java:48)
> at
> org.apache.brooklyn.camp.brooklyn.AbstractYamlTest.setUpPlatform(AbstractYamlTest.java:106)
> at
> org.apache.brooklyn.camp.brooklyn.AbstractYamlTest.setUp(AbstractYamlTest.java:95)
> at sun.reflect.GeneratedMethodAccessor24.invoke(Unknown Source)
> at
> sun.reflect.DelegatingMethodAccessorImpl.invoke(DelegatingMethodAccessorImpl.java:43)
> at java.lang.reflect.Method.invoke(Method.java:498)
> at
> org.testng.internal.MethodInvocationHelper.invokeMethod(MethodInvocationHelper.java:104)
> at
> org.testng.internal.Invoker.invokeConfigurationMethod(Invoker.java:515)
> at
> org.testng.internal.Invoker.invokeConfigurations(Invoker.java:217)
> at org.testng.internal.Invoker.invokeMethod(Invoker.java:590)
> at org.testng.internal.Invoker.invokeTestMethod(Invoker.java:851)
> at org.testng.internal.Invoker.invokeTestMethods(Invoker.java:1177)
> at
> org.testng.internal.TestMethodWorker.invokeTestMethods(TestMethodWorker.java:129)
> at
> org.testng.internal.TestMethodWorker.run(TestMethodWorker.java:112)
> at org.testng.TestRunner.privateRun(TestRunner.java:756)
> at org.testng.TestRunner.run(TestRunner.java:610)
> at org.testng.SuiteRunner.runTest(SuiteRunner.java:387)
> at org.testng.SuiteRunner.runSequentially(SuiteRunner.java:382)
> at org.testng.SuiteRunner.privateRun(SuiteRunner.java:340)
> at org.testng.SuiteRunner.run(SuiteRunner.java:289)
> at org.testng.SuiteRunnerWorker.runSuite(SuiteRunnerWorker.java:52)
> at org.testng.SuiteRunnerWorker.run(SuiteRunnerWorker.java:86)
> at org.testng.TestNG.runSuitesSequentially(TestNG.java:1293)
> at org.testng.TestNG.runSuitesLocally(TestNG.java:1218)
> at org.testng.TestNG.runSuites(TestNG.java:1133)
> at org.testng.TestNG.run(TestNG.java:1104)
> at
> org.apache.maven.surefire.testng.TestNGExecutor.run(TestNGExecutor.java:132)
> at
> org.apache.maven.surefire.testng.TestNGDirectoryTestSuite.executeMulti(TestNGDirectoryTestSuite.java:193)
> at
> org.apache.maven.surefire.testng.TestNGDirectoryTestSuite.execute(TestNGDirectoryTestSuite.java:94)
> at
> org.apache.maven.surefire.testng.TestNGProvider.invoke(TestNGProvider.java:147)
> at
> org.apache.maven.surefire.booter.ForkedBooter.invokeProviderInSameClassLoader(ForkedBooter.java:290)
> at
> org.apache.maven.surefire.booter.ForkedBooter.runSuitesInProcess(ForkedBooter.java:242)
> at
> org.apache.maven.surefire.booter.ForkedBooter.main(ForkedBooter.java:121)
>
> 2018-04-10 09:21:39,388 WARN - Management Context
> LocalManagementContext[?-WoqhFMe5] running, creation stacktrace:
> java.lang.Throwable: for construction stacktrace
> at
> org.apache.brooklyn.core.mgmt.internal.LocalManagementContext.<init>(LocalManagementContext.java:141)
> at
> org.apache.brooklyn.core.mgmt.internal.LocalManagementContext.<init>(LocalManagementContext.java:163)
> at
> org.apache.brooklyn.core.mgmt.internal.LocalManagementContext.<init>(LocalManagementContext.java:159)
> at
> org.apache.brooklyn.core.test.entity.LocalManagementContextForTests.<init>(LocalManagementContextForTests.java:45)
> at
> org.apache.brooklyn.core.test.entity.LocalManagementContextForTests$Builder.build(LocalManagementContextForTests.java:185)
> at
> org.apache.brooklyn.camp.brooklyn.AbstractYamlTest.newTestManagementContext(AbstractYamlTest.java:117)
> at
> org.apache.brooklyn.camp.brooklyn.AbstractYamlTest$1.newMgmtContext(AbstractYamlTest.java:103)
> at
> org.apache.brooklyn.camp.brooklyn.BrooklynCampPlatformLauncherAbstract.launch(BrooklynCampPlatformLauncherAbstract.java:48)
> at
> org.apache.brooklyn.camp.brooklyn.AbstractYamlTest.setUpPlatform(AbstractYamlTest.java:106)
> at
> org.apache.brooklyn.camp.brooklyn.AbstractYamlTest.setUp(AbstractYamlTest.java:95)
> at sun.reflect.GeneratedMethodAccessor24.invoke(Unknown Source)
> at
> sun.reflect.DelegatingMethodAccessorImpl.invoke(DelegatingMethodAccessorImpl.java:43)
> at java.lang.reflect.Method.invoke(Method.java:498)
> at
> org.testng.internal.MethodInvocationHelper.invokeMethod(MethodInvocationHelper.java:104)
> at
> org.testng.internal.Invoker.invokeConfigurationMethod(Invoker.java:515)
> at
> org.testng.internal.Invoker.invokeConfigurations(Invoker.java:217)
> at org.testng.internal.Invoker.invokeMethod(Invoker.java:590)
> at org.testng.internal.Invoker.invokeTestMethod(Invoker.java:851)
> at org.testng.internal.Invoker.invokeTestMethods(Invoker.java:1177)
> at
> org.testng.internal.TestMethodWorker.invokeTestMethods(TestMethodWorker.java:129)
> at
> org.testng.internal.TestMethodWorker.run(TestMethodWorker.java:112)
> at org.testng.TestRunner.privateRun(TestRunner.java:756)
> at org.testng.TestRunner.run(TestRunner.java:610)
> at org.testng.SuiteRunner.runTest(SuiteRunner.java:387)
> at org.testng.SuiteRunner.runSequentially(SuiteRunner.java:382)
> at org.testng.SuiteRunner.privateRun(SuiteRunner.java:340)
> at org.testng.SuiteRunner.run(SuiteRunner.java:289)
> at org.testng.SuiteRunnerWorker.runSuite(SuiteRunnerWorker.java:52)
> at org.testng.SuiteRunnerWorker.run(SuiteRunnerWorker.java:86)
> at org.testng.TestNG.runSuitesSequentially(TestNG.java:1293)
> at org.testng.TestNG.runSuitesLocally(TestNG.java:1218)
> at org.testng.TestNG.runSuites(TestNG.java:1133)
> at org.testng.TestNG.run(TestNG.java:1104)
> at
> org.apache.maven.surefire.testng.TestNGExecutor.run(TestNGExecutor.java:132)
> at
> org.apache.maven.surefire.testng.TestNGDirectoryTestSuite.executeMulti(TestNGDirectoryTestSuite.java:193)
> at
> org.apache.maven.surefire.testng.TestNGDirectoryTestSuite.execute(TestNGDirectoryTestSuite.java:94)
> at
> org.apache.maven.surefire.testng.TestNGProvider.invoke(TestNGProvider.java:147)
> at
> org.apache.maven.surefire.booter.ForkedBooter.invokeProviderInSameClassLoader(ForkedBooter.java:290)
> at
> org.apache.maven.surefire.booter.ForkedBooter.runSuitesInProcess(ForkedBooter.java:242)
> at
> org.apache.maven.surefire.booter.ForkedBooter.main(ForkedBooter.java:121)
>
> 2018-04-10 09:21:39,389 INFO - BrooklynLeakListener.onFinish attempting
> to terminate all extant ManagementContexts: name=Surefire test;
> includedGroups=[]; excludedGroups=[Integration, Acceptance, Live,
> Live-sanity, WIP, Broken]; suiteName=Surefire suite;
> outDir=/usr/build/brooklyn-server/camp/camp-brooklyn/target/surefire-reports/Surefire
> suite: 4 ManagementContexts terminated
> 2018-04-10 09:21:39,390 INFO - TESTNG
> ===============================================
> Surefire test
> Tests run: 796, Failures: 1, Skips: 0
> ===============================================
> Tests run: 796, Failures: 1, Errors: 0, Skipped: 0, Time elapsed: 166.254
> sec <<< FAILURE! - in TestSuite
> testAlternativeServiceUpPolling(org.apache.brooklyn.camp.brooklyn.VanillaSoftwareProcessYamlTest)
> Time elapsed: 30.327 sec <<< FAILURE!
> java.lang.AssertionError: failed succeeds-eventually, 75 attempts, 30000ms
> elapsed: AssertionError: actual=[starting, running]; expected=[created,
> starting, running]: lists don't have the same size expected [3] but found
> [2]
> at
> org.apache.brooklyn.camp.brooklyn.VanillaSoftwareProcessYamlTest.assertEventsEqualEventually(VanillaSoftwareProcessYamlTest.java:261)
> at
> org.apache.brooklyn.camp.brooklyn.VanillaSoftwareProcessYamlTest.testAlternativeServiceUpPolling(VanillaSoftwareProcessYamlTest.java:249)
> Caused by: java.lang.AssertionError: actual=[starting, running];
> expected=[created, starting, running]: lists don't have the same size
> expected [3] but found [2]
> at
> org.apache.brooklyn.camp.brooklyn.VanillaSoftwareProcessYamlTest.assertIterablesEqual(VanillaSoftwareProcessYamlTest.java:278)
> at
> org.apache.brooklyn.camp.brooklyn.VanillaSoftwareProcessYamlTest.access$100(VanillaSoftwareProcessYamlTest.java:64)
> at
> org.apache.brooklyn.camp.brooklyn.VanillaSoftwareProcessYamlTest.assertEventsEqualEventually(VanillaSoftwareProcessYamlTest.java:261)
> at
> org.apache.brooklyn.camp.brooklyn.VanillaSoftwareProcessYamlTest.testAlternativeServiceUpPolling(VanillaSoftwareProcessYamlTest.java:249)
>
>
> Results :
>
> Failed tests:
>
> VanillaSoftwareProcessYamlTest.testAlternativeServiceUpPolling:249->assertEventsEqualEventually:261
> failed succeeds-eventually, 75 attempts, 30000ms elapsed: AssertionError:
> actual=[starting, running]; expected=[created, starting, running]: lists
> don't have the same size expected [3] but found [2]
>
> Tests run: 796, Failures: 1, Errors: 0, Skipped: 0
>
> [INFO]
> ------------------------------------------------------------------------
> [INFO] Reactor Summary:
> [INFO]
> [INFO] Brooklyn REST JavaScript Web GUI ................... SUCCESS [
> 31.702 s]
> [INFO] Brooklyn Server Root ............................... SUCCESS [
> 0.145 s]
> [INFO] Brooklyn Parent Project ............................ SUCCESS [
> 2.759 s]
> [INFO] Brooklyn Test Support Utilities .................... SUCCESS [
> 3.979 s]
> [INFO] Brooklyn Logback Includable Configuration .......... SUCCESS [
> 0.445 s]
> [INFO] Brooklyn Common Utilities .......................... SUCCESS [
> 24.800 s]
> [INFO] Brooklyn API ....................................... SUCCESS [
> 1.858 s]
> [INFO] CAMP Server Parent Project ......................... SUCCESS [
> 0.279 s]
> [INFO] CAMP Base .......................................... SUCCESS [
> 3.029 s]
> [INFO] Brooklyn Test Support .............................. SUCCESS [
> 1.225 s]
> [INFO] Brooklyn REST Swagger Apidoc Utilities ............. SUCCESS [
> 1.116 s]
> [INFO] Brooklyn Logback Configuration ..................... SUCCESS [
> 0.209 s]
> [INFO] CAMP Server ........................................ SUCCESS [
> 5.473 s]
> [INFO] Brooklyn Felix Runtime ............................. SUCCESS [
> 2.805 s]
> [INFO] Brooklyn Groovy Utilities .......................... SUCCESS [
> 1.955 s]
> [INFO] Brooklyn Core ...................................... SUCCESS [03:33
> min]
> [INFO] Brooklyn Policies .................................. SUCCESS [
> 37.231 s]
> [INFO] Brooklyn WinRM Software Entities ................... SUCCESS [
> 10.748 s]
> [INFO] Brooklyn Secure JMXMP Agent ........................ SUCCESS [
> 8.968 s]
> [INFO] Brooklyn JMX RMI Agent ............................. SUCCESS [
> 0.608 s]
> [INFO] Brooklyn Jclouds Location Targets .................. SUCCESS [01:00
> min]
> [INFO] Brooklyn Software Base ............................. SUCCESS [01:26
> min]
> [INFO] Brooklyn CAMP ...................................... FAILURE [02:54
> min]
> [INFO] Brooklyn Launcher Common ........................... SKIPPED
> [INFO] Brooklyn REST API .................................. SKIPPED
> [INFO] Brooklyn REST Resources ............................ SKIPPED
> [INFO] Brooklyn REST Server ............................... SKIPPED
> [INFO] Brooklyn Launcher .................................. SKIPPED
> [INFO] Brooklyn Container Location Targets ................ SKIPPED
> [INFO] Brooklyn Command Line Interface .................... SKIPPED
> [INFO] Brooklyn Test Framework ............................ SKIPPED
> [INFO] Brooklyn OSGi init ................................. SKIPPED
> [INFO] Brooklyn OSGi start ................................ SKIPPED
> [INFO] Brooklyn Karaf ..................................... SKIPPED
> [INFO] Jetty config fragment .............................. SKIPPED
> [INFO] Apache Http Component extension .................... SKIPPED
> [INFO] Brooklyn Karaf Features ............................ SKIPPED
> [INFO] Brooklyn Karaf Shell Commands ...................... SKIPPED
> [INFO] Brooklyn Library Root .............................. SKIPPED
> [INFO] Brooklyn CM Chef ................................... SKIPPED
> [INFO] Brooklyn CM SaltStack .............................. SKIPPED
> [INFO] Brooklyn CM Ansible ................................ SKIPPED
> [INFO] Brooklyn CM Integration Root ....................... SKIPPED
> [INFO] Brooklyn Network Software Entities ................. SKIPPED
> [INFO] Brooklyn OSGi Software Entities .................... SKIPPED
> [INFO] Brooklyn Database Software Entities ................ SKIPPED
> [INFO] Brooklyn Web App Software Entities ................. SKIPPED
> [INFO] Brooklyn Messaging Software Entities ............... SKIPPED
> [INFO] Brooklyn NoSQL Data Store Software Entities ........ SKIPPED
> [INFO] Brooklyn Monitoring Software Entities .............. SKIPPED
> [INFO] Brooklyn Web App Software Entities ................. SKIPPED
> [INFO] Brooklyn QA ........................................ SKIPPED
> [INFO] Brooklyn Examples Aggregator Project ............... SKIPPED
> [INFO] Brooklyn Examples Aggregator Project - Webapps ..... SKIPPED
> [INFO] hello-world-webapp Maven Webapp .................... SKIPPED
> [INFO] hello-world-sql-webapp Maven Webapp ................ SKIPPED
> [INFO] Brooklyn Simple Web Cluster Example ................ SKIPPED
> [INFO] Brooklyn Library Karaf integration ................. SKIPPED
> [INFO] Brooklyn Library Catalog ........................... SKIPPED
> [INFO] Brooklyn Library Karaf Features .................... SKIPPED
> [INFO] Brooklyn Client .................................... SKIPPED
> [INFO] Brooklyn Client Command Line Interface ............. SKIPPED
> [INFO] Brooklyn REST java Client .......................... SKIPPED
> [INFO] Brooklyn Downstream Project Parent ................. SKIPPED
> [INFO] Brooklyn Dist Root ................................. SKIPPED
> [INFO] Brooklyn All Things ................................ SKIPPED
> [INFO] Brooklyn Distribution .............................. SKIPPED
> [INFO] Brooklyn Karaf Distribution Parent ................. SKIPPED
> [INFO] Brooklyn Karaf Server Configuration ................ SKIPPED
> [INFO] Brooklyn Dist Karaf Features ....................... SKIPPED
> [INFO] Brooklyn Karaf Distribution ........................ SKIPPED
> [INFO] Brooklyn Karaf pax-exam itest ...................... SKIPPED
> [INFO] Brooklyn Vagrant Getting Started Environment ....... SKIPPED
> [INFO] Brooklyn Quick-Start Project Archetype ............. SKIPPED
> [INFO] Brooklyn Shared Package Files ...................... SKIPPED
> [INFO] Brooklyn RPM Package ............................... SKIPPED
> [INFO] Brooklyn DEB Package ............................... SKIPPED
> [INFO] Brooklyn Root ...................................... SKIPPED
> [INFO]
> ------------------------------------------------------------------------
> [INFO] BUILD FAILURE
> [INFO]
> ------------------------------------------------------------------------
> [INFO] Total time: 11:18 min
> [INFO] Finished at: 2018-04-10T09:21:40Z
> [INFO] Final Memory: 128M/940M
> [INFO]
> ------------------------------------------------------------------------
> [ERROR] Failed to execute goal
> org.apache.maven.plugins:maven-surefire-plugin:2.19.1:test (default-test)
> on project brooklyn-camp: There are test failures.
> [ERROR]
> [ERROR] Please refer to
> /usr/build/brooklyn-server/camp/camp-brooklyn/target/surefire-reports for
> the individual test results.
> [ERROR] -> [Help 1]
> [ERROR]
> [ERROR] To see the full stack trace of the errors, re-run Maven with the
> -e switch.
> [ERROR] Re-run Maven using the -X switch to enable full debug logging.
> [ERROR]
> [ERROR] For more information about the errors and possible solutions,
> please read the following articles:
> [ERROR] [Help 1]
> http://cwiki.apache.org/confluence/display/MAVEN/MojoFailureException
> [ERROR]
> [ERROR] After correcting the problems, you can resume the build with the
> command
> [ERROR] mvn <goals> -rf :brooklyn-camp
> Build step 'Execute shell' marked build as failure
> Recording test results
> TestNG Reports Processing: START
> Looking for TestNG results report in workspace using pattern:
> **/testng-results.xml
> testng-results.xml was last modified before this build started. Ignoring
> it.
> testng-results.xml was last modified before this build started. Ignoring
> it.
> testng-results.xml was last modified before this build started. Ignoring
> it.
> testng-results.xml was last modified before this build started. Ignoring
> it.
> testng-results.xml was last modified before this build started. Ignoring
> it.
> testng-results.xml was last modified before this build started. Ignoring
> it.
> testng-results.xml was last modified before this build started. Ignoring
> it.
> testng-results.xml was last modified before this build started. Ignoring
> it.
> testng-results.xml was last modified before this build started. Ignoring
> it.
> testng-results.xml was last modified before this build started. Ignoring
> it.
> testng-results.xml was last modified before this build started. Ignoring
> it.
> testng-results.xml was last modified before this build started. Ignoring
> it.
> testng-results.xml was last modified before this build started. Ignoring
> it.
> testng-results.xml was last modified before this build started. Ignoring
> it.
> testng-results.xml was last modified before this build started. Ignoring
> it.
> testng-results.xml was last modified before this build started. Ignoring
> it.
> testng-results.xml was last modified before this build started. Ignoring
> it.
> testng-results.xml was last modified before this build started. Ignoring
> it.
> testng-results.xml was last modified before this build started. Ignoring
> it.
> testng-results.xml was last modified before this build started. Ignoring
> it.
> testng-results.xml was last modified before this build started. Ignoring
> it.
> testng-results.xml was last modified before this build started. Ignoring
> it.
> testng-results.xml was last modified before this build started. Ignoring
> it.
> Saving reports...
> Processing
> '/x1/jenkins/jenkins-home/jobs/brooklyn-master-build-docker/builds/344/testng/testng-results-1.xml'
> Processing
> '/x1/jenkins/jenkins-home/jobs/brooklyn-master-build-docker/builds/344/testng/testng-results-10.xml'
> Processing
> '/x1/jenkins/jenkins-home/jobs/brooklyn-master-build-docker/builds/344/testng/testng-results-11.xml'
> Processing
> '/x1/jenkins/jenkins-home/jobs/brooklyn-master-build-docker/builds/344/testng/testng-results-2.xml'
> Processing
> '/x1/jenkins/jenkins-home/jobs/brooklyn-master-build-docker/builds/344/testng/testng-results-3.xml'
> Processing
> '/x1/jenkins/jenkins-home/jobs/brooklyn-master-build-docker/builds/344/testng/testng-results-4.xml'
> Processing
> '/x1/jenkins/jenkins-home/jobs/brooklyn-master-build-docker/builds/344/testng/testng-results-5.xml'
> Processing
> '/x1/jenkins/jenkins-home/jobs/brooklyn-master-build-docker/builds/344/testng/testng-results-6.xml'
> Processing
> '/x1/jenkins/jenkins-home/jobs/brooklyn-master-build-docker/builds/344/testng/testng-results-7.xml'
> Processing
> '/x1/jenkins/jenkins-home/jobs/brooklyn-master-build-docker/builds/344/testng/testng-results-8.xml'
> Processing
> '/x1/jenkins/jenkins-home/jobs/brooklyn-master-build-docker/builds/344/testng/testng-results-9.xml'
> Processing
> '/x1/jenkins/jenkins-home/jobs/brooklyn-master-build-docker/builds/344/testng/testng-results.xml'
> 0.023223% of tests failed, which exceeded threshold of 0%. Marking build
> as UNSTABLE
> TestNG Reports Processing: FINISH
>
Build failed in Jenkins: brooklyn-master-build-docker #344
Posted by Apache Jenkins Server <je...@builds.apache.org>.
See <https://builds.apache.org/job/brooklyn-master-build-docker/344/display/redirect>
------------------------------------------
[...truncated 7.26 MB...]
at org.apache.brooklyn.core.test.entity.LocalManagementContextForTests.<init>(LocalManagementContextForTests.java:45)
at org.apache.brooklyn.core.test.entity.LocalManagementContextForTests$Builder.build(LocalManagementContextForTests.java:185)
at org.apache.brooklyn.camp.brooklyn.AbstractYamlTest.newTestManagementContext(AbstractYamlTest.java:117)
at org.apache.brooklyn.camp.brooklyn.AbstractYamlTest$1.newMgmtContext(AbstractYamlTest.java:103)
at org.apache.brooklyn.camp.brooklyn.BrooklynCampPlatformLauncherAbstract.launch(BrooklynCampPlatformLauncherAbstract.java:48)
at org.apache.brooklyn.camp.brooklyn.AbstractYamlTest.setUpPlatform(AbstractYamlTest.java:106)
at org.apache.brooklyn.camp.brooklyn.AbstractYamlTest.setUp(AbstractYamlTest.java:95)
at sun.reflect.GeneratedMethodAccessor24.invoke(Unknown Source)
at sun.reflect.DelegatingMethodAccessorImpl.invoke(DelegatingMethodAccessorImpl.java:43)
at java.lang.reflect.Method.invoke(Method.java:498)
at org.testng.internal.MethodInvocationHelper.invokeMethod(MethodInvocationHelper.java:104)
at org.testng.internal.Invoker.invokeConfigurationMethod(Invoker.java:515)
at org.testng.internal.Invoker.invokeConfigurations(Invoker.java:217)
at org.testng.internal.Invoker.invokeMethod(Invoker.java:590)
at org.testng.internal.Invoker.invokeTestMethod(Invoker.java:851)
at org.testng.internal.Invoker.invokeTestMethods(Invoker.java:1177)
at org.testng.internal.TestMethodWorker.invokeTestMethods(TestMethodWorker.java:129)
at org.testng.internal.TestMethodWorker.run(TestMethodWorker.java:112)
at org.testng.TestRunner.privateRun(TestRunner.java:756)
at org.testng.TestRunner.run(TestRunner.java:610)
at org.testng.SuiteRunner.runTest(SuiteRunner.java:387)
at org.testng.SuiteRunner.runSequentially(SuiteRunner.java:382)
at org.testng.SuiteRunner.privateRun(SuiteRunner.java:340)
at org.testng.SuiteRunner.run(SuiteRunner.java:289)
at org.testng.SuiteRunnerWorker.runSuite(SuiteRunnerWorker.java:52)
at org.testng.SuiteRunnerWorker.run(SuiteRunnerWorker.java:86)
at org.testng.TestNG.runSuitesSequentially(TestNG.java:1293)
at org.testng.TestNG.runSuitesLocally(TestNG.java:1218)
at org.testng.TestNG.runSuites(TestNG.java:1133)
at org.testng.TestNG.run(TestNG.java:1104)
at org.apache.maven.surefire.testng.TestNGExecutor.run(TestNGExecutor.java:132)
at org.apache.maven.surefire.testng.TestNGDirectoryTestSuite.executeMulti(TestNGDirectoryTestSuite.java:193)
at org.apache.maven.surefire.testng.TestNGDirectoryTestSuite.execute(TestNGDirectoryTestSuite.java:94)
at org.apache.maven.surefire.testng.TestNGProvider.invoke(TestNGProvider.java:147)
at org.apache.maven.surefire.booter.ForkedBooter.invokeProviderInSameClassLoader(ForkedBooter.java:290)
at org.apache.maven.surefire.booter.ForkedBooter.runSuitesInProcess(ForkedBooter.java:242)
at org.apache.maven.surefire.booter.ForkedBooter.main(ForkedBooter.java:121)
2018-04-10 09:21:39,388 WARN - Management Context LocalManagementContext[?-WoqhFMe5] running, creation stacktrace:
java.lang.Throwable: for construction stacktrace
at org.apache.brooklyn.core.mgmt.internal.LocalManagementContext.<init>(LocalManagementContext.java:141)
at org.apache.brooklyn.core.mgmt.internal.LocalManagementContext.<init>(LocalManagementContext.java:163)
at org.apache.brooklyn.core.mgmt.internal.LocalManagementContext.<init>(LocalManagementContext.java:159)
at org.apache.brooklyn.core.test.entity.LocalManagementContextForTests.<init>(LocalManagementContextForTests.java:45)
at org.apache.brooklyn.core.test.entity.LocalManagementContextForTests$Builder.build(LocalManagementContextForTests.java:185)
at org.apache.brooklyn.camp.brooklyn.AbstractYamlTest.newTestManagementContext(AbstractYamlTest.java:117)
at org.apache.brooklyn.camp.brooklyn.AbstractYamlTest$1.newMgmtContext(AbstractYamlTest.java:103)
at org.apache.brooklyn.camp.brooklyn.BrooklynCampPlatformLauncherAbstract.launch(BrooklynCampPlatformLauncherAbstract.java:48)
at org.apache.brooklyn.camp.brooklyn.AbstractYamlTest.setUpPlatform(AbstractYamlTest.java:106)
at org.apache.brooklyn.camp.brooklyn.AbstractYamlTest.setUp(AbstractYamlTest.java:95)
at sun.reflect.GeneratedMethodAccessor24.invoke(Unknown Source)
at sun.reflect.DelegatingMethodAccessorImpl.invoke(DelegatingMethodAccessorImpl.java:43)
at java.lang.reflect.Method.invoke(Method.java:498)
at org.testng.internal.MethodInvocationHelper.invokeMethod(MethodInvocationHelper.java:104)
at org.testng.internal.Invoker.invokeConfigurationMethod(Invoker.java:515)
at org.testng.internal.Invoker.invokeConfigurations(Invoker.java:217)
at org.testng.internal.Invoker.invokeMethod(Invoker.java:590)
at org.testng.internal.Invoker.invokeTestMethod(Invoker.java:851)
at org.testng.internal.Invoker.invokeTestMethods(Invoker.java:1177)
at org.testng.internal.TestMethodWorker.invokeTestMethods(TestMethodWorker.java:129)
at org.testng.internal.TestMethodWorker.run(TestMethodWorker.java:112)
at org.testng.TestRunner.privateRun(TestRunner.java:756)
at org.testng.TestRunner.run(TestRunner.java:610)
at org.testng.SuiteRunner.runTest(SuiteRunner.java:387)
at org.testng.SuiteRunner.runSequentially(SuiteRunner.java:382)
at org.testng.SuiteRunner.privateRun(SuiteRunner.java:340)
at org.testng.SuiteRunner.run(SuiteRunner.java:289)
at org.testng.SuiteRunnerWorker.runSuite(SuiteRunnerWorker.java:52)
at org.testng.SuiteRunnerWorker.run(SuiteRunnerWorker.java:86)
at org.testng.TestNG.runSuitesSequentially(TestNG.java:1293)
at org.testng.TestNG.runSuitesLocally(TestNG.java:1218)
at org.testng.TestNG.runSuites(TestNG.java:1133)
at org.testng.TestNG.run(TestNG.java:1104)
at org.apache.maven.surefire.testng.TestNGExecutor.run(TestNGExecutor.java:132)
at org.apache.maven.surefire.testng.TestNGDirectoryTestSuite.executeMulti(TestNGDirectoryTestSuite.java:193)
at org.apache.maven.surefire.testng.TestNGDirectoryTestSuite.execute(TestNGDirectoryTestSuite.java:94)
at org.apache.maven.surefire.testng.TestNGProvider.invoke(TestNGProvider.java:147)
at org.apache.maven.surefire.booter.ForkedBooter.invokeProviderInSameClassLoader(ForkedBooter.java:290)
at org.apache.maven.surefire.booter.ForkedBooter.runSuitesInProcess(ForkedBooter.java:242)
at org.apache.maven.surefire.booter.ForkedBooter.main(ForkedBooter.java:121)
2018-04-10 09:21:39,389 INFO - BrooklynLeakListener.onFinish attempting to terminate all extant ManagementContexts: name=Surefire test; includedGroups=[]; excludedGroups=[Integration, Acceptance, Live, Live-sanity, WIP, Broken]; suiteName=Surefire suite; outDir=/usr/build/brooklyn-server/camp/camp-brooklyn/target/surefire-reports/Surefire suite: 4 ManagementContexts terminated
2018-04-10 09:21:39,390 INFO - TESTNG
===============================================
Surefire test
Tests run: 796, Failures: 1, Skips: 0
===============================================
Tests run: 796, Failures: 1, Errors: 0, Skipped: 0, Time elapsed: 166.254 sec <<< FAILURE! - in TestSuite
testAlternativeServiceUpPolling(org.apache.brooklyn.camp.brooklyn.VanillaSoftwareProcessYamlTest) Time elapsed: 30.327 sec <<< FAILURE!
java.lang.AssertionError: failed succeeds-eventually, 75 attempts, 30000ms elapsed: AssertionError: actual=[starting, running]; expected=[created, starting, running]: lists don't have the same size expected [3] but found [2]
at org.apache.brooklyn.camp.brooklyn.VanillaSoftwareProcessYamlTest.assertEventsEqualEventually(VanillaSoftwareProcessYamlTest.java:261)
at org.apache.brooklyn.camp.brooklyn.VanillaSoftwareProcessYamlTest.testAlternativeServiceUpPolling(VanillaSoftwareProcessYamlTest.java:249)
Caused by: java.lang.AssertionError: actual=[starting, running]; expected=[created, starting, running]: lists don't have the same size expected [3] but found [2]
at org.apache.brooklyn.camp.brooklyn.VanillaSoftwareProcessYamlTest.assertIterablesEqual(VanillaSoftwareProcessYamlTest.java:278)
at org.apache.brooklyn.camp.brooklyn.VanillaSoftwareProcessYamlTest.access$100(VanillaSoftwareProcessYamlTest.java:64)
at org.apache.brooklyn.camp.brooklyn.VanillaSoftwareProcessYamlTest.assertEventsEqualEventually(VanillaSoftwareProcessYamlTest.java:261)
at org.apache.brooklyn.camp.brooklyn.VanillaSoftwareProcessYamlTest.testAlternativeServiceUpPolling(VanillaSoftwareProcessYamlTest.java:249)
Results :
Failed tests:
VanillaSoftwareProcessYamlTest.testAlternativeServiceUpPolling:249->assertEventsEqualEventually:261 failed succeeds-eventually, 75 attempts, 30000ms elapsed: AssertionError: actual=[starting, running]; expected=[created, starting, running]: lists don't have the same size expected [3] but found [2]
Tests run: 796, Failures: 1, Errors: 0, Skipped: 0
[INFO] ------------------------------------------------------------------------
[INFO] Reactor Summary:
[INFO]
[INFO] Brooklyn REST JavaScript Web GUI ................... SUCCESS [ 31.702 s]
[INFO] Brooklyn Server Root ............................... SUCCESS [ 0.145 s]
[INFO] Brooklyn Parent Project ............................ SUCCESS [ 2.759 s]
[INFO] Brooklyn Test Support Utilities .................... SUCCESS [ 3.979 s]
[INFO] Brooklyn Logback Includable Configuration .......... SUCCESS [ 0.445 s]
[INFO] Brooklyn Common Utilities .......................... SUCCESS [ 24.800 s]
[INFO] Brooklyn API ....................................... SUCCESS [ 1.858 s]
[INFO] CAMP Server Parent Project ......................... SUCCESS [ 0.279 s]
[INFO] CAMP Base .......................................... SUCCESS [ 3.029 s]
[INFO] Brooklyn Test Support .............................. SUCCESS [ 1.225 s]
[INFO] Brooklyn REST Swagger Apidoc Utilities ............. SUCCESS [ 1.116 s]
[INFO] Brooklyn Logback Configuration ..................... SUCCESS [ 0.209 s]
[INFO] CAMP Server ........................................ SUCCESS [ 5.473 s]
[INFO] Brooklyn Felix Runtime ............................. SUCCESS [ 2.805 s]
[INFO] Brooklyn Groovy Utilities .......................... SUCCESS [ 1.955 s]
[INFO] Brooklyn Core ...................................... SUCCESS [03:33 min]
[INFO] Brooklyn Policies .................................. SUCCESS [ 37.231 s]
[INFO] Brooklyn WinRM Software Entities ................... SUCCESS [ 10.748 s]
[INFO] Brooklyn Secure JMXMP Agent ........................ SUCCESS [ 8.968 s]
[INFO] Brooklyn JMX RMI Agent ............................. SUCCESS [ 0.608 s]
[INFO] Brooklyn Jclouds Location Targets .................. SUCCESS [01:00 min]
[INFO] Brooklyn Software Base ............................. SUCCESS [01:26 min]
[INFO] Brooklyn CAMP ...................................... FAILURE [02:54 min]
[INFO] Brooklyn Launcher Common ........................... SKIPPED
[INFO] Brooklyn REST API .................................. SKIPPED
[INFO] Brooklyn REST Resources ............................ SKIPPED
[INFO] Brooklyn REST Server ............................... SKIPPED
[INFO] Brooklyn Launcher .................................. SKIPPED
[INFO] Brooklyn Container Location Targets ................ SKIPPED
[INFO] Brooklyn Command Line Interface .................... SKIPPED
[INFO] Brooklyn Test Framework ............................ SKIPPED
[INFO] Brooklyn OSGi init ................................. SKIPPED
[INFO] Brooklyn OSGi start ................................ SKIPPED
[INFO] Brooklyn Karaf ..................................... SKIPPED
[INFO] Jetty config fragment .............................. SKIPPED
[INFO] Apache Http Component extension .................... SKIPPED
[INFO] Brooklyn Karaf Features ............................ SKIPPED
[INFO] Brooklyn Karaf Shell Commands ...................... SKIPPED
[INFO] Brooklyn Library Root .............................. SKIPPED
[INFO] Brooklyn CM Chef ................................... SKIPPED
[INFO] Brooklyn CM SaltStack .............................. SKIPPED
[INFO] Brooklyn CM Ansible ................................ SKIPPED
[INFO] Brooklyn CM Integration Root ....................... SKIPPED
[INFO] Brooklyn Network Software Entities ................. SKIPPED
[INFO] Brooklyn OSGi Software Entities .................... SKIPPED
[INFO] Brooklyn Database Software Entities ................ SKIPPED
[INFO] Brooklyn Web App Software Entities ................. SKIPPED
[INFO] Brooklyn Messaging Software Entities ............... SKIPPED
[INFO] Brooklyn NoSQL Data Store Software Entities ........ SKIPPED
[INFO] Brooklyn Monitoring Software Entities .............. SKIPPED
[INFO] Brooklyn Web App Software Entities ................. SKIPPED
[INFO] Brooklyn QA ........................................ SKIPPED
[INFO] Brooklyn Examples Aggregator Project ............... SKIPPED
[INFO] Brooklyn Examples Aggregator Project - Webapps ..... SKIPPED
[INFO] hello-world-webapp Maven Webapp .................... SKIPPED
[INFO] hello-world-sql-webapp Maven Webapp ................ SKIPPED
[INFO] Brooklyn Simple Web Cluster Example ................ SKIPPED
[INFO] Brooklyn Library Karaf integration ................. SKIPPED
[INFO] Brooklyn Library Catalog ........................... SKIPPED
[INFO] Brooklyn Library Karaf Features .................... SKIPPED
[INFO] Brooklyn Client .................................... SKIPPED
[INFO] Brooklyn Client Command Line Interface ............. SKIPPED
[INFO] Brooklyn REST java Client .......................... SKIPPED
[INFO] Brooklyn Downstream Project Parent ................. SKIPPED
[INFO] Brooklyn Dist Root ................................. SKIPPED
[INFO] Brooklyn All Things ................................ SKIPPED
[INFO] Brooklyn Distribution .............................. SKIPPED
[INFO] Brooklyn Karaf Distribution Parent ................. SKIPPED
[INFO] Brooklyn Karaf Server Configuration ................ SKIPPED
[INFO] Brooklyn Dist Karaf Features ....................... SKIPPED
[INFO] Brooklyn Karaf Distribution ........................ SKIPPED
[INFO] Brooklyn Karaf pax-exam itest ...................... SKIPPED
[INFO] Brooklyn Vagrant Getting Started Environment ....... SKIPPED
[INFO] Brooklyn Quick-Start Project Archetype ............. SKIPPED
[INFO] Brooklyn Shared Package Files ...................... SKIPPED
[INFO] Brooklyn RPM Package ............................... SKIPPED
[INFO] Brooklyn DEB Package ............................... SKIPPED
[INFO] Brooklyn Root ...................................... SKIPPED
[INFO] ------------------------------------------------------------------------
[INFO] BUILD FAILURE
[INFO] ------------------------------------------------------------------------
[INFO] Total time: 11:18 min
[INFO] Finished at: 2018-04-10T09:21:40Z
[INFO] Final Memory: 128M/940M
[INFO] ------------------------------------------------------------------------
[ERROR] Failed to execute goal org.apache.maven.plugins:maven-surefire-plugin:2.19.1:test (default-test) on project brooklyn-camp: There are test failures.
[ERROR]
[ERROR] Please refer to /usr/build/brooklyn-server/camp/camp-brooklyn/target/surefire-reports for the individual test results.
[ERROR] -> [Help 1]
[ERROR]
[ERROR] To see the full stack trace of the errors, re-run Maven with the -e switch.
[ERROR] Re-run Maven using the -X switch to enable full debug logging.
[ERROR]
[ERROR] For more information about the errors and possible solutions, please read the following articles:
[ERROR] [Help 1] http://cwiki.apache.org/confluence/display/MAVEN/MojoFailureException
[ERROR]
[ERROR] After correcting the problems, you can resume the build with the command
[ERROR] mvn <goals> -rf :brooklyn-camp
Build step 'Execute shell' marked build as failure
Recording test results
TestNG Reports Processing: START
Looking for TestNG results report in workspace using pattern: **/testng-results.xml
testng-results.xml was last modified before this build started. Ignoring it.
testng-results.xml was last modified before this build started. Ignoring it.
testng-results.xml was last modified before this build started. Ignoring it.
testng-results.xml was last modified before this build started. Ignoring it.
testng-results.xml was last modified before this build started. Ignoring it.
testng-results.xml was last modified before this build started. Ignoring it.
testng-results.xml was last modified before this build started. Ignoring it.
testng-results.xml was last modified before this build started. Ignoring it.
testng-results.xml was last modified before this build started. Ignoring it.
testng-results.xml was last modified before this build started. Ignoring it.
testng-results.xml was last modified before this build started. Ignoring it.
testng-results.xml was last modified before this build started. Ignoring it.
testng-results.xml was last modified before this build started. Ignoring it.
testng-results.xml was last modified before this build started. Ignoring it.
testng-results.xml was last modified before this build started. Ignoring it.
testng-results.xml was last modified before this build started. Ignoring it.
testng-results.xml was last modified before this build started. Ignoring it.
testng-results.xml was last modified before this build started. Ignoring it.
testng-results.xml was last modified before this build started. Ignoring it.
testng-results.xml was last modified before this build started. Ignoring it.
testng-results.xml was last modified before this build started. Ignoring it.
testng-results.xml was last modified before this build started. Ignoring it.
testng-results.xml was last modified before this build started. Ignoring it.
Saving reports...
Processing '/x1/jenkins/jenkins-home/jobs/brooklyn-master-build-docker/builds/344/testng/testng-results-1.xml'
Processing '/x1/jenkins/jenkins-home/jobs/brooklyn-master-build-docker/builds/344/testng/testng-results-10.xml'
Processing '/x1/jenkins/jenkins-home/jobs/brooklyn-master-build-docker/builds/344/testng/testng-results-11.xml'
Processing '/x1/jenkins/jenkins-home/jobs/brooklyn-master-build-docker/builds/344/testng/testng-results-2.xml'
Processing '/x1/jenkins/jenkins-home/jobs/brooklyn-master-build-docker/builds/344/testng/testng-results-3.xml'
Processing '/x1/jenkins/jenkins-home/jobs/brooklyn-master-build-docker/builds/344/testng/testng-results-4.xml'
Processing '/x1/jenkins/jenkins-home/jobs/brooklyn-master-build-docker/builds/344/testng/testng-results-5.xml'
Processing '/x1/jenkins/jenkins-home/jobs/brooklyn-master-build-docker/builds/344/testng/testng-results-6.xml'
Processing '/x1/jenkins/jenkins-home/jobs/brooklyn-master-build-docker/builds/344/testng/testng-results-7.xml'
Processing '/x1/jenkins/jenkins-home/jobs/brooklyn-master-build-docker/builds/344/testng/testng-results-8.xml'
Processing '/x1/jenkins/jenkins-home/jobs/brooklyn-master-build-docker/builds/344/testng/testng-results-9.xml'
Processing '/x1/jenkins/jenkins-home/jobs/brooklyn-master-build-docker/builds/344/testng/testng-results.xml'
0.023223% of tests failed, which exceeded threshold of 0%. Marking build as UNSTABLE
TestNG Reports Processing: FINISH