You are viewing a plain text version of this content. The canonical link for it is here.
Posted to yarn-dev@hadoop.apache.org by Apache Jenkins Server <je...@builds.apache.org> on 2014/06/30 22:00:57 UTC
Failed: YARN-2190 PreCommit Build #4148
Jira: https://issues.apache.org/jira/browse/YARN-2190
Build: https://builds.apache.org/job/PreCommit-YARN-Build/4148/
###################################################################################
########################## LAST 60 LINES OF THE CONSOLE ###########################
[...truncated 4054 lines...]
http://issues.apache.org/jira/secure/attachment/12653206/YARN-2190.2.patch
against trunk revision .
{color:green}+1 @author{color}. The patch does not contain any @author tags.
{color:green}+1 tests included{color}. The patch appears to include 2 new or modified test files.
{color:green}+1 javac{color}. The applied patch does not increase the total number of javac compiler warnings.
{color:green}+1 javadoc{color}. There were no new javadoc warning messages.
{color:green}+1 eclipse:eclipse{color}. The patch built with eclipse:eclipse.
{color:green}+1 findbugs{color}. The patch does not introduce any new Findbugs (version 1.3.9) warnings.
{color:green}+1 release audit{color}. The applied patch does not increase the total number of release audit warnings.
{color:red}-1 core tests{color}. The patch failed these unit tests in hadoop-common-project/hadoop-common hadoop-yarn-project/hadoop-yarn/hadoop-yarn-server/hadoop-yarn-server-nodemanager:
org.apache.hadoop.ha.TestZKFailoverControllerStress
{color:green}+1 contrib tests{color}. The patch passed contrib unit tests.
Test results: https://builds.apache.org/job/PreCommit-YARN-Build/4148//testReport/
Console output: https://builds.apache.org/job/PreCommit-YARN-Build/4148//console
This message is automatically generated.
======================================================================
======================================================================
Adding comment to Jira.
======================================================================
======================================================================
Comment added.
dbbbacd1b9ebac6e1f6d96b3657497cc4bd5f8f6 logged out
======================================================================
======================================================================
Finished build.
======================================================================
======================================================================
Build step 'Execute shell' marked build as failure
Archiving artifacts
Sending artifact delta relative to PreCommit-YARN-Build #4147
Archived 22 artifacts
Archive block size is 32768
Received 66 blocks and 6690305 bytes
Compression is 24.4%
Took 3.4 sec
[description-setter] Could not determine description.
Recording test results
Email was triggered for: Failure
Sending email for trigger: Failure
###################################################################################
############################## FAILED TESTS (if any) ##############################
1 tests failed.
REGRESSION: org.apache.hadoop.ha.TestZKFailoverControllerStress.testExpireBackAndForth
Error Message:
KeeperErrorCode = NoNode
Stack Trace:
org.apache.zookeeper.KeeperException$NoNodeException: KeeperErrorCode = NoNode
at org.apache.zookeeper.server.DataTree.getData(DataTree.java:648)
at org.apache.zookeeper.server.ZKDatabase.getData(ZKDatabase.java:371)
at org.apache.hadoop.ha.MiniZKFCCluster.expireActiveLockHolder(MiniZKFCCluster.java:199)
at org.apache.hadoop.ha.MiniZKFCCluster.expireAndVerifyFailover(MiniZKFCCluster.java:234)
at org.apache.hadoop.ha.TestZKFailoverControllerStress.testExpireBackAndForth(TestZKFailoverControllerStress.java:79)
Success: YARN-2022 PreCommit Build #4149
Posted by Apache Jenkins Server <je...@builds.apache.org>.
Jira: https://issues.apache.org/jira/browse/YARN-2022
Build: https://builds.apache.org/job/PreCommit-YARN-Build/4149/
###################################################################################
########################## LAST 60 LINES OF THE CONSOLE ###########################
[...truncated 3022 lines...]
{color:green}+1 overall{color}. Here are the results of testing the latest attachment
http://issues.apache.org/jira/secure/attachment/12653224/YARN-2022.9.patch
against trunk revision .
{color:green}+1 @author{color}. The patch does not contain any @author tags.
{color:green}+1 tests included{color}. The patch appears to include 3 new or modified test files.
{color:green}+1 javac{color}. The applied patch does not increase the total number of javac compiler warnings.
{color:green}+1 javadoc{color}. There were no new javadoc warning messages.
{color:green}+1 eclipse:eclipse{color}. The patch built with eclipse:eclipse.
{color:green}+1 findbugs{color}. The patch does not introduce any new Findbugs (version 1.3.9) warnings.
{color:green}+1 release audit{color}. The applied patch does not increase the total number of release audit warnings.
{color:green}+1 core tests{color}. The patch passed unit tests in hadoop-yarn-project/hadoop-yarn/hadoop-yarn-server/hadoop-yarn-server-resourcemanager.
{color:green}+1 contrib tests{color}. The patch passed contrib unit tests.
Test results: https://builds.apache.org/job/PreCommit-YARN-Build/4149//testReport/
Console output: https://builds.apache.org/job/PreCommit-YARN-Build/4149//console
This message is automatically generated.
======================================================================
======================================================================
Adding comment to Jira.
======================================================================
======================================================================
Comment added.
0bfd5e9650127b328d5f6a83cb5b1d34afc75797 logged out
======================================================================
======================================================================
Finished build.
======================================================================
======================================================================
Archiving artifacts
Sending artifact delta relative to PreCommit-YARN-Build #4147
Archived 17 artifacts
Archive block size is 32768
Received 220 blocks and 1130109 bytes
Compression is 86.4%
Took 1.7 sec
Description set: YARN-2022
Recording test results
Email was triggered for: Success
Sending email for trigger: Success
###################################################################################
############################## FAILED TESTS (if any) ##############################
All tests passed