You are viewing a plain text version of this content. The canonical link for it is here.
Posted to notifications@cxf.apache.org by Apache Jenkins Server <je...@builds.apache.org> on 2012/01/25 09:21:12 UTC
Build failed in Jenkins: CXF-2.5-deploy #7
See <https://builds.apache.org/job/CXF-2.5-deploy/7/changes>
Changes:
[sergeyb] Merged revisions 1235544 via svnmerge from
https://svn.apache.org/repos/asf/cxf/trunk
........
r1235544 | sergeyb | 2012-01-24 23:15:27 +0000 (Tue, 24 Jan 2012) | 1 line
[CXF-4061] Keeping some of the URI path characters unencoded
........
[dkulp] Blocked revisions 1235517 via svnmerge
........
r1235517 | dkulp | 2012-01-24 16:54:22 -0500 (Tue, 24 Jan 2012) | 1 line
Updates to features.xml and various imports
........
[dkulp] Merged revisions 1235518 via svnmerge from
https://svn.apache.org/repos/asf/cxf/trunk
........
r1235518 | dkulp | 2012-01-24 16:54:32 -0500 (Tue, 24 Jan 2012) | 1 line
Mark a bunch of things optional that we don't need all the time
........
[dkulp] Blocked revisions 1235082-1235083,1235085-1235092,1235268-1235272,1235317,1235319,1235343-1235346,1235424-1235425 via svnmerge
........
r1235082 | dkulp | 2012-01-23 19:49:15 -0500 (Mon, 23 Jan 2012) | 1 line
Resolve transport split package between api and core
........
r1235083 | dkulp | 2012-01-23 19:50:01 -0500 (Mon, 23 Jan 2012) | 1 line
Resolve "phase" split package between core and api
........
r1235085 | dkulp | 2012-01-23 19:50:13 -0500 (Mon, 23 Jan 2012) | 1 line
Resolve io split package between api and core
........
r1235086 | dkulp | 2012-01-23 19:50:24 -0500 (Mon, 23 Jan 2012) | 1 line
Resolve "headers" split package between api and core
........
r1235087 | dkulp | 2012-01-23 19:50:38 -0500 (Mon, 23 Jan 2012) | 1 line
Resolve buslifecycle split package between api and core
........
r1235088 | dkulp | 2012-01-23 19:50:56 -0500 (Mon, 23 Jan 2012) | 2 lines
Resolve clustering split package issue (although next step is to pull
this into separate module entirely).
........
r1235089 | dkulp | 2012-01-23 19:51:16 -0500 (Mon, 23 Jan 2012) | 1 line
Resolve service.invoke split package issue between api and core
........
r1235090 | dkulp | 2012-01-23 19:51:25 -0500 (Mon, 23 Jan 2012) | 1 line
Fix location of where the bundle is loaded from.
........
r1235091 | dkulp | 2012-01-23 19:51:36 -0500 (Mon, 23 Jan 2012) | 1 line
Resolve "wsdl" split package issue
........
r1235092 | dkulp | 2012-01-23 19:51:43 -0500 (Mon, 23 Jan 2012) | 1 line
Fix issue with JAX-RS tests after package moves
........
r1235268 | dkulp | 2012-01-24 09:37:08 -0500 (Tue, 24 Jan 2012) | 1 line
resolve workqueue split package issue
........
r1235269 | dkulp | 2012-01-24 09:37:22 -0500 (Tue, 24 Jan 2012) | 1 line
Resolve service split package issue
........
r1235270 | dkulp | 2012-01-24 09:37:42 -0500 (Tue, 24 Jan 2012) | 1 line
Resolve binding split package issue
........
r1235271 | dkulp | 2012-01-24 09:38:34 -0500 (Tue, 24 Jan 2012) | 2 lines
Kind of sucky, but resolve interceptor and feature split package issue
by promoting everything up to API
........
r1235272 | dkulp | 2012-01-24 09:39:08 -0500 (Tue, 24 Jan 2012) | 2 lines
Resolve last split package issues.
Change api to regular bundle, not a fragment
........
r1235317 | dkulp | 2012-01-24 10:56:43 -0500 (Tue, 24 Jan 2012) | 2 lines
Remove now-empty directories that using git-svn leaves around
........
r1235319 | dkulp | 2012-01-24 11:04:27 -0500 (Tue, 24 Jan 2012) | 2 lines
More empty dir removal
........
r1235343 | dkulp | 2012-01-24 11:40:21 -0500 (Tue, 24 Jan 2012) | 1 line
Move attachement unit tests to api where attachments now live
........
r1235344 | dkulp | 2012-01-24 11:40:33 -0500 (Tue, 24 Jan 2012) | 1 line
Move workqueue unit tests to api
........
r1235345 | dkulp | 2012-01-24 11:40:45 -0500 (Tue, 24 Jan 2012) | 1 line
Move transport and io unit tests to api
........
r1235346 | dkulp | 2012-01-24 11:41:00 -0500 (Tue, 24 Jan 2012) | 2 lines
With more stuff promoted to API, change the hack put in place to
maintain compatibility with <=2.5.x
........
r1235424 | dkulp | 2012-01-24 14:19:22 -0500 (Tue, 24 Jan 2012) | 1 line
Missed two split packages. Easy fix though.
........
r1235425 | dkulp | 2012-01-24 14:19:32 -0500 (Tue, 24 Jan 2012) | 2 lines
Add a compatibility bundle that allows applications that use
RequireBundle to still work.
........
[dkulp] Recorded merge of revisions 1235369 via svnmerge from
https://svn.apache.org/repos/asf/cxf/trunk
........
r1235369 | coheigea | 2012-01-24 12:34:49 -0500 (Tue, 24 Jan 2012) | 2 lines
Updating all SAML CallbackHandlers to produce schema compliant SAML Assertions
- Validating received SAML Assertions in the STS against the schema + specs.
........
[dkulp] Merged revisions 1235426 via svnmerge from
https://svn.apache.org/repos/asf/cxf/trunk
........
r1235426 | dkulp | 2012-01-24 14:19:41 -0500 (Tue, 24 Jan 2012) | 1 line
Fix mocks
........
[coheigea] Updating all SAML CallbackHandlers to produce schema compliant SAML Assertions
- Validating received SAML Assertions in the STS against the schema + specs.
[ay] Merged revisions 1235327 via svnmerge from
https://svn.apache.org/repos/asf/cxf/trunk
........
r1235327 | ay | 2012-01-24 17:17:53 +0100 (Tue, 24 Jan 2012) | 1 line
[CXF-4060] oneway camel scenario is accessing the user principal too late, resulting in IllegalStateException
........
------------------------------------------
[...truncated 29700 lines...]
[INFO] skip non existing resourceDirectory <https://builds.apache.org/job/CXF-2.5-deploy/ws/cxf-2.5.x-fixes/systests/wsdl_maven/codegen/src/main/java>
[INFO] Copying 1 resource
[INFO] skip non existing resourceDirectory <https://builds.apache.org/job/CXF-2.5-deploy/ws/cxf-2.5.x-fixes/systests/wsdl_maven/codegen/src/main/resources-filtered>
[INFO] skip non existing resourceDirectory <https://builds.apache.org/job/CXF-2.5-deploy/ws/cxf-2.5.x-fixes/systests/wsdl_maven/codegen/target/generated/src/main/resources>
[INFO] Copying 3 resources
[INFO] [compiler:compile {execution: default-compile}]
[INFO] Compiling 8 source files to <https://builds.apache.org/job/CXF-2.5-deploy/ws/cxf-2.5.x-fixes/systests/wsdl_maven/codegen/target/classes>
[debug] execute contextualize
[INFO] [resources:testResources {execution: default-testResources}]
[INFO] Using 'UTF-8' encoding to copy filtered resources.
[INFO] skip non existing resourceDirectory <https://builds.apache.org/job/CXF-2.5-deploy/ws/cxf-2.5.x-fixes/systests/wsdl_maven/codegen/src/test/java>
[INFO] skip non existing resourceDirectory <https://builds.apache.org/job/CXF-2.5-deploy/ws/cxf-2.5.x-fixes/systests/wsdl_maven/codegen/src/test/resources>
[INFO] skip non existing resourceDirectory <https://builds.apache.org/job/CXF-2.5-deploy/ws/cxf-2.5.x-fixes/systests/wsdl_maven/codegen/target/generated/src/test/resources>
[INFO] Copying 3 resources
[INFO] [compiler:testCompile {execution: default-testCompile}]
[INFO] No sources to compile
[INFO] [surefire:test {execution: default-test}]
[INFO] Tests are skipped.
[INFO] [jar:jar {execution: default-jar}]
[INFO] Building jar: <https://builds.apache.org/job/CXF-2.5-deploy/ws/cxf-2.5.x-fixes/systests/wsdl_maven/codegen/target/cxf-systests-codegen-2.5.3-SNAPSHOT.jar>
[INFO] [source:jar-no-fork {execution: attach-sources}]
[INFO] META-INF already added, skipping
[INFO] META-INF/NOTICE already added, skipping
[INFO] META-INF/DEPENDENCIES already added, skipping
[INFO] META-INF/LICENSE already added, skipping
[INFO] Building jar: <https://builds.apache.org/job/CXF-2.5-deploy/ws/cxf-2.5.x-fixes/systests/wsdl_maven/codegen/target/cxf-systests-codegen-2.5.3-SNAPSHOT-sources.jar>
[INFO] META-INF already added, skipping
[INFO] META-INF/NOTICE already added, skipping
[INFO] META-INF/DEPENDENCIES already added, skipping
[INFO] META-INF/LICENSE already added, skipping
[INFO] [javadoc:jar {execution: attach-javadocs}]
[INFO] Building jar: <https://builds.apache.org/job/CXF-2.5-deploy/ws/cxf-2.5.x-fixes/systests/wsdl_maven/codegen/target/cxf-systests-codegen-2.5.3-SNAPSHOT-javadoc.jar>
Downloading: http://repo1.maven.org/maven2/org/apache/maven/maven-plugin-api/2.0.4/maven-plugin-api-2.0.4.pom
Downloading: http://repo1.maven.org/maven2/org/apache/maven/doxia/doxia-sink-api/1.0-alpha-11/doxia-sink-api-1.0-alpha-11.pom
Downloading: http://repo1.maven.org/maven2/org/apache/maven/doxia/doxia/1.0-alpha-11/doxia-1.0-alpha-11.pom
Downloading: http://repo1.maven.org/maven2/org/apache/maven/doxia/doxia-site-renderer/1.0-alpha-11/doxia-site-renderer-1.0-alpha-11.pom
Downloading: http://repo1.maven.org/maven2/org/apache/maven/doxia/doxia-sitetools/1.0-alpha-11/doxia-sitetools-1.0-alpha-11.pom
Downloading: http://repo1.maven.org/maven2/org/apache/maven/doxia/doxia-core/1.0-alpha-11/doxia-core-1.0-alpha-11.pom
Downloading: http://repo1.maven.org/maven2/org/apache/maven/doxia/doxia-decoration-model/1.0-alpha-11/doxia-decoration-model-1.0-alpha-11.pom
Downloading: http://repo1.maven.org/maven2/org/apache/maven/doxia/doxia-module-apt/1.0-alpha-11/doxia-module-apt-1.0-alpha-11.pom
Downloading: http://repo1.maven.org/maven2/org/apache/maven/doxia/doxia-modules/1.0-alpha-11/doxia-modules-1.0-alpha-11.pom
Downloading: http://repo1.maven.org/maven2/org/apache/maven/doxia/doxia-module-fml/1.0-alpha-11/doxia-module-fml-1.0-alpha-11.pom
Downloading: http://repo1.maven.org/maven2/org/apache/maven/doxia/doxia-module-xdoc/1.0-alpha-11/doxia-module-xdoc-1.0-alpha-11.pom
Downloading: http://repo1.maven.org/maven2/org/apache/maven/doxia/doxia-module-xhtml/1.0-alpha-11/doxia-module-xhtml-1.0-alpha-11.pom
Downloading: http://repo1.maven.org/maven2/org/beanshell/bsh/2.0b4/bsh-2.0b4.pom
Downloading: http://repo1.maven.org/maven2/org/beanshell/beanshell/2.0b4/beanshell-2.0b4.pom
Downloading: http://repo1.maven.org/maven2/org/codehaus/groovy/groovy/1.5.6/groovy-1.5.6.pom
Downloading: http://repo1.maven.org/maven2/antlr/antlr/2.7.6/antlr-2.7.6.pom
Downloading: http://repo1.maven.org/maven2/asm/asm/2.2/asm-2.2.pom
Downloading: http://repo1.maven.org/maven2/org/apache/ant/ant/1.7.0/ant-1.7.0.pom
Downloading: http://repo1.maven.org/maven2/org/apache/ant/ant-parent/1.7.0/ant-parent-1.7.0.pom
Downloading: http://repo1.maven.org/maven2/org/apache/ant/ant-launcher/1.7.0/ant-launcher-1.7.0.pom
Downloading: http://repo1.maven.org/maven2/asm/asm-util/2.2/asm-util-2.2.pom
Downloading: http://repo1.maven.org/maven2/asm/asm-analysis/2.2/asm-analysis-2.2.pom
Downloading: http://repo1.maven.org/maven2/asm/asm-tree/2.2/asm-tree-2.2.pom
Downloading: http://repo1.maven.org/maven2/jline/jline/0.9.94/jline-0.9.94.pom
Downloading: http://repo1.maven.org/maven2/org/apache/ant/ant/1.7.1/ant-1.7.1.pom
Downloading: http://repo1.maven.org/maven2/org/apache/ant/ant-parent/1.7.1/ant-parent-1.7.1.pom
Downloading: http://repo1.maven.org/maven2/org/beanshell/bsh/2.0b4/bsh-2.0b4.jar
Downloading: http://repo1.maven.org/maven2/asm/asm/2.2/asm-2.2.jar
Downloading: http://repo1.maven.org/maven2/org/codehaus/groovy/groovy/1.5.6/groovy-1.5.6.jar
Downloading: http://repo1.maven.org/maven2/org/apache/ant/ant/1.7.1/ant-1.7.1.jar
Downloading: http://repo1.maven.org/maven2/jline/jline/0.9.94/jline-0.9.94.jar
Downloading: http://repo1.maven.org/maven2/antlr/antlr/2.7.6/antlr-2.7.6.jar
Downloading: http://repo1.maven.org/maven2/org/apache/maven/doxia/doxia-site-renderer/1.0-alpha-11/doxia-site-renderer-1.0-alpha-11.jar
Downloading: http://repo1.maven.org/maven2/asm/asm-util/2.2/asm-util-2.2.jar
Downloading: http://repo1.maven.org/maven2/org/apache/maven/doxia/doxia-decoration-model/1.0-alpha-11/doxia-decoration-model-1.0-alpha-11.jar
Downloading: http://repo1.maven.org/maven2/asm/asm-analysis/2.2/asm-analysis-2.2.jar
Downloading: http://repo1.maven.org/maven2/org/apache/maven/doxia/doxia-module-apt/1.0-alpha-11/doxia-module-apt-1.0-alpha-11.jar
Downloading: http://repo1.maven.org/maven2/asm/asm-tree/2.2/asm-tree-2.2.jar
Downloading: http://repo1.maven.org/maven2/org/apache/maven/doxia/doxia-module-fml/1.0-alpha-11/doxia-module-fml-1.0-alpha-11.jar
Downloading: http://repo1.maven.org/maven2/org/apache/maven/doxia/doxia-module-xdoc/1.0-alpha-11/doxia-module-xdoc-1.0-alpha-11.jar
Downloading: http://repo1.maven.org/maven2/org/apache/ant/ant-launcher/1.7.0/ant-launcher-1.7.0.jar
Downloading: http://repo1.maven.org/maven2/org/apache/maven/doxia/doxia-module-xhtml/1.0-alpha-11/doxia-module-xhtml-1.0-alpha-11.jar
[INFO] [invoker:install {execution: integration-test}]
[INFO] Installing <https://builds.apache.org/job/CXF-2.5-deploy/ws/cxf-2.5.x-fixes/systests/wsdl_maven/java2ws/pom.xml> to <https://builds.apache.org/job/CXF-2.5-deploy/ws/cxf-2.5.x-fixes/systests/wsdl_maven/codegen/target/local-repo/org/apache/cxf/systests/wsdl_maven/cxf-systests-java2ws/2.5.3-SNAPSHOT/cxf-systests-java2ws-2.5.3-SNAPSHOT.pom>
[INFO] Installing <https://builds.apache.org/job/CXF-2.5-deploy/ws/cxf-2.5.x-fixes/systests/wsdl_maven/java2ws/target/cxf-systests-java2ws-2.5.3-SNAPSHOT.jar> to <https://builds.apache.org/job/CXF-2.5-deploy/ws/cxf-2.5.x-fixes/systests/wsdl_maven/codegen/target/local-repo/org/apache/cxf/systests/wsdl_maven/cxf-systests-java2ws/2.5.3-SNAPSHOT/cxf-systests-java2ws-2.5.3-20120125.065508-5.jar>
[INFO] Installing <https://builds.apache.org/job/CXF-2.5-deploy/ws/cxf-2.5.x-fixes/systests/wsdl_maven/java2ws/target/generated/wsdl/HelloWorld.wsdl> to <https://builds.apache.org/job/CXF-2.5-deploy/ws/cxf-2.5.x-fixes/systests/wsdl_maven/codegen/target/local-repo/org/apache/cxf/systests/wsdl_maven/cxf-systests-java2ws/2.5.3-SNAPSHOT/cxf-systests-java2ws-2.5.3-20120125.065508-5.wsdl>
[INFO] Installing <https://builds.apache.org/job/CXF-2.5-deploy/ws/cxf-2.5.x-fixes/systests/wsdl_maven/java2ws/target/cxf-systests-java2ws-2.5.3-SNAPSHOT-sources.jar> to <https://builds.apache.org/job/CXF-2.5-deploy/ws/cxf-2.5.x-fixes/systests/wsdl_maven/codegen/target/local-repo/org/apache/cxf/systests/wsdl_maven/cxf-systests-java2ws/2.5.3-SNAPSHOT/cxf-systests-java2ws-2.5.3-20120125.065508-5-sources.jar>
[INFO] Installing <https://builds.apache.org/job/CXF-2.5-deploy/ws/cxf-2.5.x-fixes/systests/wsdl_maven/java2ws/target/cxf-systests-java2ws-2.5.3-SNAPSHOT-javadoc.jar> to <https://builds.apache.org/job/CXF-2.5-deploy/ws/cxf-2.5.x-fixes/systests/wsdl_maven/codegen/target/local-repo/org/apache/cxf/systests/wsdl_maven/cxf-systests-java2ws/2.5.3-SNAPSHOT/cxf-systests-java2ws-2.5.3-20120125.065508-5-javadoc.jar>
[INFO] Installing <https://builds.apache.org/job/CXF-2.5-deploy/ws/cxf-2.5.x-fixes/parent/pom.xml> to <https://builds.apache.org/job/CXF-2.5-deploy/ws/cxf-2.5.x-fixes/systests/wsdl_maven/codegen/target/local-repo/org/apache/cxf/cxf-parent/2.5.3-SNAPSHOT/cxf-parent-2.5.3-20120125.065508-5.pom>
[INFO] Installing <https://builds.apache.org/job/CXF-2.5-deploy/ws/cxf-2.5.x-fixes/pom.xml> to <https://builds.apache.org/job/CXF-2.5-deploy/ws/cxf-2.5.x-fixes/systests/wsdl_maven/codegen/target/local-repo/org/apache/cxf/cxf/2.5.3-SNAPSHOT/cxf-2.5.3-20120125.065508-5.pom>
[INFO] Installing <https://builds.apache.org/job/CXF-2.5-deploy/ws/cxf-2.5.x-fixes/rt/frontend/jaxws/pom.xml> to <https://builds.apache.org/job/CXF-2.5-deploy/ws/cxf-2.5.x-fixes/systests/wsdl_maven/codegen/target/local-repo/org/apache/cxf/cxf-rt-frontend-jaxws/2.5.3-SNAPSHOT/cxf-rt-frontend-jaxws-2.5.3-SNAPSHOT.pom>
[INFO] Installing <https://builds.apache.org/job/CXF-2.5-deploy/ws/cxf-2.5.x-fixes/rt/frontend/jaxws/target/cxf-rt-frontend-jaxws-2.5.3-SNAPSHOT.jar> to <https://builds.apache.org/job/CXF-2.5-deploy/ws/cxf-2.5.x-fixes/systests/wsdl_maven/codegen/target/local-repo/org/apache/cxf/cxf-rt-frontend-jaxws/2.5.3-SNAPSHOT/cxf-rt-frontend-jaxws-2.5.3-20120125.065508-5.jar>
[INFO] Installing <https://builds.apache.org/job/CXF-2.5-deploy/ws/cxf-2.5.x-fixes/rt/frontend/jaxws/target/cxf-rt-frontend-jaxws-2.5.3-SNAPSHOT-sources.jar> to <https://builds.apache.org/job/CXF-2.5-deploy/ws/cxf-2.5.x-fixes/systests/wsdl_maven/codegen/target/local-repo/org/apache/cxf/cxf-rt-frontend-jaxws/2.5.3-SNAPSHOT/cxf-rt-frontend-jaxws-2.5.3-20120125.065508-5-sources.jar>
[INFO] Installing <https://builds.apache.org/job/CXF-2.5-deploy/ws/cxf-2.5.x-fixes/rt/frontend/jaxws/target/cxf-rt-frontend-jaxws-2.5.3-SNAPSHOT-javadoc.jar> to <https://builds.apache.org/job/CXF-2.5-deploy/ws/cxf-2.5.x-fixes/systests/wsdl_maven/codegen/target/local-repo/org/apache/cxf/cxf-rt-frontend-jaxws/2.5.3-SNAPSHOT/cxf-rt-frontend-jaxws-2.5.3-20120125.065508-5-javadoc.jar>
[INFO] Installing <https://builds.apache.org/job/CXF-2.5-deploy/ws/cxf-2.5.x-fixes/api/pom.xml> to <https://builds.apache.org/job/CXF-2.5-deploy/ws/cxf-2.5.x-fixes/systests/wsdl_maven/codegen/target/local-repo/org/apache/cxf/cxf-api/2.5.3-SNAPSHOT/cxf-api-2.5.3-SNAPSHOT.pom>
[INFO] Installing <https://builds.apache.org/job/CXF-2.5-deploy/ws/cxf-2.5.x-fixes/api/target/cxf-api-2.5.3-SNAPSHOT.jar> to <https://builds.apache.org/job/CXF-2.5-deploy/ws/cxf-2.5.x-fixes/systests/wsdl_maven/codegen/target/local-repo/org/apache/cxf/cxf-api/2.5.3-SNAPSHOT/cxf-api-2.5.3-20120125.065508-5.jar>
[INFO] Installing <https://builds.apache.org/job/CXF-2.5-deploy/ws/cxf-2.5.x-fixes/api/target/cxf-api-2.5.3-SNAPSHOT-sources.jar> to <https://builds.apache.org/job/CXF-2.5-deploy/ws/cxf-2.5.x-fixes/systests/wsdl_maven/codegen/target/local-repo/org/apache/cxf/cxf-api/2.5.3-SNAPSHOT/cxf-api-2.5.3-20120125.065508-5-sources.jar>
[INFO] Installing <https://builds.apache.org/job/CXF-2.5-deploy/ws/cxf-2.5.x-fixes/api/target/cxf-api-2.5.3-SNAPSHOT-javadoc.jar> to <https://builds.apache.org/job/CXF-2.5-deploy/ws/cxf-2.5.x-fixes/systests/wsdl_maven/codegen/target/local-repo/org/apache/cxf/cxf-api/2.5.3-SNAPSHOT/cxf-api-2.5.3-20120125.065508-5-javadoc.jar>
[INFO] Installing <https://builds.apache.org/job/CXF-2.5-deploy/ws/cxf-2.5.x-fixes/common/common/pom.xml> to <https://builds.apache.org/job/CXF-2.5-deploy/ws/cxf-2.5.x-fixes/systests/wsdl_maven/codegen/target/local-repo/org/apache/cxf/cxf-common-utilities/2.5.3-SNAPSHOT/cxf-common-utilities-2.5.3-SNAPSHOT.pom>
[INFO] Installing <https://builds.apache.org/job/CXF-2.5-deploy/ws/cxf-2.5.x-fixes/common/common/target/cxf-common-utilities-2.5.3-SNAPSHOT.jar> to <https://builds.apache.org/job/CXF-2.5-deploy/ws/cxf-2.5.x-fixes/systests/wsdl_maven/codegen/target/local-repo/org/apache/cxf/cxf-common-utilities/2.5.3-SNAPSHOT/cxf-common-utilities-2.5.3-20120125.065508-5.jar>
[INFO] Installing <https://builds.apache.org/job/CXF-2.5-deploy/ws/cxf-2.5.x-fixes/common/common/target/cxf-common-utilities-2.5.3-SNAPSHOT-sources.jar> to <https://builds.apache.org/job/CXF-2.5-deploy/ws/cxf-2.5.x-fixes/systests/wsdl_maven/codegen/target/local-repo/org/apache/cxf/cxf-common-utilities/2.5.3-SNAPSHOT/cxf-common-utilities-2.5.3-20120125.065508-5-sources.jar>
[INFO] Installing <https://builds.apache.org/job/CXF-2.5-deploy/ws/cxf-2.5.x-fixes/common/common/target/cxf-common-utilities-2.5.3-SNAPSHOT-javadoc.jar> to <https://builds.apache.org/job/CXF-2.5-deploy/ws/cxf-2.5.x-fixes/systests/wsdl_maven/codegen/target/local-repo/org/apache/cxf/cxf-common-utilities/2.5.3-SNAPSHOT/cxf-common-utilities-2.5.3-20120125.065508-5-javadoc.jar>
[INFO] Installing <https://builds.apache.org/job/CXF-2.5-deploy/ws/cxf-2.5.x-fixes/rt/core/pom.xml> to <https://builds.apache.org/job/CXF-2.5-deploy/ws/cxf-2.5.x-fixes/systests/wsdl_maven/codegen/target/local-repo/org/apache/cxf/cxf-rt-core/2.5.3-SNAPSHOT/cxf-rt-core-2.5.3-SNAPSHOT.pom>
[INFO] Installing <https://builds.apache.org/job/CXF-2.5-deploy/ws/cxf-2.5.x-fixes/rt/core/target/cxf-rt-core-2.5.3-SNAPSHOT.jar> to <https://builds.apache.org/job/CXF-2.5-deploy/ws/cxf-2.5.x-fixes/systests/wsdl_maven/codegen/target/local-repo/org/apache/cxf/cxf-rt-core/2.5.3-SNAPSHOT/cxf-rt-core-2.5.3-20120125.065508-5.jar>
[INFO] Installing <https://builds.apache.org/job/CXF-2.5-deploy/ws/cxf-2.5.x-fixes/rt/core/target/cxf-rt-core-2.5.3-SNAPSHOT-sources.jar> to <https://builds.apache.org/job/CXF-2.5-deploy/ws/cxf-2.5.x-fixes/systests/wsdl_maven/codegen/target/local-repo/org/apache/cxf/cxf-rt-core/2.5.3-SNAPSHOT/cxf-rt-core-2.5.3-20120125.065508-5-sources.jar>
[INFO] Installing <https://builds.apache.org/job/CXF-2.5-deploy/ws/cxf-2.5.x-fixes/rt/core/target/cxf-rt-core-2.5.3-SNAPSHOT-javadoc.jar> to <https://builds.apache.org/job/CXF-2.5-deploy/ws/cxf-2.5.x-fixes/systests/wsdl_maven/codegen/target/local-repo/org/apache/cxf/cxf-rt-core/2.5.3-SNAPSHOT/cxf-rt-core-2.5.3-20120125.065508-5-javadoc.jar>
[INFO] Installing <https://builds.apache.org/job/CXF-2.5-deploy/ws/cxf-2.5.x-fixes/rt/bindings/soap/pom.xml> to <https://builds.apache.org/job/CXF-2.5-deploy/ws/cxf-2.5.x-fixes/systests/wsdl_maven/codegen/target/local-repo/org/apache/cxf/cxf-rt-bindings-soap/2.5.3-SNAPSHOT/cxf-rt-bindings-soap-2.5.3-SNAPSHOT.pom>
[INFO] Installing <https://builds.apache.org/job/CXF-2.5-deploy/ws/cxf-2.5.x-fixes/rt/bindings/soap/target/cxf-rt-bindings-soap-2.5.3-SNAPSHOT.jar> to <https://builds.apache.org/job/CXF-2.5-deploy/ws/cxf-2.5.x-fixes/systests/wsdl_maven/codegen/target/local-repo/org/apache/cxf/cxf-rt-bindings-soap/2.5.3-SNAPSHOT/cxf-rt-bindings-soap-2.5.3-20120125.065508-5.jar>
[INFO] Installing <https://builds.apache.org/job/CXF-2.5-deploy/ws/cxf-2.5.x-fixes/rt/bindings/soap/target/cxf-rt-bindings-soap-2.5.3-SNAPSHOT-sources.jar> to <https://builds.apache.org/job/CXF-2.5-deploy/ws/cxf-2.5.x-fixes/systests/wsdl_maven/codegen/target/local-repo/org/apache/cxf/cxf-rt-bindings-soap/2.5.3-SNAPSHOT/cxf-rt-bindings-soap-2.5.3-20120125.065508-5-sources.jar>
[INFO] Installing <https://builds.apache.org/job/CXF-2.5-deploy/ws/cxf-2.5.x-fixes/rt/bindings/soap/target/cxf-rt-bindings-soap-2.5.3-SNAPSHOT-javadoc.jar> to <https://builds.apache.org/job/CXF-2.5-deploy/ws/cxf-2.5.x-fixes/systests/wsdl_maven/codegen/target/local-repo/org/apache/cxf/cxf-rt-bindings-soap/2.5.3-SNAPSHOT/cxf-rt-bindings-soap-2.5.3-20120125.065508-5-javadoc.jar>
[INFO] Installing <https://builds.apache.org/job/CXF-2.5-deploy/ws/cxf-2.5.x-fixes/tools/common/pom.xml> to <https://builds.apache.org/job/CXF-2.5-deploy/ws/cxf-2.5.x-fixes/systests/wsdl_maven/codegen/target/local-repo/org/apache/cxf/cxf-tools-common/2.5.3-SNAPSHOT/cxf-tools-common-2.5.3-SNAPSHOT.pom>
[INFO] Installing <https://builds.apache.org/job/CXF-2.5-deploy/ws/cxf-2.5.x-fixes/tools/common/target/cxf-tools-common-2.5.3-SNAPSHOT.jar> to <https://builds.apache.org/job/CXF-2.5-deploy/ws/cxf-2.5.x-fixes/systests/wsdl_maven/codegen/target/local-repo/org/apache/cxf/cxf-tools-common/2.5.3-SNAPSHOT/cxf-tools-common-2.5.3-20120125.065508-5.jar>
[INFO] Installing <https://builds.apache.org/job/CXF-2.5-deploy/ws/cxf-2.5.x-fixes/tools/common/target/cxf-tools-common-2.5.3-SNAPSHOT-sources.jar> to <https://builds.apache.org/job/CXF-2.5-deploy/ws/cxf-2.5.x-fixes/systests/wsdl_maven/codegen/target/local-repo/org/apache/cxf/cxf-tools-common/2.5.3-SNAPSHOT/cxf-tools-common-2.5.3-20120125.065508-5-sources.jar>
[INFO] Installing <https://builds.apache.org/job/CXF-2.5-deploy/ws/cxf-2.5.x-fixes/tools/common/target/cxf-tools-common-2.5.3-SNAPSHOT-javadoc.jar> to <https://builds.apache.org/job/CXF-2.5-deploy/ws/cxf-2.5.x-fixes/systests/wsdl_maven/codegen/target/local-repo/org/apache/cxf/cxf-tools-common/2.5.3-SNAPSHOT/cxf-tools-common-2.5.3-20120125.065508-5-javadoc.jar>
[INFO] Installing <https://builds.apache.org/job/CXF-2.5-deploy/ws/cxf-2.5.x-fixes/rt/databinding/jaxb/pom.xml> to <https://builds.apache.org/job/CXF-2.5-deploy/ws/cxf-2.5.x-fixes/systests/wsdl_maven/codegen/target/local-repo/org/apache/cxf/cxf-rt-databinding-jaxb/2.5.3-SNAPSHOT/cxf-rt-databinding-jaxb-2.5.3-SNAPSHOT.pom>
[INFO] Installing <https://builds.apache.org/job/CXF-2.5-deploy/ws/cxf-2.5.x-fixes/rt/databinding/jaxb/target/cxf-rt-databinding-jaxb-2.5.3-SNAPSHOT.jar> to <https://builds.apache.org/job/CXF-2.5-deploy/ws/cxf-2.5.x-fixes/systests/wsdl_maven/codegen/target/local-repo/org/apache/cxf/cxf-rt-databinding-jaxb/2.5.3-SNAPSHOT/cxf-rt-databinding-jaxb-2.5.3-20120125.065508-5.jar>
[INFO] Installing <https://builds.apache.org/job/CXF-2.5-deploy/ws/cxf-2.5.x-fixes/rt/databinding/jaxb/target/cxf-rt-databinding-jaxb-2.5.3-SNAPSHOT-sources.jar> to <https://builds.apache.org/job/CXF-2.5-deploy/ws/cxf-2.5.x-fixes/systests/wsdl_maven/codegen/target/local-repo/org/apache/cxf/cxf-rt-databinding-jaxb/2.5.3-SNAPSHOT/cxf-rt-databinding-jaxb-2.5.3-20120125.065508-5-sources.jar>
[INFO] Installing <https://builds.apache.org/job/CXF-2.5-deploy/ws/cxf-2.5.x-fixes/rt/databinding/jaxb/target/cxf-rt-databinding-jaxb-2.5.3-SNAPSHOT-javadoc.jar> to <https://builds.apache.org/job/CXF-2.5-deploy/ws/cxf-2.5.x-fixes/systests/wsdl_maven/codegen/target/local-repo/org/apache/cxf/cxf-rt-databinding-jaxb/2.5.3-SNAPSHOT/cxf-rt-databinding-jaxb-2.5.3-20120125.065508-5-javadoc.jar>
[INFO] Installing <https://builds.apache.org/job/CXF-2.5-deploy/ws/cxf-2.5.x-fixes/rt/bindings/xml/pom.xml> to <https://builds.apache.org/job/CXF-2.5-deploy/ws/cxf-2.5.x-fixes/systests/wsdl_maven/codegen/target/local-repo/org/apache/cxf/cxf-rt-bindings-xml/2.5.3-SNAPSHOT/cxf-rt-bindings-xml-2.5.3-SNAPSHOT.pom>
[INFO] Installing <https://builds.apache.org/job/CXF-2.5-deploy/ws/cxf-2.5.x-fixes/rt/bindings/xml/target/cxf-rt-bindings-xml-2.5.3-SNAPSHOT.jar> to <https://builds.apache.org/job/CXF-2.5-deploy/ws/cxf-2.5.x-fixes/systests/wsdl_maven/codegen/target/local-repo/org/apache/cxf/cxf-rt-bindings-xml/2.5.3-SNAPSHOT/cxf-rt-bindings-xml-2.5.3-20120125.065508-5.jar>
[INFO] Installing <https://builds.apache.org/job/CXF-2.5-deploy/ws/cxf-2.5.x-fixes/rt/bindings/xml/target/cxf-rt-bindings-xml-2.5.3-SNAPSHOT-sources.jar> to <https://builds.apache.org/job/CXF-2.5-deploy/ws/cxf-2.5.x-fixes/systests/wsdl_maven/codegen/target/local-repo/org/apache/cxf/cxf-rt-bindings-xml/2.5.3-SNAPSHOT/cxf-rt-bindings-xml-2.5.3-20120125.065508-5-sources.jar>
[INFO] Installing <https://builds.apache.org/job/CXF-2.5-deploy/ws/cxf-2.5.x-fixes/rt/bindings/xml/target/cxf-rt-bindings-xml-2.5.3-SNAPSHOT-javadoc.jar> to <https://builds.apache.org/job/CXF-2.5-deploy/ws/cxf-2.5.x-fixes/systests/wsdl_maven/codegen/target/local-repo/org/apache/cxf/cxf-rt-bindings-xml/2.5.3-SNAPSHOT/cxf-rt-bindings-xml-2.5.3-20120125.065508-5-javadoc.jar>
[INFO] Installing <https://builds.apache.org/job/CXF-2.5-deploy/ws/cxf-2.5.x-fixes/rt/frontend/simple/pom.xml> to <https://builds.apache.org/job/CXF-2.5-deploy/ws/cxf-2.5.x-fixes/systests/wsdl_maven/codegen/target/local-repo/org/apache/cxf/cxf-rt-frontend-simple/2.5.3-SNAPSHOT/cxf-rt-frontend-simple-2.5.3-SNAPSHOT.pom>
[INFO] Installing <https://builds.apache.org/job/CXF-2.5-deploy/ws/cxf-2.5.x-fixes/rt/frontend/simple/target/cxf-rt-frontend-simple-2.5.3-SNAPSHOT.jar> to <https://builds.apache.org/job/CXF-2.5-deploy/ws/cxf-2.5.x-fixes/systests/wsdl_maven/codegen/target/local-repo/org/apache/cxf/cxf-rt-frontend-simple/2.5.3-SNAPSHOT/cxf-rt-frontend-simple-2.5.3-20120125.065508-5.jar>
[INFO] Installing <https://builds.apache.org/job/CXF-2.5-deploy/ws/cxf-2.5.x-fixes/rt/frontend/simple/target/cxf-rt-frontend-simple-2.5.3-SNAPSHOT-sources.jar> to <https://builds.apache.org/job/CXF-2.5-deploy/ws/cxf-2.5.x-fixes/systests/wsdl_maven/codegen/target/local-repo/org/apache/cxf/cxf-rt-frontend-simple/2.5.3-SNAPSHOT/cxf-rt-frontend-simple-2.5.3-20120125.065508-5-sources.jar>
[INFO] Installing <https://builds.apache.org/job/CXF-2.5-deploy/ws/cxf-2.5.x-fixes/rt/frontend/simple/target/cxf-rt-frontend-simple-2.5.3-SNAPSHOT-javadoc.jar> to <https://builds.apache.org/job/CXF-2.5-deploy/ws/cxf-2.5.x-fixes/systests/wsdl_maven/codegen/target/local-repo/org/apache/cxf/cxf-rt-frontend-simple/2.5.3-SNAPSHOT/cxf-rt-frontend-simple-2.5.3-20120125.065508-5-javadoc.jar>
[INFO] Installing <https://builds.apache.org/job/CXF-2.5-deploy/ws/cxf-2.5.x-fixes/rt/transports/http/pom.xml> to <https://builds.apache.org/job/CXF-2.5-deploy/ws/cxf-2.5.x-fixes/systests/wsdl_maven/codegen/target/local-repo/org/apache/cxf/cxf-rt-transports-http/2.5.3-SNAPSHOT/cxf-rt-transports-http-2.5.3-SNAPSHOT.pom>
[INFO] Installing <https://builds.apache.org/job/CXF-2.5-deploy/ws/cxf-2.5.x-fixes/rt/transports/http/target/cxf-rt-transports-http-2.5.3-SNAPSHOT.jar> to <https://builds.apache.org/job/CXF-2.5-deploy/ws/cxf-2.5.x-fixes/systests/wsdl_maven/codegen/target/local-repo/org/apache/cxf/cxf-rt-transports-http/2.5.3-SNAPSHOT/cxf-rt-transports-http-2.5.3-20120125.065508-5.jar>
[INFO] Installing <https://builds.apache.org/job/CXF-2.5-deploy/ws/cxf-2.5.x-fixes/rt/transports/http/target/cxf-rt-transports-http-2.5.3-SNAPSHOT-sources.jar> to <https://builds.apache.org/job/CXF-2.5-deploy/ws/cxf-2.5.x-fixes/systests/wsdl_maven/codegen/target/local-repo/org/apache/cxf/cxf-rt-transports-http/2.5.3-SNAPSHOT/cxf-rt-transports-http-2.5.3-20120125.065508-5-sources.jar>
[INFO] Installing <https://builds.apache.org/job/CXF-2.5-deploy/ws/cxf-2.5.x-fixes/rt/transports/http/target/cxf-rt-transports-http-2.5.3-SNAPSHOT-javadoc.jar> to <https://builds.apache.org/job/CXF-2.5-deploy/ws/cxf-2.5.x-fixes/systests/wsdl_maven/codegen/target/local-repo/org/apache/cxf/cxf-rt-transports-http/2.5.3-SNAPSHOT/cxf-rt-transports-http-2.5.3-20120125.065508-5-javadoc.jar>
[INFO] Installing <https://builds.apache.org/job/CXF-2.5-deploy/ws/cxf-2.5.x-fixes/rt/transports/common/pom.xml> to <https://builds.apache.org/job/CXF-2.5-deploy/ws/cxf-2.5.x-fixes/systests/wsdl_maven/codegen/target/local-repo/org/apache/cxf/cxf-rt-transports-common/2.5.3-SNAPSHOT/cxf-rt-transports-common-2.5.3-SNAPSHOT.pom>
[INFO] Installing <https://builds.apache.org/job/CXF-2.5-deploy/ws/cxf-2.5.x-fixes/rt/transports/common/target/cxf-rt-transports-common-2.5.3-SNAPSHOT.jar> to <https://builds.apache.org/job/CXF-2.5-deploy/ws/cxf-2.5.x-fixes/systests/wsdl_maven/codegen/target/local-repo/org/apache/cxf/cxf-rt-transports-common/2.5.3-SNAPSHOT/cxf-rt-transports-common-2.5.3-20120125.065508-5.jar>
[INFO] Installing <https://builds.apache.org/job/CXF-2.5-deploy/ws/cxf-2.5.x-fixes/rt/transports/common/target/cxf-rt-transports-common-2.5.3-SNAPSHOT-sources.jar> to <https://builds.apache.org/job/CXF-2.5-deploy/ws/cxf-2.5.x-fixes/systests/wsdl_maven/codegen/target/local-repo/org/apache/cxf/cxf-rt-transports-common/2.5.3-SNAPSHOT/cxf-rt-transports-common-2.5.3-20120125.065508-5-sources.jar>
[INFO] Installing <https://builds.apache.org/job/CXF-2.5-deploy/ws/cxf-2.5.x-fixes/rt/transports/common/target/cxf-rt-transports-common-2.5.3-SNAPSHOT-javadoc.jar> to <https://builds.apache.org/job/CXF-2.5-deploy/ws/cxf-2.5.x-fixes/systests/wsdl_maven/codegen/target/local-repo/org/apache/cxf/cxf-rt-transports-common/2.5.3-SNAPSHOT/cxf-rt-transports-common-2.5.3-20120125.065508-5-javadoc.jar>
[INFO] Installing <https://builds.apache.org/job/CXF-2.5-deploy/ws/cxf-2.5.x-fixes/rt/ws/addr/pom.xml> to <https://builds.apache.org/job/CXF-2.5-deploy/ws/cxf-2.5.x-fixes/systests/wsdl_maven/codegen/target/local-repo/org/apache/cxf/cxf-rt-ws-addr/2.5.3-SNAPSHOT/cxf-rt-ws-addr-2.5.3-SNAPSHOT.pom>
[INFO] Installing <https://builds.apache.org/job/CXF-2.5-deploy/ws/cxf-2.5.x-fixes/rt/ws/addr/target/cxf-rt-ws-addr-2.5.3-SNAPSHOT.jar> to <https://builds.apache.org/job/CXF-2.5-deploy/ws/cxf-2.5.x-fixes/systests/wsdl_maven/codegen/target/local-repo/org/apache/cxf/cxf-rt-ws-addr/2.5.3-SNAPSHOT/cxf-rt-ws-addr-2.5.3-20120125.065508-5.jar>
[INFO] Installing <https://builds.apache.org/job/CXF-2.5-deploy/ws/cxf-2.5.x-fixes/rt/ws/addr/target/cxf-rt-ws-addr-2.5.3-SNAPSHOT-sources.jar> to <https://builds.apache.org/job/CXF-2.5-deploy/ws/cxf-2.5.x-fixes/systests/wsdl_maven/codegen/target/local-repo/org/apache/cxf/cxf-rt-ws-addr/2.5.3-SNAPSHOT/cxf-rt-ws-addr-2.5.3-20120125.065508-5-sources.jar>
[INFO] Installing <https://builds.apache.org/job/CXF-2.5-deploy/ws/cxf-2.5.x-fixes/rt/ws/addr/target/cxf-rt-ws-addr-2.5.3-SNAPSHOT-javadoc.jar> to <https://builds.apache.org/job/CXF-2.5-deploy/ws/cxf-2.5.x-fixes/systests/wsdl_maven/codegen/target/local-repo/org/apache/cxf/cxf-rt-ws-addr/2.5.3-SNAPSHOT/cxf-rt-ws-addr-2.5.3-20120125.065508-5-javadoc.jar>
[INFO] Installing <https://builds.apache.org/job/CXF-2.5-deploy/ws/cxf-2.5.x-fixes/systests/wsdl_maven/codegen/pom.xml> to <https://builds.apache.org/job/CXF-2.5-deploy/ws/cxf-2.5.x-fixes/systests/wsdl_maven/codegen/target/local-repo/org/apache/cxf/systests/wsdl_maven/cxf-systests-codegen/2.5.3-SNAPSHOT/cxf-systests-codegen-2.5.3-SNAPSHOT.pom>
[INFO] Installing <https://builds.apache.org/job/CXF-2.5-deploy/ws/cxf-2.5.x-fixes/systests/wsdl_maven/codegen/target/cxf-systests-codegen-2.5.3-SNAPSHOT.jar> to <https://builds.apache.org/job/CXF-2.5-deploy/ws/cxf-2.5.x-fixes/systests/wsdl_maven/codegen/target/local-repo/org/apache/cxf/systests/wsdl_maven/cxf-systests-codegen/2.5.3-SNAPSHOT/cxf-systests-codegen-2.5.3-SNAPSHOT.jar>
[INFO] Installing <https://builds.apache.org/job/CXF-2.5-deploy/ws/cxf-2.5.x-fixes/systests/wsdl_maven/codegen/target/cxf-systests-codegen-2.5.3-SNAPSHOT-sources.jar> to <https://builds.apache.org/job/CXF-2.5-deploy/ws/cxf-2.5.x-fixes/systests/wsdl_maven/codegen/target/local-repo/org/apache/cxf/systests/wsdl_maven/cxf-systests-codegen/2.5.3-SNAPSHOT/cxf-systests-codegen-2.5.3-SNAPSHOT-sources.jar>
[INFO] Installing <https://builds.apache.org/job/CXF-2.5-deploy/ws/cxf-2.5.x-fixes/systests/wsdl_maven/codegen/target/cxf-systests-codegen-2.5.3-SNAPSHOT-javadoc.jar> to <https://builds.apache.org/job/CXF-2.5-deploy/ws/cxf-2.5.x-fixes/systests/wsdl_maven/codegen/target/local-repo/org/apache/cxf/systests/wsdl_maven/cxf-systests-codegen/2.5.3-SNAPSHOT/cxf-systests-codegen-2.5.3-SNAPSHOT-javadoc.jar>
[INFO] [invoker:integration-test {execution: integration-test}]
[INFO] Building: cxf-4004/pom.xml
[INFO] ..FAILED (85.5 s)
[INFO] The build exited with code 1. See <https://builds.apache.org/job/CXF-2.5-deploy/ws/cxf-2.5.x-fixes/systests/wsdl_maven/codegen/target/it/cxf-4004/build.log> for details.
[INFO] Building: it-parent/pom.xml
[INFO] ..FAILED (43.0 s)
[INFO] The build exited with code 1. See <https://builds.apache.org/job/CXF-2.5-deploy/ws/cxf-2.5.x-fixes/systests/wsdl_maven/codegen/target/it/it-parent/build.log> for details.
[INFO] [invoker:verify {execution: integration-test}]
[INFO] -------------------------------------------------
[INFO] Build Summary:
[INFO] Passed: 0, Failed: 2, Errors: 0, Skipped: 0
[INFO] -------------------------------------------------
[ERROR] The following builds failed:
[ERROR] * it-parent/pom.xml
[ERROR] * cxf-4004/pom.xml
[INFO] -------------------------------------------------
[JENKINS] Archiving <https://builds.apache.org/job/CXF-2.5-deploy/ws/cxf-2.5.x-fixes/systests/wsdl_maven/codegen/pom.xml> to /home/hudson/hudson/jobs/CXF-2.5-deploy/modules/org.apache.cxf.systests.wsdl_maven$cxf-systests-codegen/builds/2012-01-25_06-50-44/archive/org.apache.cxf.systests.wsdl_maven/cxf-systests-codegen/2.5.3-SNAPSHOT/cxf-systests-codegen-2.5.3-SNAPSHOT.pom
[JENKINS] Archiving <https://builds.apache.org/job/CXF-2.5-deploy/ws/cxf-2.5.x-fixes/systests/wsdl_maven/codegen/target/cxf-systests-codegen-2.5.3-SNAPSHOT.jar> to /home/hudson/hudson/jobs/CXF-2.5-deploy/modules/org.apache.cxf.systests.wsdl_maven$cxf-systests-codegen/builds/2012-01-25_06-50-44/archive/org.apache.cxf.systests.wsdl_maven/cxf-systests-codegen/2.5.3-SNAPSHOT/cxf-systests-codegen-2.5.3-SNAPSHOT.jar
[JENKINS] Archiving <https://builds.apache.org/job/CXF-2.5-deploy/ws/cxf-2.5.x-fixes/systests/wsdl_maven/codegen/target/cxf-systests-codegen-2.5.3-SNAPSHOT-sources.jar> to /home/hudson/hudson/jobs/CXF-2.5-deploy/modules/org.apache.cxf.systests.wsdl_maven$cxf-systests-codegen/builds/2012-01-25_06-50-44/archive/org.apache.cxf.systests.wsdl_maven/cxf-systests-codegen/2.5.3-SNAPSHOT/cxf-systests-codegen-2.5.3-SNAPSHOT-sources.jar
[JENKINS] Archiving <https://builds.apache.org/job/CXF-2.5-deploy/ws/cxf-2.5.x-fixes/systests/wsdl_maven/codegen/target/cxf-systests-codegen-2.5.3-SNAPSHOT-javadoc.jar> to /home/hudson/hudson/jobs/CXF-2.5-deploy/modules/org.apache.cxf.systests.wsdl_maven$cxf-systests-codegen/builds/2012-01-25_06-50-44/archive/org.apache.cxf.systests.wsdl_maven/cxf-systests-codegen/2.5.3-SNAPSHOT/cxf-systests-codegen-2.5.3-SNAPSHOT-javadoc.jar
[INFO] ------------------------------------------------------------------------
[ERROR] BUILD FAILURE
[INFO] ------------------------------------------------------------------------
[INFO] : org.apache.maven.plugin.invoker.InvokerSession@dc0f6d
2 builds failed.
[INFO] ------------------------------------------------------------------------
[INFO] Trace
org.apache.maven.BuildFailureException: 2 builds failed.
at org.apache.maven.lifecycle.DefaultLifecycleExecutor.executeGoals(DefaultLifecycleExecutor.java:715)
at org.apache.maven.lifecycle.DefaultLifecycleExecutor.executeGoalWithLifecycle(DefaultLifecycleExecutor.java:556)
at org.apache.maven.lifecycle.DefaultLifecycleExecutor.executeGoal(DefaultLifecycleExecutor.java:535)
at org.apache.maven.lifecycle.DefaultLifecycleExecutor.executeGoalAndHandleFailures(DefaultLifecycleExecutor.java:387)
at org.apache.maven.lifecycle.DefaultLifecycleExecutor.executeTaskSegments(DefaultLifecycleExecutor.java:348)
at org.apache.maven.lifecycle.DefaultLifecycleExecutor.execute(DefaultLifecycleExecutor.java:180)
at org.apache.maven.lifecycle.LifecycleExecutorInterceptor.execute(LifecycleExecutorInterceptor.java:65)
at org.apache.maven.DefaultMaven.doExecute(DefaultMaven.java:328)
at org.apache.maven.DefaultMaven.execute(DefaultMaven.java:138)
at org.apache.maven.cli.MavenCli.main(MavenCli.java:362)
at sun.reflect.NativeMethodAccessorImpl.invoke0(Native Method)
at sun.reflect.NativeMethodAccessorImpl.invoke(NativeMethodAccessorImpl.java:39)
at sun.reflect.DelegatingMethodAccessorImpl.invoke(DelegatingMethodAccessorImpl.java:25)
at java.lang.reflect.Method.invoke(Method.java:592)
at org.codehaus.classworlds.Launcher.launchEnhanced(Launcher.java:315)
at org.codehaus.classworlds.Launcher.launch(Launcher.java:255)
at hudson.maven.agent.Main.launch(Main.java:185)
at hudson.maven.MavenBuilder.call(MavenBuilder.java:151)
at hudson.maven.Maven2Builder.call(Maven2Builder.java:77)
at hudson.maven.Maven2Builder.call(Maven2Builder.java:53)
at hudson.remoting.UserRequest.perform(UserRequest.java:118)
at hudson.remoting.UserRequest.perform(UserRequest.java:48)
at hudson.remoting.Request$2.run(Request.java:287)
at java.util.concurrent.Executors$RunnableAdapter.call(Executors.java:417)
at java.util.concurrent.FutureTask$Sync.innerRun(FutureTask.java:269)
at java.util.concurrent.FutureTask.run(FutureTask.java:123)
at java.util.concurrent.ThreadPoolExecutor$Worker.runTask(ThreadPoolExecutor.java:651)
at java.util.concurrent.ThreadPoolExecutor$Worker.run(ThreadPoolExecutor.java:676)
at java.lang.Thread.run(Thread.java:595)
Caused by: org.apache.maven.plugin.MojoFailureException: 2 builds failed.
at org.apache.maven.plugin.invoker.InvokerSession.handleFailures(InvokerSession.java:263)
at org.apache.maven.plugin.invoker.VerifyMojo.execute(VerifyMojo.java:124)
at org.apache.maven.plugin.DefaultPluginManager.executeMojo(DefaultPluginManager.java:490)
at hudson.maven.agent.PluginManagerInterceptor.executeMojo(PluginManagerInterceptor.java:182)
at org.apache.maven.lifecycle.DefaultLifecycleExecutor.executeGoals(DefaultLifecycleExecutor.java:694)
... 28 more
[INFO] ------------------------------------------------------------------------
[INFO] Total time: 89 minutes 28 seconds
[INFO] Finished at: Wed Jan 25 08:20:55 UTC 2012
[INFO] Final Memory: 356M/456M
[INFO] ------------------------------------------------------------------------
Sending e-mails to: notifications@cxf.apache.org
channel stopped
[locks-and-latches] Releasing all the locks
[locks-and-latches] All the locks released
Jenkins build is back to normal : CXF-2.5-deploy #8
Posted by Apache Jenkins Server <je...@builds.apache.org>.
See <https://builds.apache.org/job/CXF-2.5-deploy/8/changes>