You are viewing a plain text version of this content. The canonical link for it is here.
Posted to commits@karaf.apache.org by Apache Jenkins Server <je...@builds.apache.org> on 2013/06/27 19:30:54 UTC

Build failed in Jenkins: Karaf-2.3.x #804

See <https://builds.apache.org/job/Karaf-2.3.x/804/changes>

Changes:

[jbonofre] [KARAF-2365] Fix realms selection by index in the jaas:manage command

------------------------------------------
[...truncated 2610 lines...]
[INFO] 
[INFO] --- maven-deploy-plugin:2.7:deploy (default-deploy) @ karaf ---
Downloading: https://repository.apache.org/content/repositories/snapshots/org/apache/karaf/karaf/2.3.2-SNAPSHOT/maven-metadata.xml
Downloaded: https://repository.apache.org/content/repositories/snapshots/org/apache/karaf/karaf/2.3.2-SNAPSHOT/maven-metadata.xml (602 B at 0.7 KB/sec)
Uploading: https://repository.apache.org/content/repositories/snapshots/org/apache/karaf/karaf/2.3.2-SNAPSHOT/karaf-2.3.2-20130627.172012-154.pom
Uploaded: https://repository.apache.org/content/repositories/snapshots/org/apache/karaf/karaf/2.3.2-SNAPSHOT/karaf-2.3.2-20130627.172012-154.pom (77 KB at 184.7 KB/sec)
Downloading: https://repository.apache.org/content/repositories/snapshots/org/apache/karaf/karaf/maven-metadata.xml
Downloaded: https://repository.apache.org/content/repositories/snapshots/org/apache/karaf/karaf/maven-metadata.xml (666 B at 0.2 KB/sec)
Uploading: https://repository.apache.org/content/repositories/snapshots/org/apache/karaf/karaf/2.3.2-SNAPSHOT/maven-metadata.xml
Uploaded: https://repository.apache.org/content/repositories/snapshots/org/apache/karaf/karaf/2.3.2-SNAPSHOT/maven-metadata.xml (602 B at 2.1 KB/sec)
Uploading: https://repository.apache.org/content/repositories/snapshots/org/apache/karaf/karaf/maven-metadata.xml
Uploaded: https://repository.apache.org/content/repositories/snapshots/org/apache/karaf/karaf/maven-metadata.xml (666 B at 1.9 KB/sec)
[INFO]                                                                         
[INFO] ------------------------------------------------------------------------
[INFO] Building Apache Karaf :: Util 2.3.2-SNAPSHOT
[INFO] ------------------------------------------------------------------------
[INFO] 
[INFO] --- maven-clean-plugin:2.5:clean (default-clean) @ org.apache.karaf.util ---
[INFO] 
[INFO] --- maven-bundle-plugin:2.3.7:cleanVersions (cleanVersions) @ org.apache.karaf.util ---
[INFO] 
[INFO] --- maven-remote-resources-plugin:1.3:process (default) @ org.apache.karaf.util ---
[INFO] 
[INFO] --- maven-antrun-plugin:1.7:run (copy-notice) @ org.apache.karaf.util ---
[INFO] Executing tasks

main:
     [copy] Copying 1 file to <https://builds.apache.org/job/Karaf-2.3.x/ws/karaf/util/target/maven-shared-archive-resources/META-INF>
[INFO] Executed tasks
[INFO] [debug] execute contextualize
[INFO] Using 'UTF-8' encoding to copy filtered resources.
[INFO] skip non existing resourceDirectory <https://builds.apache.org/job/Karaf-2.3.x/ws/karaf/util/src/main/resources>
[INFO] Copying 3 resources

[INFO] --- maven-resources-plugin:2.5:resources (default-resources) @ org.apache.karaf.util ---
[INFO] 
[INFO] --- maven-compiler-plugin:2.5.1:compile (default-compile) @ org.apache.karaf.util ---
[INFO] Compiling 8 source files to <https://builds.apache.org/job/Karaf-2.3.x/ws/karaf/util/target/classes>
[debug] execute contextualize
[INFO] [INFO] Using 'UTF-8' encoding to copy filtered resources.
[INFO] skip non existing resourceDirectory <https://builds.apache.org/job/Karaf-2.3.x/ws/karaf/util/src/test/resources>
[INFO] Copying 3 resources

[INFO] --- maven-resources-plugin:2.5:testResources (default-testResources) @ org.apache.karaf.util ---
[INFO] [INFO] Compiling 1 source file to <https://builds.apache.org/job/Karaf-2.3.x/ws/karaf/util/target/test-classes>

[INFO] --- maven-compiler-plugin:2.5.1:testCompile (default-testCompile) @ org.apache.karaf.util ---
[INFO] 
[INFO] --- maven-surefire-plugin:2.12:test (default-test) @ org.apache.karaf.util ---
[INFO] Surefire report directory: <https://builds.apache.org/job/Karaf-2.3.x/ws/karaf/util/target/surefire-reports>

-------------------------------------------------------
 T E S T S
-------------------------------------------------------
Running org.apache.karaf.util.DeployerUtilsTest
Tests run: 1, Failures: 0, Errors: 0, Skipped: 0, Time elapsed: 0.025 sec

Results :

Tests run: 1, Failures: 0, Errors: 0, Skipped: 0

[JENKINS] Recording test results
[INFO] 
[INFO] --- maven-jar-plugin:2.4:jar (default-jar) @ org.apache.karaf.util ---
[INFO] Building jar: <https://builds.apache.org/job/Karaf-2.3.x/ws/karaf/util/target/org.apache.karaf.util-2.3.2-SNAPSHOT.jar>
[INFO] 
[INFO] --- maven-site-plugin:3.2:attach-descriptor (attach-descriptor) @ org.apache.karaf.util ---
[INFO] [INFO] Installing <https://builds.apache.org/job/Karaf-2.3.x/ws/karaf/util/target/org.apache.karaf.util-2.3.2-SNAPSHOT.jar> to <https://builds.apache.org/job/Karaf-2.3.x/ws/.repository/org/apache/karaf/org.apache.karaf.util/2.3.2-SNAPSHOT/org.apache.karaf.util-2.3.2-SNAPSHOT.jar>
[INFO] Installing <https://builds.apache.org/job/Karaf-2.3.x/ws/karaf/util/pom.xml> to <https://builds.apache.org/job/Karaf-2.3.x/ws/.repository/org/apache/karaf/org.apache.karaf.util/2.3.2-SNAPSHOT/org.apache.karaf.util-2.3.2-SNAPSHOT.pom>

[INFO] --- maven-install-plugin:2.3.1:install (default-install) @ org.apache.karaf.util ---
[INFO] Downloading: https://repository.apache.org/content/repositories/snapshots/org/apache/karaf/org.apache.karaf.util/2.3.2-SNAPSHOT/maven-metadata.xml

[INFO] --- maven-deploy-plugin:2.7:deploy (default-deploy) @ org.apache.karaf.util ---
Downloaded: https://repository.apache.org/content/repositories/snapshots/org/apache/karaf/org.apache.karaf.util/2.3.2-SNAPSHOT/maven-metadata.xml (793 B at 0.5 KB/sec)
Uploading: https://repository.apache.org/content/repositories/snapshots/org/apache/karaf/org.apache.karaf.util/2.3.2-SNAPSHOT/org.apache.karaf.util-2.3.2-20130627.172031-153.jar
Uploaded: https://repository.apache.org/content/repositories/snapshots/org/apache/karaf/org.apache.karaf.util/2.3.2-SNAPSHOT/org.apache.karaf.util-2.3.2-20130627.172031-153.jar (38 KB at 116.1 KB/sec)
Uploading: https://repository.apache.org/content/repositories/snapshots/org/apache/karaf/org.apache.karaf.util/2.3.2-SNAPSHOT/org.apache.karaf.util-2.3.2-20130627.172031-153.pom
Uploaded: https://repository.apache.org/content/repositories/snapshots/org/apache/karaf/org.apache.karaf.util/2.3.2-SNAPSHOT/org.apache.karaf.util-2.3.2-20130627.172031-153.pom (3 KB at 6.5 KB/sec)
Downloading: https://repository.apache.org/content/repositories/snapshots/org/apache/karaf/org.apache.karaf.util/maven-metadata.xml
Downloaded: https://repository.apache.org/content/repositories/snapshots/org/apache/karaf/org.apache.karaf.util/maven-metadata.xml (601 B at 2.2 KB/sec)
Uploading: https://repository.apache.org/content/repositories/snapshots/org/apache/karaf/org.apache.karaf.util/2.3.2-SNAPSHOT/maven-metadata.xml
Uploaded: https://repository.apache.org/content/repositories/snapshots/org/apache/karaf/org.apache.karaf.util/2.3.2-SNAPSHOT/maven-metadata.xml (793 B at 2.6 KB/sec)
Uploading: https://repository.apache.org/content/repositories/snapshots/org/apache/karaf/org.apache.karaf.util/maven-metadata.xml
Uploaded: https://repository.apache.org/content/repositories/snapshots/org/apache/karaf/org.apache.karaf.util/maven-metadata.xml (601 B at 1.4 KB/sec)
[INFO]                                                                         
[INFO] ------------------------------------------------------------------------
[INFO] Building Apache Karaf :: Main 2.3.2-SNAPSHOT
[INFO] ------------------------------------------------------------------------
[INFO] 
[INFO] --- maven-clean-plugin:2.5:clean (default-clean) @ org.apache.karaf.main ---
[INFO] 
[INFO] --- maven-bundle-plugin:2.3.7:cleanVersions (cleanVersions) @ org.apache.karaf.main ---
[INFO] 
[INFO] --- maven-remote-resources-plugin:1.3:process (default) @ org.apache.karaf.main ---
[INFO] 
[INFO] --- maven-antrun-plugin:1.7:run (copy-notice) @ org.apache.karaf.main ---
[INFO] Executing tasks

main:
     [copy] Copying 1 file to <https://builds.apache.org/job/Karaf-2.3.x/ws/karaf/main/target/maven-shared-archive-resources/META-INF>
[INFO] Executed tasks
[INFO] [debug] execute contextualize
[INFO] Using 'UTF-8' encoding to copy filtered resources.
[INFO] Copying 2 resources

[INFO] --- maven-resources-plugin:2.5:resources (default-resources) @ org.apache.karaf.main ---
[INFO] Copying 3 resources
[INFO] [INFO] Compiling 17 source files to <https://builds.apache.org/job/Karaf-2.3.x/ws/karaf/main/target/classes>

[INFO] --- maven-compiler-plugin:2.5.1:compile (default-compile) @ org.apache.karaf.main ---
[INFO] [debug] execute contextualize
[INFO] Using 'UTF-8' encoding to copy filtered resources.

[INFO] --- maven-resources-plugin:2.5:testResources (default-testResources) @ org.apache.karaf.main ---
[INFO] Copying 5 resources
[INFO] Copying 3 resources
[INFO] [INFO] Compiling 18 source files to <https://builds.apache.org/job/Karaf-2.3.x/ws/karaf/main/target/test-classes>

[INFO] --- maven-compiler-plugin:2.5.1:testCompile (default-testCompile) @ org.apache.karaf.main ---
[INFO] [INFO] Surefire report directory: <https://builds.apache.org/job/Karaf-2.3.x/ws/karaf/main/target/surefire-reports>

-------------------------------------------------------
 T E S T S
-------------------------------------------------------

[INFO] --- maven-surefire-plugin:2.12:test (default-test) @ org.apache.karaf.main ---
Running org.apache.karaf.main.MySQLJDBCLockTest
Jun 27, 2013 5:20:38 PM org.apache.karaf.main.DefaultJDBCLock schemaExists
SEVERE: Error testing for db table: java.lang.NullPointerException
Jun 27, 2013 5:20:38 PM org.apache.karaf.main.DefaultJDBCLock createSchema
SEVERE: Could not create schema: java.lang.IllegalStateException: missing behavior definition for the preceding method call:
Connection.getMetaData()
Usage is: expect(a.foo()).andXXX()
Jun 27, 2013 5:20:38 PM org.apache.karaf.main.DefaultJDBCLock updateLock
WARNING: Failed to update database lock: java.sql.SQLException
Jun 27, 2013 5:20:38 PM org.apache.karaf.main.DefaultJDBCLock updateLock
WARNING: Failed to update database lock: java.sql.SQLException
Jun 27, 2013 5:20:38 PM org.apache.karaf.main.DefaultJDBCLock isAlive
SEVERE: Lost lock!
Jun 27, 2013 5:20:38 PM org.apache.karaf.main.DefaultJDBCLock isAlive
SEVERE: Lost lock!
Jun 27, 2013 5:20:38 PM org.apache.karaf.main.DefaultJDBCLock updateLock
WARNING: Failed to update database lock: java.sql.SQLException
Tests run: 14, Failures: 0, Errors: 0, Skipped: 0, Time elapsed: 0.192 sec
Running org.apache.karaf.main.OracleJDBCLockTest
Jun 27, 2013 5:20:38 PM org.apache.karaf.main.DefaultJDBCLock aquireLock
WARNING: Failed to acquire database lock: java.sql.SQLException
Jun 27, 2013 5:20:38 PM org.apache.karaf.main.DefaultJDBCLock aquireLock
WARNING: Failed to acquire database lock: java.sql.SQLException
Jun 27, 2013 5:20:38 PM org.apache.karaf.main.DefaultJDBCLock aquireLock
WARNING: Failed to acquire database lock: java.sql.SQLException
Jun 27, 2013 5:20:38 PM org.apache.karaf.main.DefaultJDBCLock isAlive
SEVERE: Lost lock!
Jun 27, 2013 5:20:38 PM org.apache.karaf.main.DefaultJDBCLock isAlive
SEVERE: Lost lock!
Tests run: 13, Failures: 0, Errors: 0, Skipped: 0, Time elapsed: 0.023 sec
Running org.apache.karaf.main.OracleJDBCLockIntegrationTest
Tests run: 1, Failures: 0, Errors: 0, Skipped: 1, Time elapsed: 0 sec
Running org.apache.karaf.main.PostgreSQLJDBCLockIntegrationTest
Tests run: 1, Failures: 0, Errors: 0, Skipped: 1, Time elapsed: 0 sec
Running org.apache.karaf.main.MySQLJDBCLockIntegrationTest
Tests run: 1, Failures: 0, Errors: 0, Skipped: 1, Time elapsed: 0 sec
Running org.apache.karaf.main.StatementsTest
Tests run: 6, Failures: 0, Errors: 0, Skipped: 0, Time elapsed: 0 sec
Running org.apache.karaf.main.MainLockingTest
Jun 27, 2013 5:20:39 PM org.ops4j.pax.swissbox.tinybundles.core.metadata.RawBuilder$1 run
INFO: Copy thread finished.
SLF4J: Failed to load class "org.slf4j.impl.StaticLoggerBinder".
SLF4J: Defaulting to no-operation (NOP) logger implementation
SLF4J: See http://www.slf4j.org/codes.html#StaticLoggerBinder for further details.
Jun 27, 2013 5:20:40 PM org.apache.karaf.main.Main doLock
INFO: Lost the lock, reducing start level to 1
Jun 27, 2013 5:20:51 PM org.apache.karaf.main.Main doLock
INFO: Waiting for the lock ...
Jun 27, 2013 5:20:52 PM org.apache.karaf.main.Main doLock
INFO: Lock acquired.
Tests run: 1, Failures: 0, Errors: 0, Skipped: 0, Time elapsed: 25.431 sec
Running org.apache.karaf.main.DefaultJDBCLockTest
Jun 27, 2013 5:21:03 PM org.apache.karaf.main.DefaultJDBCLock schemaExists
SEVERE: Error testing for db table: java.lang.NullPointerException
Jun 27, 2013 5:21:03 PM org.apache.karaf.main.DefaultJDBCLock createSchema
SEVERE: Could not create schema: java.lang.IllegalStateException: missing behavior definition for the preceding method call:
Connection.getMetaData()
Usage is: expect(a.foo()).andXXX()
Jun 27, 2013 5:21:03 PM org.apache.karaf.main.DefaultJDBCLock updateLock
WARNING: Failed to update database lock: java.sql.SQLException
Jun 27, 2013 5:21:03 PM org.apache.karaf.main.DefaultJDBCLock updateLock
WARNING: Failed to update database lock: java.sql.SQLException
Jun 27, 2013 5:21:03 PM org.apache.karaf.main.DefaultJDBCLock isAlive
SEVERE: Lost lock!
Jun 27, 2013 5:21:03 PM org.apache.karaf.main.DefaultJDBCLock isAlive
SEVERE: Lost lock!
Jun 27, 2013 5:21:03 PM org.apache.karaf.main.DefaultJDBCLock updateLock
WARNING: Failed to update database lock: java.sql.SQLException
Tests run: 14, Failures: 0, Errors: 0, Skipped: 0, Time elapsed: 0.024 sec
Running org.apache.karaf.main.DerbyJDBCLockIntegrationTest
Tests run: 1, Failures: 0, Errors: 0, Skipped: 1, Time elapsed: 0 sec
Running org.apache.karaf.main.StringMapTest
Tests run: 1, Failures: 0, Errors: 0, Skipped: 0, Time elapsed: 0.003 sec
Running org.apache.karaf.main.DefaultJDBCLockIntegrationTest
Tests run: 1, Failures: 0, Errors: 0, Skipped: 1, Time elapsed: 0 sec
Running org.apache.karaf.main.MainStartTest
Jun 27, 2013 5:21:04 PM org.ops4j.pax.swissbox.tinybundles.core.metadata.RawBuilder$1 run
INFO: Copy thread finished.
Tests run: 2, Failures: 0, Errors: 0, Skipped: 1, Time elapsed: 11.054 sec
Running org.apache.karaf.main.PostgreSQLJDBCLockTest
Jun 27, 2013 5:21:14 PM org.apache.karaf.main.DefaultJDBCLock schemaExists
SEVERE: Error testing for db table: java.lang.NullPointerException
Jun 27, 2013 5:21:14 PM org.apache.karaf.main.DefaultJDBCLock createSchema
SEVERE: Could not create schema: java.lang.IllegalStateException: missing behavior definition for the preceding method call:
Connection.getMetaData()
Usage is: expect(a.foo()).andXXX()
Jun 27, 2013 5:21:14 PM org.apache.karaf.main.DefaultJDBCLock updateLock
WARNING: Failed to update database lock: java.sql.SQLException
Jun 27, 2013 5:21:14 PM org.apache.karaf.main.DefaultJDBCLock updateLock
WARNING: Failed to update database lock: java.sql.SQLException
Jun 27, 2013 5:21:14 PM org.apache.karaf.main.DefaultJDBCLock isAlive
SEVERE: Lost lock!
Jun 27, 2013 5:21:14 PM org.apache.karaf.main.DefaultJDBCLock isAlive
SEVERE: Lost lock!
Jun 27, 2013 5:21:14 PM org.apache.karaf.main.DefaultJDBCLock updateLock
WARNING: Failed to update database lock: java.sql.SQLException
Tests run: 14, Failures: 0, Errors: 0, Skipped: 0, Time elapsed: 0.021 sec
Running org.apache.karaf.main.DerbyJDBCLockTest
Jun 27, 2013 5:21:14 PM org.apache.karaf.main.DefaultJDBCLock schemaExists
SEVERE: Error testing for db table: java.lang.NullPointerException
Jun 27, 2013 5:21:14 PM org.apache.karaf.main.DefaultJDBCLock createSchema
SEVERE: Could not create schema: java.lang.IllegalStateException: missing behavior definition for the preceding method call:
Connection.getMetaData()
Usage is: expect(a.foo()).andXXX()
Jun 27, 2013 5:21:14 PM org.apache.karaf.main.DefaultJDBCLock updateLock
WARNING: Failed to update database lock: java.sql.SQLException
Jun 27, 2013 5:21:14 PM org.apache.karaf.main.DefaultJDBCLock updateLock
WARNING: Failed to update database lock: java.sql.SQLException
Jun 27, 2013 5:21:14 PM org.apache.karaf.main.DefaultJDBCLock isAlive
SEVERE: Lost lock!
Jun 27, 2013 5:21:14 PM org.apache.karaf.main.DefaultJDBCLock isAlive
SEVERE: Lost lock!
Jun 27, 2013 5:21:14 PM org.apache.karaf.main.DefaultJDBCLock updateLock
WARNING: Failed to update database lock: java.sql.SQLException
Tests run: 14, Failures: 0, Errors: 0, Skipped: 0, Time elapsed: 0.018 sec

Results :

Tests run: 84, Failures: 0, Errors: 0, Skipped: 6

ERROR: Maven JVM terminated unexpectedly with exit code 143


Jenkins build is back to stable : Karaf-2.3.x #806

Posted by Apache Jenkins Server <je...@builds.apache.org>.
See <https://builds.apache.org/job/Karaf-2.3.x/806/changes>


Jenkins build is unstable: Karaf-2.3.x #805

Posted by Apache Jenkins Server <je...@builds.apache.org>.
See <https://builds.apache.org/job/Karaf-2.3.x/805/>