You are viewing a plain text version of this content. The canonical link for it is here.
Posted to builds@solr.apache.org by Apache Jenkins Server <je...@builds.apache.org> on 2024/11/03 23:57:29 UTC

[JENKINS] Solr » Solr-Test-9.7 - Build # 152 - Still Unstable!

Build: https://ci-builds.apache.org/job/Solr/job/Solr-Test-9.7/152/

1 tests failed.
FAILED:  org.apache.solr.search.TestStressVersions.testStressGetRealtimeVersions

Error Message:
com.carrotsearch.randomizedtesting.UncaughtExceptionError: Captured an uncaught exception in thread: Thread[id=19699, name=READER1, state=RUNNABLE, group=TGRP-TestStressVersions]

Stack Trace:
com.carrotsearch.randomizedtesting.UncaughtExceptionError: Captured an uncaught exception in thread: Thread[id=19699, name=READER1, state=RUNNABLE, group=TGRP-TestStressVersions]
	at __randomizedtesting.SeedInfo.seed([1BC8103454807EB9:1ECC010B19FC7AE5]:0)
Caused by: java.lang.RuntimeException: java.util.concurrent.RejectedExecutionException: Task org.apache.solr.common.util.ExecutorUtil$MDCAwareThreadPoolExecutor$$Lambda$385/0x0000000100573040@15fa817f rejected from org.apache.solr.common.util.ExecutorUtil$MDCAwareThreadPoolExecutor@219516d2[Running, pool size = 1, active threads = 1, queued tasks = 1000, completed tasks = 10294]
	at __randomizedtesting.SeedInfo.seed([1BC8103454807EB9]:0)
	at org.apache.solr.search.TestStressVersions$2.run(TestStressVersions.java:263)
Caused by: java.util.concurrent.RejectedExecutionException: Task org.apache.solr.common.util.ExecutorUtil$MDCAwareThreadPoolExecutor$$Lambda$385/0x0000000100573040@15fa817f rejected from org.apache.solr.common.util.ExecutorUtil$MDCAwareThreadPoolExecutor@219516d2[Running, pool size = 1, active threads = 1, queued tasks = 1000, completed tasks = 10294]
	at java.base/java.util.concurrent.ThreadPoolExecutor$AbortPolicy.rejectedExecution(ThreadPoolExecutor.java:2055)
	at java.base/java.util.concurrent.ThreadPoolExecutor.reject(ThreadPoolExecutor.java:825)
	at java.base/java.util.concurrent.ThreadPoolExecutor.execute(ThreadPoolExecutor.java:1355)
	at org.apache.solr.common.util.ExecutorUtil$MDCAwareThreadPoolExecutor.execute(ExecutorUtil.java:430)
	at org.apache.lucene.search.TaskExecutor$TaskGroup.invokeAll(TaskExecutor.java:152)
	at org.apache.lucene.search.TaskExecutor.invokeAll(TaskExecutor.java:76)
	at org.apache.lucene.index.TermStates.build(TermStates.java:116)
	at org.apache.lucene.search.TermQuery.createWeight(TermQuery.java:275)
	at org.apache.lucene.search.IndexSearcher.createWeight(IndexSearcher.java:882)
	at org.apache.lucene.search.IndexSearcher.search(IndexSearcher.java:560)
	at org.apache.solr.search.SolrIndexSearcher.buildAndRunCollectorChain(SolrIndexSearcher.java:276)
	at org.apache.solr.search.SolrIndexSearcher.getDocListNC(SolrIndexSearcher.java:1932)
	at org.apache.solr.search.SolrIndexSearcher.getDocListC(SolrIndexSearcher.java:1729)
	at org.apache.solr.search.SolrIndexSearcher.search(SolrIndexSearcher.java:726)
	at org.apache.solr.search.SolrIndexSearcher.search(SolrIndexSearcher.java:721)
	at org.apache.solr.handler.component.QueryComponent.doProcessUngroupedSearch(QueryComponent.java:1690)
	at org.apache.solr.handler.component.QueryComponent.process(QueryComponent.java:432)
	at org.apache.solr.handler.component.SearchHandler.handleRequestBody(SearchHandler.java:456)
	at org.apache.solr.handler.RequestHandlerBase.handleRequest(RequestHandlerBase.java:226)
	at org.apache.solr.core.SolrCore.execute(SolrCore.java:2880)
	at org.apache.solr.util.TestHarness.query(TestHarness.java:355)
	at org.apache.solr.util.TestHarness.query(TestHarness.java:335)
	at org.apache.solr.search.TestStressVersions$2.run(TestStressVersions.java:240)




Build Log:
[...truncated 6185 lines...]
ERROR: The following test(s) have failed:
  - org.apache.solr.search.TestStressVersions.testStressGetRealtimeVersions (:solr:core)
    Test history: https://ge.apache.org/scans/tests?search.rootProjectNames=solr-root&tests.container=org.apache.solr.search.TestStressVersions&tests.test=testStressGetRealtimeVersions http://fucit.org/solr-jenkins-reports/history-trend-of-recent-failures.html#series/org.apache.solr.search.TestStressVersions.testStressGetRealtimeVersions
    Test output: /home/jenkins/jenkins-slave/workspace/Solr/Solr-Test-9.7/solr/core/build/test-results/test/outputs/OUTPUT-org.apache.solr.search.TestStressVersions.txt
    Reproduce with: ./gradlew :solr:core:test --tests "org.apache.solr.search.TestStressVersions.testStressGetRealtimeVersions" -Ptests.jvms=4 -Ptests.haltonfailure=false "-Ptests.jvmargs=-XX:TieredStopAtLevel=1 -XX:+UseParallelGC -XX:ActiveProcessorCount=1 -XX:ReservedCodeCacheSize=120m" -Ptests.seed=1BC8103454807EB9 -Ptests.multiplier=2 -Ptests.badapples=false -Ptests.file.encoding=UTF-8


Deprecated Gradle features were used in this build, making it incompatible with Gradle 9.0.

You can use '--warning-mode all' to show the individual deprecation warnings and determine if they come from your own scripts or plugins.

For more on this, please refer to https://docs.gradle.org/8.4/userguide/command_line_interface.html#sec:command_line_warnings in the Gradle documentation.

BUILD SUCCESSFUL in 45m 55s
151 actionable tasks: 151 executed

Publishing build scan...
https://ge.apache.org/s/pdbhlcddu7fd4

Build step 'Invoke Gradle script' changed build result to SUCCESS
Archiving artifacts
‘**/*.events’ doesn’t match anything: ‘**’ exists but not ‘**/*.events’
No artifacts found that match the file pattern "**/*.events,heapdumps/**,**/hs_err_pid*". Configuration error?
Recording test results
[Checks API] No suitable checks publisher found.
Build step 'Publish JUnit test result report' changed build result to UNSTABLE
Email was triggered for: Unstable (Test Failures)
Sending email for trigger: Unstable (Test Failures)