You are viewing a plain text version of this content. The canonical link for it is here.
Posted to notifications@commons.apache.org by Apache Jenkins Server <je...@builds.apache.org> on 2026/08/25 18:16:29 UTC
Build failed in Jenkins: Commons » commons-compress-windows » Windows,jdk_1.8_latest_windows #529
See <https://ci-builds.apache.org/job/Commons/job/commons-compress-windows/OS=Windows,jdk=jdk_1.8_latest_windows/529/display/redirect?page=changes>
Changes:
[garydgregory] Bump github/codeql-action/init from 4.37.7 to 4.37.8
------------------------------------------
Started by upstream project "Commons/commons-compress-windows" build number 529
originally caused by:
Started by an SCM change
Running as SYSTEM
[EnvInject] - Loading node environment variables.
Building remotely on jenkins-win-azr-2 (Windows-Docker Windows) in workspace <https://ci-builds.apache.org/job/Commons/job/commons-compress-windows/OS=Windows,jdk=jdk_1.8_latest_windows/ws/>
The recommended git tool is: NONE
No credentials specified
> git rev-parse --resolve-git-dir <https://ci-builds.apache.org/job/Commons/job/commons-compress-windows/OS=Windows,jdk=jdk_1.8_latest_windows/ws/.git> # timeout=10
Fetching changes from the remote Git repository
> git config remote.origin.url https://github.com/apache/commons-compress.git # timeout=10
Fetching upstream changes from https://github.com/apache/commons-compress.git
> git --version # timeout=10
> git --version # 'git version 2.14.3.windows.1'
> git fetch --tags --progress -- https://github.com/apache/commons-compress.git +refs/heads/*:refs/remotes/origin/* # timeout=10
Checking out Revision cce8cde07c6e0405e9a08f978836f6b45a6f8d93 (refs/remotes/origin/master)
> git config core.sparsecheckout # timeout=10
> git checkout -f cce8cde07c6e0405e9a08f978836f6b45a6f8d93 # timeout=10
Commit message: "Bump github/codeql-action/init from 4.37.7 to 4.37.8"
> git rev-list --no-walk b0e13a9bee749ae2e214019a5f2968da85bd4f70 # timeout=10
[jdk_1.8_latest_windows] $ cmd.exe /C "f:\jenkins\tools\maven\latest\bin\mvn.cmd -V -B --no-transfer-progress -Dhttps.protocols=TLSv1.2 clean test && exit %%ERRORLEVEL%%"
Apache Maven 3.9.11 (3e54c93a704957b63ee3494413a2b544fd3d825b)
Maven home: f:\jenkins\tools\maven\latest
Java version: 1.8.0_362, vendor: Temurin, runtime: F:\jenkins\tools\java\latest1.8\jre
Default locale: en_US, platform encoding: Cp1252
OS name: "windows server 2022", version: "10.0", arch: "amd64", family: "windows"
[INFO] Scanning for projects...
[INFO]
[INFO] ----------------< org.apache.commons:commons-compress >-----------------
[INFO] Building Apache Commons Compress 1.29.0-SNAPSHOT
[INFO] from pom.xml
[INFO] --------------------------------[ jar ]---------------------------------
[INFO]
[INFO] --- clean:3.5.0:clean (default-clean) @ commons-compress ---
[INFO]
[INFO] --- enforcer:3.6.3:enforce (enforce-maven-version) @ commons-compress ---
[INFO] Rule 0: org.apache.maven.enforcer.rules.version.RequireMavenVersion passed
[INFO]
[INFO] --- enforcer:3.6.3:enforce (enforce-java-version) @ commons-compress ---
[INFO] Rule 0: org.apache.maven.enforcer.rules.version.RequireJavaVersion passed
[INFO]
[INFO] --- apache-rat:0.17:check (rat-check) @ commons-compress ---
[WARNING] Basedir is : <https://ci-builds.apache.org/job/Commons/job/commons-compress-windows/OS=Windows,jdk=jdk_1.8_latest_windows/ws/>
[ERROR] Could not create report parent directory <https://ci-builds.apache.org/job/Commons/job/commons-compress-windows/OS=Windows,jdk=jdk_1.8_latest_windows/ws/f>:\jenkins\jenkins-home\712657a4\workspace\Commons\commons-compress-windows\OS\Windows\jdk\jdk_1.8_latest_windows\target\rat.txt
[WARNING] Unable to create directory: <https://ci-builds.apache.org/job/Commons/job/commons-compress-windows/OS=Windows,jdk=jdk_1.8_latest_windows/ws/f>:\jenkins\jenkins-home\712657a4\workspace\Commons\commons-compress-windows\OS\Windows\jdk\jdk_1.8_latest_windows\target
[INFO] Excluding patterns: src/test/resources/**, .pmd, .projectile, .mvn/**, .gitattributes, site-content/**, .checkstyle, .fbprefs, .pmd, .asf.yaml, .gitattributes, src/site/resources/download_*.cgi, maven-eclipse.xml, .externalToolBuilders/**, .vscode/**, .project, .classpath, .settings/**, **/*.svg, **/*.xcf
[INFO] Excluding MAVEN collection.
[INFO] Excluding ECLIPSE collection.
[INFO] Excluding IDEA collection.
[INFO] Processing exclude file from STANDARD_SCMS.
[INFO] Excluding STANDARD_SCMS collection.
[INFO] Excluding MISC collection.
[INFO] Excluding HIDDEN_DIR collection.
[INFO] ------------------------------------------------------------------------
[INFO] BUILD FAILURE
[INFO] ------------------------------------------------------------------------
[INFO] Total time: 52.569 s
[INFO] Finished at: 2026-08-25T18:16:27Z
[INFO] ------------------------------------------------------------------------
[ERROR] Failed to execute goal org.apache.rat:apache-rat-plugin:0.17:check (rat-check) on project commons-compress: java.io.FileNotFoundException: <https://ci-builds.apache.org/job/Commons/job/commons-compress-windows/OS=Windows,jdk=jdk_1.8_latest_windows/ws/f>:\jenkins\jenkins-home\712657a4\workspace\Commons\commons-compress-windows\OS\Windows\jdk\jdk_1.8_latest_windows\target\rat.txt (The filename, directory name, or volume label syntax is incorrect) -> [Help 1]
[ERROR]
[ERROR] To see the full stack trace of the errors, re-run Maven with the -e switch.
[ERROR] Re-run Maven using the -X switch to enable full debug logging.
[ERROR]
[ERROR] For more information about the errors and possible solutions, please read the following articles:
[ERROR] [Help 1] http://cwiki.apache.org/confluence/display/MAVEN/MojoExecutionException
Build step 'Invoke top-level Maven targets' marked build as failure
Build failed in Jenkins: Commons » commons-compress-windows » Windows,jdk_1.8_latest_windows #552
Posted by Apache Jenkins Server <je...@builds.apache.org>.
See <https://ci-builds.apache.org/job/Commons/job/commons-compress-windows/OS=Windows,jdk=jdk_1.8_latest_windows/552/display/redirect?page=changes>
Changes:
[garydgregory] Bump github/codeql-action from 4.39.0 to 4.39.1
------------------------------------------
Started by upstream project "Commons/commons-compress-windows" build number 552
originally caused by:
Started by an SCM change
Running as SYSTEM
[EnvInject] - Loading node environment variables.
Building remotely on jenkins-win-azr-10 (Windows-Docker Windows) in workspace <https://ci-builds.apache.org/job/Commons/job/commons-compress-windows/OS=Windows,jdk=jdk_1.8_latest_windows/ws/>
The recommended git tool is: NONE
No credentials specified
> git rev-parse --resolve-git-dir <https://ci-builds.apache.org/job/Commons/job/commons-compress-windows/OS=Windows,jdk=jdk_1.8_latest_windows/ws/.git> # timeout=10
Fetching changes from the remote Git repository
> git config remote.origin.url https://github.com/apache/commons-compress.git # timeout=10
Fetching upstream changes from https://github.com/apache/commons-compress.git
> git --version # timeout=10
> git --version # 'git version 2.14.3.windows.1'
> git fetch --tags --progress -- https://github.com/apache/commons-compress.git +refs/heads/*:refs/remotes/origin/* # timeout=10
Checking out Revision 0c20dede0dfa566d7744583c1df384d43cc21bfa (refs/remotes/origin/master)
> git config core.sparsecheckout # timeout=10
> git checkout -f 0c20dede0dfa566d7744583c1df384d43cc21bfa # timeout=10
Commit message: "Bump github/codeql-action from 4.39.0 to 4.39.1"
> git rev-list --no-walk a91678cc89c26256400fa18d0ad10a9d19ffcbe1 # timeout=10
[jdk_1.8_latest_windows] $ cmd.exe /C "f:\jenkins\tools\maven\latest\bin\mvn.cmd -V -B --no-transfer-progress -Dhttps.protocols=TLSv1.2 clean test && exit %%ERRORLEVEL%%"
Apache Maven 3.9.16 (2bdd9fddda4b155ebf8000e807eb73fd829a51d5)
Maven home: f:\jenkins\tools\maven\latest
Java version: 1.8.0_362, vendor: Temurin, runtime: F:\jenkins\tools\java\latest1.8\jre
Default locale: en_US, platform encoding: Cp1252
OS name: "windows server 2019", version: "10.0", arch: "amd64", family: "windows"
[INFO] Scanning for projects...
[INFO]
[INFO] ----------------< org.apache.commons:commons-compress >-----------------
[INFO] Building Apache Commons Compress 1.29.0-SNAPSHOT
[INFO] from pom.xml
[INFO] --------------------------------[ jar ]---------------------------------
[INFO]
[INFO] --- clean:3.5.0:clean (default-clean) @ commons-compress ---
[INFO]
[INFO] --- enforcer:3.6.3:enforce (enforce-maven-version) @ commons-compress ---
[INFO] Rule 0: org.apache.maven.enforcer.rules.version.RequireMavenVersion passed
[INFO]
[INFO] --- enforcer:3.6.3:enforce (enforce-java-version) @ commons-compress ---
[INFO] Rule 0: org.apache.maven.enforcer.rules.version.RequireJavaVersion passed
[INFO]
[INFO] --- apache-rat:0.17:check (rat-check) @ commons-compress ---
[WARNING] Basedir is : <https://ci-builds.apache.org/job/Commons/job/commons-compress-windows/OS=Windows,jdk=jdk_1.8_latest_windows/ws/>
[ERROR] Could not create report parent directory <https://ci-builds.apache.org/job/Commons/job/commons-compress-windows/OS=Windows,jdk=jdk_1.8_latest_windows/ws/f>:\jenkins\jenkins-home\712657a4\workspace\Commons\commons-compress-windows\OS\Windows\jdk\jdk_1.8_latest_windows\target\rat.txt
[WARNING] Unable to create directory: <https://ci-builds.apache.org/job/Commons/job/commons-compress-windows/OS=Windows,jdk=jdk_1.8_latest_windows/ws/f>:\jenkins\jenkins-home\712657a4\workspace\Commons\commons-compress-windows\OS\Windows\jdk\jdk_1.8_latest_windows\target
[INFO] Excluding patterns: src/test/resources/**, .pmd, .projectile, .mvn/**, .gitattributes, site-content/**, .checkstyle, .fbprefs, .pmd, .asf.yaml, .gitattributes, src/site/resources/download_*.cgi, maven-eclipse.xml, .externalToolBuilders/**, .vscode/**, .project, .classpath, .settings/**, **/*.svg, **/*.xcf
[INFO] Excluding MAVEN collection.
[INFO] Excluding ECLIPSE collection.
[INFO] Excluding IDEA collection.
[INFO] Processing exclude file from STANDARD_SCMS.
[INFO] Excluding STANDARD_SCMS collection.
[INFO] Excluding MISC collection.
[INFO] Excluding HIDDEN_DIR collection.
[INFO] ------------------------------------------------------------------------
[INFO] BUILD FAILURE
[INFO] ------------------------------------------------------------------------
[INFO] Total time: 51.361 s
[INFO] Finished at: 2026-10-26T15:16:33Z
[INFO] ------------------------------------------------------------------------
[ERROR] Failed to execute goal org.apache.rat:apache-rat-plugin:0.17:check (rat-check) on project commons-compress: java.io.FileNotFoundException: <https://ci-builds.apache.org/job/Commons/job/commons-compress-windows/OS=Windows,jdk=jdk_1.8_latest_windows/ws/f>:\jenkins\jenkins-home\712657a4\workspace\Commons\commons-compress-windows\OS\Windows\jdk\jdk_1.8_latest_windows\target\rat.txt (The filename, directory name, or volume label syntax is incorrect) -> [Help 1]
[ERROR]
[ERROR] To see the full stack trace of the errors, re-run Maven with the -e switch.
[ERROR] Re-run Maven using the -X switch to enable full debug logging.
[ERROR]
[ERROR] For more information about the errors and possible solutions, please read the following articles:
[ERROR] [Help 1] http://cwiki.apache.org/confluence/display/MAVEN/MojoExecutionException
Build step 'Invoke top-level Maven targets' marked build as failure
Build failed in Jenkins: Commons » commons-compress-windows » Windows,jdk_1.8_latest_windows #551
Posted by Apache Jenkins Server <je...@builds.apache.org>.
See <https://ci-builds.apache.org/job/Commons/job/commons-compress-windows/OS=Windows,jdk=jdk_1.8_latest_windows/551/display/redirect?page=changes>
Changes:
[github] Bump com.github.luben:zstd-jni from 1.5.7-22 to 1.5.7-24 (#827)
[garydgregory] Bump com.github.luben:zstd-jni from 1.5.7-22 to 1.5.7-24 (#827)
------------------------------------------
Started by upstream project "Commons/commons-compress-windows" build number 551
originally caused by:
Started by an SCM change
Running as SYSTEM
[EnvInject] - Loading node environment variables.
Building remotely on jenkins-win-azr-6 (Windows-Docker Windows) in workspace <https://ci-builds.apache.org/job/Commons/job/commons-compress-windows/OS=Windows,jdk=jdk_1.8_latest_windows/ws/>
The recommended git tool is: NONE
No credentials specified
> git rev-parse --resolve-git-dir <https://ci-builds.apache.org/job/Commons/job/commons-compress-windows/OS=Windows,jdk=jdk_1.8_latest_windows/ws/.git> # timeout=10
Fetching changes from the remote Git repository
> git config remote.origin.url https://github.com/apache/commons-compress.git # timeout=10
Fetching upstream changes from https://github.com/apache/commons-compress.git
> git --version # timeout=10
> git --version # 'git version 2.14.3.windows.1'
> git fetch --tags --progress -- https://github.com/apache/commons-compress.git +refs/heads/*:refs/remotes/origin/* # timeout=10
Checking out Revision a91678cc89c26256400fa18d0ad10a9d19ffcbe1 (refs/remotes/origin/master)
> git config core.sparsecheckout # timeout=10
> git checkout -f a91678cc89c26256400fa18d0ad10a9d19ffcbe1 # timeout=10
Commit message: "Bump com.github.luben:zstd-jni from 1.5.7-22 to 1.5.7-24 (#827)"
> git rev-list --no-walk be13953fc467dad1e9bc83c727b79e070e9ad339 # timeout=10
[jdk_1.8_latest_windows] $ cmd.exe /C "f:\jenkins\tools\maven\latest\bin\mvn.cmd -V -B --no-transfer-progress -Dhttps.protocols=TLSv1.2 clean test && exit %%ERRORLEVEL%%"
Apache Maven 3.9.16 (2bdd9fddda4b155ebf8000e807eb73fd829a51d5)
Maven home: f:\jenkins\tools\maven\latest
Java version: 1.8.0_362, vendor: Temurin, runtime: F:\jenkins\tools\java\latest1.8\jre
Default locale: en_US, platform encoding: Cp1252
OS name: "windows server 2019", version: "10.0", arch: "amd64", family: "windows"
[INFO] Scanning for projects...
[INFO]
[INFO] ----------------< org.apache.commons:commons-compress >-----------------
[INFO] Building Apache Commons Compress 1.29.0-SNAPSHOT
[INFO] from pom.xml
[INFO] --------------------------------[ jar ]---------------------------------
[INFO]
[INFO] --- clean:3.5.0:clean (default-clean) @ commons-compress ---
[INFO]
[INFO] --- enforcer:3.6.3:enforce (enforce-maven-version) @ commons-compress ---
[INFO] Rule 0: org.apache.maven.enforcer.rules.version.RequireMavenVersion passed
[INFO]
[INFO] --- enforcer:3.6.3:enforce (enforce-java-version) @ commons-compress ---
[INFO] Rule 0: org.apache.maven.enforcer.rules.version.RequireJavaVersion passed
[INFO]
[INFO] --- apache-rat:0.17:check (rat-check) @ commons-compress ---
[WARNING] Basedir is : <https://ci-builds.apache.org/job/Commons/job/commons-compress-windows/OS=Windows,jdk=jdk_1.8_latest_windows/ws/>
[ERROR] Could not create report parent directory <https://ci-builds.apache.org/job/Commons/job/commons-compress-windows/OS=Windows,jdk=jdk_1.8_latest_windows/ws/f>:\jenkins\jenkins-home\712657a4\workspace\Commons\commons-compress-windows\OS\Windows\jdk\jdk_1.8_latest_windows\target\rat.txt
[WARNING] Unable to create directory: <https://ci-builds.apache.org/job/Commons/job/commons-compress-windows/OS=Windows,jdk=jdk_1.8_latest_windows/ws/f>:\jenkins\jenkins-home\712657a4\workspace\Commons\commons-compress-windows\OS\Windows\jdk\jdk_1.8_latest_windows\target
[INFO] Excluding patterns: src/test/resources/**, .pmd, .projectile, .mvn/**, .gitattributes, site-content/**, .checkstyle, .fbprefs, .pmd, .asf.yaml, .gitattributes, src/site/resources/download_*.cgi, maven-eclipse.xml, .externalToolBuilders/**, .vscode/**, .project, .classpath, .settings/**, **/*.svg, **/*.xcf
[INFO] Excluding MAVEN collection.
[INFO] Excluding ECLIPSE collection.
[INFO] Excluding IDEA collection.
[INFO] Processing exclude file from STANDARD_SCMS.
[INFO] Excluding STANDARD_SCMS collection.
[INFO] Excluding MISC collection.
[INFO] Excluding HIDDEN_DIR collection.
[INFO] ------------------------------------------------------------------------
[INFO] BUILD FAILURE
[INFO] ------------------------------------------------------------------------
[INFO] Total time: 43.909 s
[INFO] Finished at: 2026-10-22T22:16:32Z
[INFO] ------------------------------------------------------------------------
[ERROR] Failed to execute goal org.apache.rat:apache-rat-plugin:0.17:check (rat-check) on project commons-compress: java.io.FileNotFoundException: <https://ci-builds.apache.org/job/Commons/job/commons-compress-windows/OS=Windows,jdk=jdk_1.8_latest_windows/ws/f>:\jenkins\jenkins-home\712657a4\workspace\Commons\commons-compress-windows\OS\Windows\jdk\jdk_1.8_latest_windows\target\rat.txt (The filename, directory name, or volume label syntax is incorrect) -> [Help 1]
[ERROR]
[ERROR] To see the full stack trace of the errors, re-run Maven with the -e switch.
[ERROR] Re-run Maven using the -X switch to enable full debug logging.
[ERROR]
[ERROR] For more information about the errors and possible solutions, please read the following articles:
[ERROR] [Help 1] http://cwiki.apache.org/confluence/display/MAVEN/MojoExecutionException
Build step 'Invoke top-level Maven targets' marked build as failure
Build failed in Jenkins: Commons » commons-compress-windows » Windows,jdk_1.8_latest_windows #550
Posted by Apache Jenkins Server <je...@builds.apache.org>.
See <https://ci-builds.apache.org/job/Commons/job/commons-compress-windows/OS=Windows,jdk=jdk_1.8_latest_windows/550/display/redirect?page=changes>
Changes:
[garydgregory] Bump ossf/scorecard-action from 2.4.4 to 2.5.0
------------------------------------------
Started by upstream project "Commons/commons-compress-windows" build number 550
originally caused by:
Started by an SCM change
Running as SYSTEM
[EnvInject] - Loading node environment variables.
Building remotely on jenkins-win-azr-8 (Windows-Docker Windows) in workspace <https://ci-builds.apache.org/job/Commons/job/commons-compress-windows/OS=Windows,jdk=jdk_1.8_latest_windows/ws/>
The recommended git tool is: NONE
No credentials specified
> git rev-parse --resolve-git-dir <https://ci-builds.apache.org/job/Commons/job/commons-compress-windows/OS=Windows,jdk=jdk_1.8_latest_windows/ws/.git> # timeout=10
Fetching changes from the remote Git repository
> git config remote.origin.url https://github.com/apache/commons-compress.git # timeout=10
Fetching upstream changes from https://github.com/apache/commons-compress.git
> git --version # timeout=10
> git --version # 'git version 2.14.3.windows.1'
> git fetch --tags --progress -- https://github.com/apache/commons-compress.git +refs/heads/*:refs/remotes/origin/* # timeout=10
Checking out Revision be13953fc467dad1e9bc83c727b79e070e9ad339 (refs/remotes/origin/master)
> git config core.sparsecheckout # timeout=10
> git checkout -f be13953fc467dad1e9bc83c727b79e070e9ad339 # timeout=10
Commit message: "Bump ossf/scorecard-action from 2.4.4 to 2.5.0"
> git rev-list --no-walk c6278c26ee7da21ad486e967d935fa920ea1d3c2 # timeout=10
[jdk_1.8_latest_windows] $ cmd.exe /C "f:\jenkins\tools\maven\latest\bin\mvn.cmd -V -B --no-transfer-progress -Dhttps.protocols=TLSv1.2 clean test && exit %%ERRORLEVEL%%"
Apache Maven 3.9.16 (2bdd9fddda4b155ebf8000e807eb73fd829a51d5)
Maven home: f:\jenkins\tools\maven\latest
Java version: 1.8.0_362, vendor: Temurin, runtime: F:\jenkins\tools\java\latest1.8\jre
Default locale: en_US, platform encoding: Cp1252
OS name: "windows server 2019", version: "10.0", arch: "amd64", family: "windows"
[INFO] Scanning for projects...
[INFO]
[INFO] ----------------< org.apache.commons:commons-compress >-----------------
[INFO] Building Apache Commons Compress 1.29.0-SNAPSHOT
[INFO] from pom.xml
[INFO] --------------------------------[ jar ]---------------------------------
[INFO]
[INFO] --- clean:3.5.0:clean (default-clean) @ commons-compress ---
[INFO]
[INFO] --- enforcer:3.6.3:enforce (enforce-maven-version) @ commons-compress ---
[INFO] Rule 0: org.apache.maven.enforcer.rules.version.RequireMavenVersion passed
[INFO]
[INFO] --- enforcer:3.6.3:enforce (enforce-java-version) @ commons-compress ---
[INFO] Rule 0: org.apache.maven.enforcer.rules.version.RequireJavaVersion passed
[INFO]
[INFO] --- apache-rat:0.17:check (rat-check) @ commons-compress ---
[WARNING] Basedir is : <https://ci-builds.apache.org/job/Commons/job/commons-compress-windows/OS=Windows,jdk=jdk_1.8_latest_windows/ws/>
[ERROR] Could not create report parent directory <https://ci-builds.apache.org/job/Commons/job/commons-compress-windows/OS=Windows,jdk=jdk_1.8_latest_windows/ws/f>:\jenkins\jenkins-home\712657a4\workspace\Commons\commons-compress-windows\OS\Windows\jdk\jdk_1.8_latest_windows\target\rat.txt
[WARNING] Unable to create directory: <https://ci-builds.apache.org/job/Commons/job/commons-compress-windows/OS=Windows,jdk=jdk_1.8_latest_windows/ws/f>:\jenkins\jenkins-home\712657a4\workspace\Commons\commons-compress-windows\OS\Windows\jdk\jdk_1.8_latest_windows\target
[INFO] Excluding patterns: src/test/resources/**, .pmd, .projectile, .mvn/**, .gitattributes, site-content/**, .checkstyle, .fbprefs, .pmd, .asf.yaml, .gitattributes, src/site/resources/download_*.cgi, maven-eclipse.xml, .externalToolBuilders/**, .vscode/**, .project, .classpath, .settings/**, **/*.svg, **/*.xcf
[INFO] Excluding MAVEN collection.
[INFO] Excluding ECLIPSE collection.
[INFO] Excluding IDEA collection.
[INFO] Processing exclude file from STANDARD_SCMS.
[INFO] Excluding STANDARD_SCMS collection.
[INFO] Excluding MISC collection.
[INFO] Excluding HIDDEN_DIR collection.
[INFO] ------------------------------------------------------------------------
[INFO] BUILD FAILURE
[INFO] ------------------------------------------------------------------------
[INFO] Total time: 44.026 s
[INFO] Finished at: 2026-10-21T20:16:24Z
[INFO] ------------------------------------------------------------------------
[ERROR] Failed to execute goal org.apache.rat:apache-rat-plugin:0.17:check (rat-check) on project commons-compress: java.io.FileNotFoundException: <https://ci-builds.apache.org/job/Commons/job/commons-compress-windows/OS=Windows,jdk=jdk_1.8_latest_windows/ws/f>:\jenkins\jenkins-home\712657a4\workspace\Commons\commons-compress-windows\OS\Windows\jdk\jdk_1.8_latest_windows\target\rat.txt (The filename, directory name, or volume label syntax is incorrect) -> [Help 1]
[ERROR]
[ERROR] To see the full stack trace of the errors, re-run Maven with the -e switch.
[ERROR] Re-run Maven using the -X switch to enable full debug logging.
[ERROR]
[ERROR] For more information about the errors and possible solutions, please read the following articles:
[ERROR] [Help 1] http://cwiki.apache.org/confluence/display/MAVEN/MojoExecutionException
Build step 'Invoke top-level Maven targets' marked build as failure
Build failed in Jenkins: Commons » commons-compress-windows » Windows,jdk_1.8_latest_windows #549
Posted by Apache Jenkins Server <je...@builds.apache.org>.
See <https://ci-builds.apache.org/job/Commons/job/commons-compress-windows/OS=Windows,jdk=jdk_1.8_latest_windows/549/display/redirect?page=changes>
Changes:
[garydgregory] Bump github/codeql-action from 4.38.3 to 4.39.0
------------------------------------------
Started by upstream project "Commons/commons-compress-windows" build number 549
originally caused by:
Started by an SCM change
Running as SYSTEM
[EnvInject] - Loading node environment variables.
Building remotely on jenkins-win-azr-1 (Windows-Docker Windows) in workspace <https://ci-builds.apache.org/job/Commons/job/commons-compress-windows/OS=Windows,jdk=jdk_1.8_latest_windows/ws/>
The recommended git tool is: NONE
No credentials specified
> git rev-parse --resolve-git-dir <https://ci-builds.apache.org/job/Commons/job/commons-compress-windows/OS=Windows,jdk=jdk_1.8_latest_windows/ws/.git> # timeout=10
Fetching changes from the remote Git repository
> git config remote.origin.url https://github.com/apache/commons-compress.git # timeout=10
Fetching upstream changes from https://github.com/apache/commons-compress.git
> git --version # timeout=10
> git --version # 'git version 2.14.3.windows.1'
> git fetch --tags --progress -- https://github.com/apache/commons-compress.git +refs/heads/*:refs/remotes/origin/* # timeout=10
Checking out Revision c6278c26ee7da21ad486e967d935fa920ea1d3c2 (refs/remotes/origin/master)
> git config core.sparsecheckout # timeout=10
> git checkout -f c6278c26ee7da21ad486e967d935fa920ea1d3c2 # timeout=10
Commit message: "Bump github/codeql-action from 4.38.3 to 4.39.0"
> git rev-list --no-walk 611cad06b66842692870c6ae98f50de7ce4f25d5 # timeout=10
[jdk_1.8_latest_windows] $ cmd.exe /C "f:\jenkins\tools\maven\latest\bin\mvn.cmd -V -B --no-transfer-progress -Dhttps.protocols=TLSv1.2 clean test && exit %%ERRORLEVEL%%"
Apache Maven 3.9.16 (2bdd9fddda4b155ebf8000e807eb73fd829a51d5)
Maven home: f:\jenkins\tools\maven\latest
Java version: 1.8.0_362, vendor: Temurin, runtime: F:\jenkins\tools\java\latest1.8\jre
Default locale: en_US, platform encoding: Cp1252
OS name: "windows server 2019", version: "10.0", arch: "amd64", family: "windows"
[INFO] Scanning for projects...
[INFO]
[INFO] ----------------< org.apache.commons:commons-compress >-----------------
[INFO] Building Apache Commons Compress 1.29.0-SNAPSHOT
[INFO] from pom.xml
[INFO] --------------------------------[ jar ]---------------------------------
[INFO]
[INFO] --- clean:3.5.0:clean (default-clean) @ commons-compress ---
[INFO]
[INFO] --- enforcer:3.6.3:enforce (enforce-maven-version) @ commons-compress ---
[INFO] Rule 0: org.apache.maven.enforcer.rules.version.RequireMavenVersion passed
[INFO]
[INFO] --- enforcer:3.6.3:enforce (enforce-java-version) @ commons-compress ---
[INFO] Rule 0: org.apache.maven.enforcer.rules.version.RequireJavaVersion passed
[INFO]
[INFO] --- apache-rat:0.17:check (rat-check) @ commons-compress ---
[WARNING] Basedir is : <https://ci-builds.apache.org/job/Commons/job/commons-compress-windows/OS=Windows,jdk=jdk_1.8_latest_windows/ws/>
[ERROR] Could not create report parent directory <https://ci-builds.apache.org/job/Commons/job/commons-compress-windows/OS=Windows,jdk=jdk_1.8_latest_windows/ws/f>:\jenkins\jenkins-home\712657a4\workspace\Commons\commons-compress-windows\OS\Windows\jdk\jdk_1.8_latest_windows\target\rat.txt
[WARNING] Unable to create directory: <https://ci-builds.apache.org/job/Commons/job/commons-compress-windows/OS=Windows,jdk=jdk_1.8_latest_windows/ws/f>:\jenkins\jenkins-home\712657a4\workspace\Commons\commons-compress-windows\OS\Windows\jdk\jdk_1.8_latest_windows\target
[INFO] Excluding patterns: src/test/resources/**, .pmd, .projectile, .mvn/**, .gitattributes, site-content/**, .checkstyle, .fbprefs, .pmd, .asf.yaml, .gitattributes, src/site/resources/download_*.cgi, maven-eclipse.xml, .externalToolBuilders/**, .vscode/**, .project, .classpath, .settings/**, **/*.svg, **/*.xcf
[INFO] Excluding MAVEN collection.
[INFO] Excluding ECLIPSE collection.
[INFO] Excluding IDEA collection.
[INFO] Processing exclude file from STANDARD_SCMS.
[INFO] Excluding STANDARD_SCMS collection.
[INFO] Excluding MISC collection.
[INFO] Excluding HIDDEN_DIR collection.
[INFO] ------------------------------------------------------------------------
[INFO] BUILD FAILURE
[INFO] ------------------------------------------------------------------------
[INFO] Total time: 45.514 s
[INFO] Finished at: 2026-10-21T00:16:20Z
[INFO] ------------------------------------------------------------------------
[ERROR] Failed to execute goal org.apache.rat:apache-rat-plugin:0.17:check (rat-check) on project commons-compress: java.io.FileNotFoundException: <https://ci-builds.apache.org/job/Commons/job/commons-compress-windows/OS=Windows,jdk=jdk_1.8_latest_windows/ws/f>:\jenkins\jenkins-home\712657a4\workspace\Commons\commons-compress-windows\OS\Windows\jdk\jdk_1.8_latest_windows\target\rat.txt (The filename, directory name, or volume label syntax is incorrect) -> [Help 1]
[ERROR]
[ERROR] To see the full stack trace of the errors, re-run Maven with the -e switch.
[ERROR] Re-run Maven using the -X switch to enable full debug logging.
[ERROR]
[ERROR] For more information about the errors and possible solutions, please read the following articles:
[ERROR] [Help 1] http://cwiki.apache.org/confluence/display/MAVEN/MojoExecutionException
Build step 'Invoke top-level Maven targets' marked build as failure
Build failed in Jenkins: Commons » commons-compress-windows » Windows,jdk_1.8_latest_windows #548
Posted by Apache Jenkins Server <je...@builds.apache.org>.
See <https://ci-builds.apache.org/job/Commons/job/commons-compress-windows/OS=Windows,jdk=jdk_1.8_latest_windows/548/display/redirect?page=changes>
Changes:
[garydgregory] Bump actions/setup-java from 6.0.1 to 6.1.0
------------------------------------------
Started by upstream project "Commons/commons-compress-windows" build number 548
originally caused by:
Started by an SCM change
Running as SYSTEM
[EnvInject] - Loading node environment variables.
Building remotely on jenkins-win-azr-1 (Windows-Docker Windows) in workspace <https://ci-builds.apache.org/job/Commons/job/commons-compress-windows/OS=Windows,jdk=jdk_1.8_latest_windows/ws/>
The recommended git tool is: NONE
No credentials specified
> git rev-parse --resolve-git-dir <https://ci-builds.apache.org/job/Commons/job/commons-compress-windows/OS=Windows,jdk=jdk_1.8_latest_windows/ws/.git> # timeout=10
Fetching changes from the remote Git repository
> git config remote.origin.url https://github.com/apache/commons-compress.git # timeout=10
Fetching upstream changes from https://github.com/apache/commons-compress.git
> git --version # timeout=10
> git --version # 'git version 2.14.3.windows.1'
> git fetch --tags --progress -- https://github.com/apache/commons-compress.git +refs/heads/*:refs/remotes/origin/* # timeout=10
Checking out Revision 611cad06b66842692870c6ae98f50de7ce4f25d5 (refs/remotes/origin/master)
> git config core.sparsecheckout # timeout=10
> git checkout -f 611cad06b66842692870c6ae98f50de7ce4f25d5 # timeout=10
Commit message: "Bump actions/setup-java from 6.0.1 to 6.1.0"
> git rev-list --no-walk 5990cb6c76c6d1e34e7ffccb3c2fb25906b47278 # timeout=10
[jdk_1.8_latest_windows] $ cmd.exe /C "f:\jenkins\tools\maven\latest\bin\mvn.cmd -V -B --no-transfer-progress -Dhttps.protocols=TLSv1.2 clean test && exit %%ERRORLEVEL%%"
Apache Maven 3.9.16 (2bdd9fddda4b155ebf8000e807eb73fd829a51d5)
Maven home: f:\jenkins\tools\maven\latest
Java version: 1.8.0_362, vendor: Temurin, runtime: F:\jenkins\tools\java\latest1.8\jre
Default locale: en_US, platform encoding: Cp1252
OS name: "windows server 2019", version: "10.0", arch: "amd64", family: "windows"
[INFO] Scanning for projects...
[INFO]
[INFO] ----------------< org.apache.commons:commons-compress >-----------------
[INFO] Building Apache Commons Compress 1.29.0-SNAPSHOT
[INFO] from pom.xml
[INFO] --------------------------------[ jar ]---------------------------------
[INFO]
[INFO] --- clean:3.5.0:clean (default-clean) @ commons-compress ---
[INFO]
[INFO] --- enforcer:3.6.3:enforce (enforce-maven-version) @ commons-compress ---
[INFO] Rule 0: org.apache.maven.enforcer.rules.version.RequireMavenVersion passed
[INFO]
[INFO] --- enforcer:3.6.3:enforce (enforce-java-version) @ commons-compress ---
[INFO] Rule 0: org.apache.maven.enforcer.rules.version.RequireJavaVersion passed
[INFO]
[INFO] --- apache-rat:0.17:check (rat-check) @ commons-compress ---
[WARNING] Basedir is : <https://ci-builds.apache.org/job/Commons/job/commons-compress-windows/OS=Windows,jdk=jdk_1.8_latest_windows/ws/>
[ERROR] Could not create report parent directory <https://ci-builds.apache.org/job/Commons/job/commons-compress-windows/OS=Windows,jdk=jdk_1.8_latest_windows/ws/f>:\jenkins\jenkins-home\712657a4\workspace\Commons\commons-compress-windows\OS\Windows\jdk\jdk_1.8_latest_windows\target\rat.txt
[WARNING] Unable to create directory: <https://ci-builds.apache.org/job/Commons/job/commons-compress-windows/OS=Windows,jdk=jdk_1.8_latest_windows/ws/f>:\jenkins\jenkins-home\712657a4\workspace\Commons\commons-compress-windows\OS\Windows\jdk\jdk_1.8_latest_windows\target
[INFO] Excluding patterns: src/test/resources/**, .pmd, .projectile, .mvn/**, .gitattributes, site-content/**, .checkstyle, .fbprefs, .pmd, .asf.yaml, .gitattributes, src/site/resources/download_*.cgi, maven-eclipse.xml, .externalToolBuilders/**, .vscode/**, .project, .classpath, .settings/**, **/*.svg, **/*.xcf
[INFO] Excluding MAVEN collection.
[INFO] Excluding ECLIPSE collection.
[INFO] Excluding IDEA collection.
[INFO] Processing exclude file from STANDARD_SCMS.
[INFO] Excluding STANDARD_SCMS collection.
[INFO] Excluding MISC collection.
[INFO] Excluding HIDDEN_DIR collection.
[INFO] ------------------------------------------------------------------------
[INFO] BUILD FAILURE
[INFO] ------------------------------------------------------------------------
[INFO] Total time: 01:25 min
[INFO] Finished at: 2026-10-17T20:17:20Z
[INFO] ------------------------------------------------------------------------
[ERROR] Failed to execute goal org.apache.rat:apache-rat-plugin:0.17:check (rat-check) on project commons-compress: java.io.FileNotFoundException: <https://ci-builds.apache.org/job/Commons/job/commons-compress-windows/OS=Windows,jdk=jdk_1.8_latest_windows/ws/f>:\jenkins\jenkins-home\712657a4\workspace\Commons\commons-compress-windows\OS\Windows\jdk\jdk_1.8_latest_windows\target\rat.txt (The filename, directory name, or volume label syntax is incorrect) -> [Help 1]
[ERROR]
[ERROR] To see the full stack trace of the errors, re-run Maven with the -e switch.
[ERROR] Re-run Maven using the -X switch to enable full debug logging.
[ERROR]
[ERROR] For more information about the errors and possible solutions, please read the following articles:
[ERROR] [Help 1] http://cwiki.apache.org/confluence/display/MAVEN/MojoExecutionException
Build step 'Invoke top-level Maven targets' marked build as failure
Build failed in Jenkins: Commons » commons-compress-windows » Windows,jdk_1.8_latest_windows #547
Posted by Apache Jenkins Server <je...@builds.apache.org>.
See <https://ci-builds.apache.org/job/Commons/job/commons-compress-windows/OS=Windows,jdk=jdk_1.8_latest_windows/547/display/redirect?page=changes>
Changes:
[github] Bump Apache Commons Parent from 105 to 106 (#823)
[garydgregory] Bump org.apache.commons:commons-parent from 105 to 106
------------------------------------------
Started by upstream project "Commons/commons-compress-windows" build number 547
originally caused by:
Started by an SCM change
Running as SYSTEM
[EnvInject] - Loading node environment variables.
Building remotely on jenkins-win-azr-3 (Windows-Docker Windows) in workspace <https://ci-builds.apache.org/job/Commons/job/commons-compress-windows/OS=Windows,jdk=jdk_1.8_latest_windows/ws/>
The recommended git tool is: NONE
No credentials specified
> git rev-parse --resolve-git-dir <https://ci-builds.apache.org/job/Commons/job/commons-compress-windows/OS=Windows,jdk=jdk_1.8_latest_windows/ws/.git> # timeout=10
Fetching changes from the remote Git repository
> git config remote.origin.url https://github.com/apache/commons-compress.git # timeout=10
Fetching upstream changes from https://github.com/apache/commons-compress.git
> git --version # timeout=10
> git --version # 'git version 2.14.3.windows.1'
> git fetch --tags --progress -- https://github.com/apache/commons-compress.git +refs/heads/*:refs/remotes/origin/* # timeout=10
Checking out Revision 5990cb6c76c6d1e34e7ffccb3c2fb25906b47278 (refs/remotes/origin/master)
> git config core.sparsecheckout # timeout=10
> git checkout -f 5990cb6c76c6d1e34e7ffccb3c2fb25906b47278 # timeout=10
Commit message: "Bump org.apache.commons:commons-parent from 105 to 106"
> git rev-list --no-walk 16c030168ce3f10feb0e9c9762a4bc0474859f5d # timeout=10
[jdk_1.8_latest_windows] $ cmd.exe /C "f:\jenkins\tools\maven\latest\bin\mvn.cmd -V -B --no-transfer-progress -Dhttps.protocols=TLSv1.2 clean test && exit %%ERRORLEVEL%%"
Apache Maven 3.9.16 (2bdd9fddda4b155ebf8000e807eb73fd829a51d5)
Maven home: f:\jenkins\tools\maven\latest
Java version: 1.8.0_362, vendor: Temurin, runtime: F:\jenkins\tools\java\latest1.8\jre
Default locale: en_US, platform encoding: Cp1252
OS name: "windows server 2019", version: "10.0", arch: "amd64", family: "windows"
[INFO] Scanning for projects...
[INFO]
[INFO] ----------------< org.apache.commons:commons-compress >-----------------
[INFO] Building Apache Commons Compress 1.29.0-SNAPSHOT
[INFO] from pom.xml
[INFO] --------------------------------[ jar ]---------------------------------
[INFO]
[INFO] --- clean:3.5.0:clean (default-clean) @ commons-compress ---
[INFO]
[INFO] --- enforcer:3.6.3:enforce (enforce-maven-version) @ commons-compress ---
[INFO] Rule 0: org.apache.maven.enforcer.rules.version.RequireMavenVersion passed
[INFO]
[INFO] --- enforcer:3.6.3:enforce (enforce-java-version) @ commons-compress ---
[INFO] Rule 0: org.apache.maven.enforcer.rules.version.RequireJavaVersion passed
[INFO]
[INFO] --- apache-rat:0.17:check (rat-check) @ commons-compress ---
[WARNING] Basedir is : <https://ci-builds.apache.org/job/Commons/job/commons-compress-windows/OS=Windows,jdk=jdk_1.8_latest_windows/ws/>
[ERROR] Could not create report parent directory <https://ci-builds.apache.org/job/Commons/job/commons-compress-windows/OS=Windows,jdk=jdk_1.8_latest_windows/ws/f>:\jenkins\jenkins-home\712657a4\workspace\Commons\commons-compress-windows\OS\Windows\jdk\jdk_1.8_latest_windows\target\rat.txt
[WARNING] Unable to create directory: <https://ci-builds.apache.org/job/Commons/job/commons-compress-windows/OS=Windows,jdk=jdk_1.8_latest_windows/ws/f>:\jenkins\jenkins-home\712657a4\workspace\Commons\commons-compress-windows\OS\Windows\jdk\jdk_1.8_latest_windows\target
[INFO] Excluding patterns: src/test/resources/**, .pmd, .projectile, .mvn/**, .gitattributes, site-content/**, .checkstyle, .fbprefs, .pmd, .asf.yaml, .gitattributes, src/site/resources/download_*.cgi, maven-eclipse.xml, .externalToolBuilders/**, .vscode/**, .project, .classpath, .settings/**, **/*.svg, **/*.xcf
[INFO] Excluding MAVEN collection.
[INFO] Excluding ECLIPSE collection.
[INFO] Excluding IDEA collection.
[INFO] Processing exclude file from STANDARD_SCMS.
[INFO] Excluding STANDARD_SCMS collection.
[INFO] Excluding MISC collection.
[INFO] Excluding HIDDEN_DIR collection.
[INFO] ------------------------------------------------------------------------
[INFO] BUILD FAILURE
[INFO] ------------------------------------------------------------------------
[INFO] Total time: 01:21 min
[INFO] Finished at: 2026-10-17T17:18:01Z
[INFO] ------------------------------------------------------------------------
[ERROR] Failed to execute goal org.apache.rat:apache-rat-plugin:0.17:check (rat-check) on project commons-compress: java.io.FileNotFoundException: <https://ci-builds.apache.org/job/Commons/job/commons-compress-windows/OS=Windows,jdk=jdk_1.8_latest_windows/ws/f>:\jenkins\jenkins-home\712657a4\workspace\Commons\commons-compress-windows\OS\Windows\jdk\jdk_1.8_latest_windows\target\rat.txt (The filename, directory name, or volume label syntax is incorrect) -> [Help 1]
[ERROR]
[ERROR] To see the full stack trace of the errors, re-run Maven with the -e switch.
[ERROR] Re-run Maven using the -X switch to enable full debug logging.
[ERROR]
[ERROR] For more information about the errors and possible solutions, please read the following articles:
[ERROR] [Help 1] http://cwiki.apache.org/confluence/display/MAVEN/MojoExecutionException
Build step 'Invoke top-level Maven targets' marked build as failure
Build failed in Jenkins: Commons » commons-compress-windows » Windows,jdk_1.8_latest_windows #546
Posted by Apache Jenkins Server <je...@builds.apache.org>.
See <https://ci-builds.apache.org/job/Commons/job/commons-compress-windows/OS=Windows,jdk=jdk_1.8_latest_windows/546/display/redirect?page=changes>
Changes:
[garydgregory] Revert "Bump github/codeql-action/analyze from 4.37.5 to 4.38.3"
[garydgregory] Bump github/codeql-action/analyze from 4.37.5 to 4.38.3
------------------------------------------
Started by upstream project "Commons/commons-compress-windows" build number 546
originally caused by:
Started by an SCM change
Running as SYSTEM
[EnvInject] - Loading node environment variables.
Building remotely on jenkins-win-azr-11 (Windows-Docker Windows) in workspace <https://ci-builds.apache.org/job/Commons/job/commons-compress-windows/OS=Windows,jdk=jdk_1.8_latest_windows/ws/>
The recommended git tool is: NONE
No credentials specified
> git rev-parse --resolve-git-dir <https://ci-builds.apache.org/job/Commons/job/commons-compress-windows/OS=Windows,jdk=jdk_1.8_latest_windows/ws/.git> # timeout=10
Fetching changes from the remote Git repository
> git config remote.origin.url https://github.com/apache/commons-compress.git # timeout=10
Fetching upstream changes from https://github.com/apache/commons-compress.git
> git --version # timeout=10
> git --version # 'git version 2.14.3.windows.1'
> git fetch --tags --progress -- https://github.com/apache/commons-compress.git +refs/heads/*:refs/remotes/origin/* # timeout=10
Checking out Revision 16c030168ce3f10feb0e9c9762a4bc0474859f5d (refs/remotes/origin/master)
> git config core.sparsecheckout # timeout=10
> git checkout -f 16c030168ce3f10feb0e9c9762a4bc0474859f5d # timeout=10
Commit message: "Bump github/codeql-action/analyze from 4.37.5 to 4.38.3"
> git rev-list --no-walk f07da6cad2e6240b5884c4fdaf39651fc9cca096 # timeout=10
[jdk_1.8_latest_windows] $ cmd.exe /C "f:\jenkins\tools\maven\latest\bin\mvn.cmd -V -B --no-transfer-progress -Dhttps.protocols=TLSv1.2 clean test && exit %%ERRORLEVEL%%"
Apache Maven 3.9.16 (2bdd9fddda4b155ebf8000e807eb73fd829a51d5)
Maven home: f:\jenkins\tools\maven\latest
Java version: 1.8.0_362, vendor: Temurin, runtime: F:\jenkins\tools\java\latest1.8\jre
Default locale: en_US, platform encoding: Cp1252
OS name: "windows server 2019", version: "10.0", arch: "amd64", family: "windows"
[INFO] Scanning for projects...
[INFO]
[INFO] ----------------< org.apache.commons:commons-compress >-----------------
[INFO] Building Apache Commons Compress 1.29.0-SNAPSHOT
[INFO] from pom.xml
[INFO] --------------------------------[ jar ]---------------------------------
[INFO]
[INFO] --- clean:3.5.0:clean (default-clean) @ commons-compress ---
[INFO]
[INFO] --- enforcer:3.6.3:enforce (enforce-maven-version) @ commons-compress ---
[INFO] Rule 0: org.apache.maven.enforcer.rules.version.RequireMavenVersion passed
[INFO]
[INFO] --- enforcer:3.6.3:enforce (enforce-java-version) @ commons-compress ---
[INFO] Rule 0: org.apache.maven.enforcer.rules.version.RequireJavaVersion passed
[INFO]
[INFO] --- apache-rat:0.17:check (rat-check) @ commons-compress ---
[WARNING] Basedir is : <https://ci-builds.apache.org/job/Commons/job/commons-compress-windows/OS=Windows,jdk=jdk_1.8_latest_windows/ws/>
[ERROR] Could not create report parent directory <https://ci-builds.apache.org/job/Commons/job/commons-compress-windows/OS=Windows,jdk=jdk_1.8_latest_windows/ws/f>:\jenkins\jenkins-home\712657a4\workspace\Commons\commons-compress-windows\OS\Windows\jdk\jdk_1.8_latest_windows\target\rat.txt
[WARNING] Unable to create directory: <https://ci-builds.apache.org/job/Commons/job/commons-compress-windows/OS=Windows,jdk=jdk_1.8_latest_windows/ws/f>:\jenkins\jenkins-home\712657a4\workspace\Commons\commons-compress-windows\OS\Windows\jdk\jdk_1.8_latest_windows\target
[INFO] Excluding patterns: src/test/resources/**, .pmd, .projectile, .mvn/**, .gitattributes, site-content/**, .checkstyle, .fbprefs, .pmd, .asf.yaml, .gitattributes, src/site/resources/download_*.cgi, maven-eclipse.xml, .externalToolBuilders/**, .vscode/**, .project, .classpath, .settings/**, **/*.svg, **/*.xcf
[INFO] Excluding MAVEN collection.
[INFO] Excluding ECLIPSE collection.
[INFO] Excluding IDEA collection.
[INFO] Processing exclude file from STANDARD_SCMS.
[INFO] Excluding STANDARD_SCMS collection.
[INFO] Excluding MISC collection.
[INFO] Excluding HIDDEN_DIR collection.
[INFO] ------------------------------------------------------------------------
[INFO] BUILD FAILURE
[INFO] ------------------------------------------------------------------------
[INFO] Total time: 39.807 s
[INFO] Finished at: 2026-10-17T07:19:48Z
[INFO] ------------------------------------------------------------------------
[ERROR] Failed to execute goal org.apache.rat:apache-rat-plugin:0.17:check (rat-check) on project commons-compress: java.io.FileNotFoundException: <https://ci-builds.apache.org/job/Commons/job/commons-compress-windows/OS=Windows,jdk=jdk_1.8_latest_windows/ws/f>:\jenkins\jenkins-home\712657a4\workspace\Commons\commons-compress-windows\OS\Windows\jdk\jdk_1.8_latest_windows\target\rat.txt (The filename, directory name, or volume label syntax is incorrect) -> [Help 1]
[ERROR]
[ERROR] To see the full stack trace of the errors, re-run Maven with the -e switch.
[ERROR] Re-run Maven using the -X switch to enable full debug logging.
[ERROR]
[ERROR] For more information about the errors and possible solutions, please read the following articles:
[ERROR] [Help 1] http://cwiki.apache.org/confluence/display/MAVEN/MojoExecutionException
Build step 'Invoke top-level Maven targets' marked build as failure
Build failed in Jenkins: Commons » commons-compress-windows » Windows,jdk_1.8_latest_windows #544
Posted by Apache Jenkins Server <je...@builds.apache.org>.
See <https://ci-builds.apache.org/job/Commons/job/commons-compress-windows/OS=Windows,jdk=jdk_1.8_latest_windows/544/display/redirect?page=changes>
Changes:
[garydgregory] Bump actions/upload-artifact from 7.0.1 to 7.0.2
[garydgregory] Bump github/codeql-action/analyze from 4.37.5 to 4.38.3
------------------------------------------
Started by upstream project "Commons/commons-compress-windows" build number 545
originally caused by:
Started by an SCM change
Running as SYSTEM
[EnvInject] - Loading node environment variables.
Building remotely on jenkins-win-azr-5 (Windows-Docker Windows) in workspace <https://ci-builds.apache.org/job/Commons/job/commons-compress-windows/OS=Windows,jdk=jdk_1.8_latest_windows/ws/>
The recommended git tool is: NONE
No credentials specified
> git rev-parse --resolve-git-dir <https://ci-builds.apache.org/job/Commons/job/commons-compress-windows/OS=Windows,jdk=jdk_1.8_latest_windows/ws/.git> # timeout=10
Fetching changes from the remote Git repository
> git config remote.origin.url https://github.com/apache/commons-compress.git # timeout=10
Fetching upstream changes from https://github.com/apache/commons-compress.git
> git --version # timeout=10
> git --version # 'git version 2.14.3.windows.1'
> git fetch --tags --progress -- https://github.com/apache/commons-compress.git +refs/heads/*:refs/remotes/origin/* # timeout=10
Checking out Revision f07da6cad2e6240b5884c4fdaf39651fc9cca096 (refs/remotes/origin/master)
> git config core.sparsecheckout # timeout=10
> git checkout -f f07da6cad2e6240b5884c4fdaf39651fc9cca096 # timeout=10
Commit message: "Bump github/codeql-action/analyze from 4.37.5 to 4.38.3"
> git rev-list --no-walk 0ff3a01ab1c73e0c0f5c7aefcc495db1cd829ce9 # timeout=10
[jdk_1.8_latest_windows] $ cmd.exe /C "f:\jenkins\tools\maven\latest\bin\mvn.cmd -V -B --no-transfer-progress -Dhttps.protocols=TLSv1.2 clean test && exit %%ERRORLEVEL%%"
Apache Maven 3.9.16 (2bdd9fddda4b155ebf8000e807eb73fd829a51d5)
Maven home: f:\jenkins\tools\maven\latest
Java version: 1.8.0_362, vendor: Temurin, runtime: F:\jenkins\tools\java\latest1.8\jre
Default locale: en_US, platform encoding: Cp1252
OS name: "windows server 2019", version: "10.0", arch: "amd64", family: "windows"
[INFO] Scanning for projects...
[INFO]
[INFO] ----------------< org.apache.commons:commons-compress >-----------------
[INFO] Building Apache Commons Compress 1.29.0-SNAPSHOT
[INFO] from pom.xml
[INFO] --------------------------------[ jar ]---------------------------------
[INFO]
[INFO] --- clean:3.5.0:clean (default-clean) @ commons-compress ---
[INFO]
[INFO] --- enforcer:3.6.3:enforce (enforce-maven-version) @ commons-compress ---
[INFO] Rule 0: org.apache.maven.enforcer.rules.version.RequireMavenVersion passed
[INFO]
[INFO] --- enforcer:3.6.3:enforce (enforce-java-version) @ commons-compress ---
[INFO] Rule 0: org.apache.maven.enforcer.rules.version.RequireJavaVersion passed
[INFO]
[INFO] --- apache-rat:0.17:check (rat-check) @ commons-compress ---
[WARNING] Basedir is : <https://ci-builds.apache.org/job/Commons/job/commons-compress-windows/OS=Windows,jdk=jdk_1.8_latest_windows/ws/>
[ERROR] Could not create report parent directory <https://ci-builds.apache.org/job/Commons/job/commons-compress-windows/OS=Windows,jdk=jdk_1.8_latest_windows/ws/f>:\jenkins\jenkins-home\712657a4\workspace\Commons\commons-compress-windows\OS\Windows\jdk\jdk_1.8_latest_windows\target\rat.txt
[WARNING] Unable to create directory: <https://ci-builds.apache.org/job/Commons/job/commons-compress-windows/OS=Windows,jdk=jdk_1.8_latest_windows/ws/f>:\jenkins\jenkins-home\712657a4\workspace\Commons\commons-compress-windows\OS\Windows\jdk\jdk_1.8_latest_windows\target
[INFO] Excluding patterns: src/test/resources/**, .pmd, .projectile, .mvn/**, .gitattributes, site-content/**, .checkstyle, .fbprefs, .pmd, .asf.yaml, .gitattributes, src/site/resources/download_*.cgi, maven-eclipse.xml, .externalToolBuilders/**, .vscode/**, .project, .classpath, .settings/**, **/*.svg, **/*.xcf
[INFO] Excluding MAVEN collection.
[INFO] Excluding ECLIPSE collection.
[INFO] Excluding IDEA collection.
[INFO] Processing exclude file from STANDARD_SCMS.
[INFO] Excluding STANDARD_SCMS collection.
[INFO] Excluding MISC collection.
[INFO] Excluding HIDDEN_DIR collection.
[INFO] ------------------------------------------------------------------------
[INFO] BUILD FAILURE
[INFO] ------------------------------------------------------------------------
[INFO] Total time: 01:21 min
[INFO] Finished at: 2026-10-17T06:39:10Z
[INFO] ------------------------------------------------------------------------
[ERROR] Failed to execute goal org.apache.rat:apache-rat-plugin:0.17:check (rat-check) on project commons-compress: java.io.FileNotFoundException: <https://ci-builds.apache.org/job/Commons/job/commons-compress-windows/OS=Windows,jdk=jdk_1.8_latest_windows/ws/f>:\jenkins\jenkins-home\712657a4\workspace\Commons\commons-compress-windows\OS\Windows\jdk\jdk_1.8_latest_windows\target\rat.txt (The filename, directory name, or volume label syntax is incorrect) -> [Help 1]
[ERROR]
[ERROR] To see the full stack trace of the errors, re-run Maven with the -e switch.
[ERROR] Re-run Maven using the -X switch to enable full debug logging.
[ERROR]
[ERROR] For more information about the errors and possible solutions, please read the following articles:
[ERROR] [Help 1] http://cwiki.apache.org/confluence/display/MAVEN/MojoExecutionException
Build step 'Invoke top-level Maven targets' marked build as failure
Build failed in Jenkins: Commons » commons-compress-windows » Windows,jdk_1.8_latest_windows #543
Posted by Apache Jenkins Server <je...@builds.apache.org>.
See <https://ci-builds.apache.org/job/Commons/job/commons-compress-windows/OS=Windows,jdk=jdk_1.8_latest_windows/543/display/redirect?page=changes>
Changes:
[github] Bump com.github.luben:zstd-jni from 1.5.7-17 to 1.5.7-22 (#820)
[garydgregory] Bump com.github.luben:zstd-jni from 1.5.7-17 to 1.5.7-22 (#820)
------------------------------------------
Started by upstream project "Commons/commons-compress-windows" build number 543
originally caused by:
Started by an SCM change
Running as SYSTEM
[EnvInject] - Loading node environment variables.
Building remotely on jenkins-win-azr-7 (Windows-Docker Windows) in workspace <https://ci-builds.apache.org/job/Commons/job/commons-compress-windows/OS=Windows,jdk=jdk_1.8_latest_windows/ws/>
The recommended git tool is: NONE
No credentials specified
> git rev-parse --resolve-git-dir <https://ci-builds.apache.org/job/Commons/job/commons-compress-windows/OS=Windows,jdk=jdk_1.8_latest_windows/ws/.git> # timeout=10
Fetching changes from the remote Git repository
> git config remote.origin.url https://github.com/apache/commons-compress.git # timeout=10
Fetching upstream changes from https://github.com/apache/commons-compress.git
> git --version # timeout=10
> git --version # 'git version 2.14.3.windows.1'
> git fetch --tags --progress -- https://github.com/apache/commons-compress.git +refs/heads/*:refs/remotes/origin/* # timeout=10
Checking out Revision 0ff3a01ab1c73e0c0f5c7aefcc495db1cd829ce9 (refs/remotes/origin/master)
> git config core.sparsecheckout # timeout=10
> git checkout -f 0ff3a01ab1c73e0c0f5c7aefcc495db1cd829ce9 # timeout=10
Commit message: "Bump com.github.luben:zstd-jni from 1.5.7-17 to 1.5.7-22 (#820)"
> git rev-list --no-walk 2cdf39ce4b191ac6c25a2e69905f82942872e587 # timeout=10
[jdk_1.8_latest_windows] $ cmd.exe /C "f:\jenkins\tools\maven\latest\bin\mvn.cmd -V -B --no-transfer-progress -Dhttps.protocols=TLSv1.2 clean test && exit %%ERRORLEVEL%%"
Apache Maven 3.9.16 (2bdd9fddda4b155ebf8000e807eb73fd829a51d5)
Maven home: f:\jenkins\tools\maven\latest
Java version: 1.8.0_362, vendor: Temurin, runtime: F:\jenkins\tools\java\latest1.8\jre
Default locale: en_US, platform encoding: Cp1252
OS name: "windows server 2019", version: "10.0", arch: "amd64", family: "windows"
[INFO] Scanning for projects...
[INFO]
[INFO] ----------------< org.apache.commons:commons-compress >-----------------
[INFO] Building Apache Commons Compress 1.29.0-SNAPSHOT
[INFO] from pom.xml
[INFO] --------------------------------[ jar ]---------------------------------
[INFO]
[INFO] --- clean:3.5.0:clean (default-clean) @ commons-compress ---
[INFO]
[INFO] --- enforcer:3.6.3:enforce (enforce-maven-version) @ commons-compress ---
[INFO] Rule 0: org.apache.maven.enforcer.rules.version.RequireMavenVersion passed
[INFO]
[INFO] --- enforcer:3.6.3:enforce (enforce-java-version) @ commons-compress ---
[INFO] Rule 0: org.apache.maven.enforcer.rules.version.RequireJavaVersion passed
[INFO]
[INFO] --- apache-rat:0.17:check (rat-check) @ commons-compress ---
[WARNING] Basedir is : <https://ci-builds.apache.org/job/Commons/job/commons-compress-windows/OS=Windows,jdk=jdk_1.8_latest_windows/ws/>
[ERROR] Could not create report parent directory <https://ci-builds.apache.org/job/Commons/job/commons-compress-windows/OS=Windows,jdk=jdk_1.8_latest_windows/ws/f>:\jenkins\jenkins-home\712657a4\workspace\Commons\commons-compress-windows\OS\Windows\jdk\jdk_1.8_latest_windows\target\rat.txt
[WARNING] Unable to create directory: <https://ci-builds.apache.org/job/Commons/job/commons-compress-windows/OS=Windows,jdk=jdk_1.8_latest_windows/ws/f>:\jenkins\jenkins-home\712657a4\workspace\Commons\commons-compress-windows\OS\Windows\jdk\jdk_1.8_latest_windows\target
[INFO] Excluding patterns: src/test/resources/**, .pmd, .projectile, .mvn/**, .gitattributes, site-content/**, .checkstyle, .fbprefs, .pmd, .asf.yaml, .gitattributes, src/site/resources/download_*.cgi, maven-eclipse.xml, .externalToolBuilders/**, .vscode/**, .project, .classpath, .settings/**, **/*.svg, **/*.xcf
[INFO] Excluding MAVEN collection.
[INFO] Excluding ECLIPSE collection.
[INFO] Excluding IDEA collection.
[INFO] Processing exclude file from STANDARD_SCMS.
[INFO] Excluding STANDARD_SCMS collection.
[INFO] Excluding MISC collection.
[INFO] Excluding HIDDEN_DIR collection.
[INFO] ------------------------------------------------------------------------
[INFO] BUILD FAILURE
[INFO] ------------------------------------------------------------------------
[INFO] Total time: 37.409 s
[INFO] Finished at: 2026-10-11T17:16:07Z
[INFO] ------------------------------------------------------------------------
[ERROR] Failed to execute goal org.apache.rat:apache-rat-plugin:0.17:check (rat-check) on project commons-compress: java.io.FileNotFoundException: <https://ci-builds.apache.org/job/Commons/job/commons-compress-windows/OS=Windows,jdk=jdk_1.8_latest_windows/ws/f>:\jenkins\jenkins-home\712657a4\workspace\Commons\commons-compress-windows\OS\Windows\jdk\jdk_1.8_latest_windows\target\rat.txt (The filename, directory name, or volume label syntax is incorrect) -> [Help 1]
[ERROR]
[ERROR] To see the full stack trace of the errors, re-run Maven with the -e switch.
[ERROR] Re-run Maven using the -X switch to enable full debug logging.
[ERROR]
[ERROR] For more information about the errors and possible solutions, please read the following articles:
[ERROR] [Help 1] http://cwiki.apache.org/confluence/display/MAVEN/MojoExecutionException
Build step 'Invoke top-level Maven targets' marked build as failure
Build failed in Jenkins: Commons » commons-compress-windows » Windows,jdk_1.8_latest_windows #542
Posted by Apache Jenkins Server <je...@builds.apache.org>.
See <https://ci-builds.apache.org/job/Commons/job/commons-compress-windows/OS=Windows,jdk=jdk_1.8_latest_windows/542/display/redirect?page=changes>
Changes:
[github] Bump commons-codeccommons-codec from 1.22.1 to 1.23.0 (#822)
------------------------------------------
Started by upstream project "Commons/commons-compress-windows" build number 542
originally caused by:
Started by an SCM change
Running as SYSTEM
[EnvInject] - Loading node environment variables.
Building remotely on jenkins-win-azr-1 (Windows-Docker Windows) in workspace <https://ci-builds.apache.org/job/Commons/job/commons-compress-windows/OS=Windows,jdk=jdk_1.8_latest_windows/ws/>
The recommended git tool is: NONE
No credentials specified
> git rev-parse --resolve-git-dir <https://ci-builds.apache.org/job/Commons/job/commons-compress-windows/OS=Windows,jdk=jdk_1.8_latest_windows/ws/.git> # timeout=10
Fetching changes from the remote Git repository
> git config remote.origin.url https://github.com/apache/commons-compress.git # timeout=10
Fetching upstream changes from https://github.com/apache/commons-compress.git
> git --version # timeout=10
> git --version # 'git version 2.14.3.windows.1'
> git fetch --tags --progress -- https://github.com/apache/commons-compress.git +refs/heads/*:refs/remotes/origin/* # timeout=10
Checking out Revision 2cdf39ce4b191ac6c25a2e69905f82942872e587 (refs/remotes/origin/master)
> git config core.sparsecheckout # timeout=10
> git checkout -f 2cdf39ce4b191ac6c25a2e69905f82942872e587 # timeout=10
Commit message: "Bump commons-codeccommons-codec from 1.22.1 to 1.23.0 (#822)"
> git rev-list --no-walk 8a79b1fd5fd993e94f3487f8acd2cd3ee9d4f15d # timeout=10
[jdk_1.8_latest_windows] $ cmd.exe /C "f:\jenkins\tools\maven\latest\bin\mvn.cmd -V -B --no-transfer-progress -Dhttps.protocols=TLSv1.2 clean test && exit %%ERRORLEVEL%%"
Apache Maven 3.9.16 (2bdd9fddda4b155ebf8000e807eb73fd829a51d5)
Maven home: f:\jenkins\tools\maven\latest
Java version: 1.8.0_362, vendor: Temurin, runtime: F:\jenkins\tools\java\latest1.8\jre
Default locale: en_US, platform encoding: Cp1252
OS name: "windows server 2019", version: "10.0", arch: "amd64", family: "windows"
[INFO] Scanning for projects...
[INFO]
[INFO] ----------------< org.apache.commons:commons-compress >-----------------
[INFO] Building Apache Commons Compress 1.29.0-SNAPSHOT
[INFO] from pom.xml
[INFO] --------------------------------[ jar ]---------------------------------
[INFO]
[INFO] --- clean:3.5.0:clean (default-clean) @ commons-compress ---
[INFO]
[INFO] --- enforcer:3.6.3:enforce (enforce-maven-version) @ commons-compress ---
[INFO] Rule 0: org.apache.maven.enforcer.rules.version.RequireMavenVersion passed
[INFO]
[INFO] --- enforcer:3.6.3:enforce (enforce-java-version) @ commons-compress ---
[INFO] Rule 0: org.apache.maven.enforcer.rules.version.RequireJavaVersion passed
[INFO]
[INFO] --- apache-rat:0.17:check (rat-check) @ commons-compress ---
[WARNING] Basedir is : <https://ci-builds.apache.org/job/Commons/job/commons-compress-windows/OS=Windows,jdk=jdk_1.8_latest_windows/ws/>
[ERROR] Could not create report parent directory <https://ci-builds.apache.org/job/Commons/job/commons-compress-windows/OS=Windows,jdk=jdk_1.8_latest_windows/ws/f>:\jenkins\jenkins-home\712657a4\workspace\Commons\commons-compress-windows\OS\Windows\jdk\jdk_1.8_latest_windows\target\rat.txt
[WARNING] Unable to create directory: <https://ci-builds.apache.org/job/Commons/job/commons-compress-windows/OS=Windows,jdk=jdk_1.8_latest_windows/ws/f>:\jenkins\jenkins-home\712657a4\workspace\Commons\commons-compress-windows\OS\Windows\jdk\jdk_1.8_latest_windows\target
[INFO] Excluding patterns: src/test/resources/**, .pmd, .projectile, .mvn/**, .gitattributes, site-content/**, .checkstyle, .fbprefs, .pmd, .asf.yaml, .gitattributes, src/site/resources/download_*.cgi, maven-eclipse.xml, .externalToolBuilders/**, .vscode/**, .project, .classpath, .settings/**, **/*.svg, **/*.xcf
[INFO] Excluding MAVEN collection.
[INFO] Excluding ECLIPSE collection.
[INFO] Excluding IDEA collection.
[INFO] Processing exclude file from STANDARD_SCMS.
[INFO] Excluding STANDARD_SCMS collection.
[INFO] Excluding MISC collection.
[INFO] Excluding HIDDEN_DIR collection.
[INFO] ------------------------------------------------------------------------
[INFO] BUILD FAILURE
[INFO] ------------------------------------------------------------------------
[INFO] Total time: 01:25 min
[INFO] Finished at: 2026-10-11T16:19:18Z
[INFO] ------------------------------------------------------------------------
[ERROR] Failed to execute goal org.apache.rat:apache-rat-plugin:0.17:check (rat-check) on project commons-compress: java.io.FileNotFoundException: <https://ci-builds.apache.org/job/Commons/job/commons-compress-windows/OS=Windows,jdk=jdk_1.8_latest_windows/ws/f>:\jenkins\jenkins-home\712657a4\workspace\Commons\commons-compress-windows\OS\Windows\jdk\jdk_1.8_latest_windows\target\rat.txt (The filename, directory name, or volume label syntax is incorrect) -> [Help 1]
[ERROR]
[ERROR] To see the full stack trace of the errors, re-run Maven with the -e switch.
[ERROR] Re-run Maven using the -X switch to enable full debug logging.
[ERROR]
[ERROR] For more information about the errors and possible solutions, please read the following articles:
[ERROR] [Help 1] http://cwiki.apache.org/confluence/display/MAVEN/MojoExecutionException
Build step 'Invoke top-level Maven targets' marked build as failure
Build failed in Jenkins: Commons » commons-compress-windows » Windows,jdk_1.8_latest_windows #541
Posted by Apache Jenkins Server <je...@builds.apache.org>.
See <https://ci-builds.apache.org/job/Commons/job/commons-compress-windows/OS=Windows,jdk=jdk_1.8_latest_windows/541/display/redirect?page=changes>
Changes:
[garydgregory] Add github.autolink_jira
------------------------------------------
Started by upstream project "Commons/commons-compress-windows" build number 541
originally caused by:
Started by an SCM change
Running as SYSTEM
[EnvInject] - Loading node environment variables.
Building remotely on jenkins-win-azr-11 (Windows-Docker Windows) in workspace <https://ci-builds.apache.org/job/Commons/job/commons-compress-windows/OS=Windows,jdk=jdk_1.8_latest_windows/ws/>
The recommended git tool is: NONE
No credentials specified
> git rev-parse --resolve-git-dir <https://ci-builds.apache.org/job/Commons/job/commons-compress-windows/OS=Windows,jdk=jdk_1.8_latest_windows/ws/.git> # timeout=10
Fetching changes from the remote Git repository
> git config remote.origin.url https://github.com/apache/commons-compress.git # timeout=10
Fetching upstream changes from https://github.com/apache/commons-compress.git
> git --version # timeout=10
> git --version # 'git version 2.14.3.windows.1'
> git fetch --tags --progress -- https://github.com/apache/commons-compress.git +refs/heads/*:refs/remotes/origin/* # timeout=10
Checking out Revision 8a79b1fd5fd993e94f3487f8acd2cd3ee9d4f15d (refs/remotes/origin/master)
> git config core.sparsecheckout # timeout=10
> git checkout -f 8a79b1fd5fd993e94f3487f8acd2cd3ee9d4f15d # timeout=10
Commit message: "Add github.autolink_jira"
> git rev-list --no-walk ddce121235c211358d95b43a601e82a39e399a0b # timeout=10
[jdk_1.8_latest_windows] $ cmd.exe /C "f:\jenkins\tools\maven\latest\bin\mvn.cmd -V -B --no-transfer-progress -Dhttps.protocols=TLSv1.2 clean test && exit %%ERRORLEVEL%%"
Apache Maven 3.9.16 (2bdd9fddda4b155ebf8000e807eb73fd829a51d5)
Maven home: f:\jenkins\tools\maven\latest
Java version: 1.8.0_362, vendor: Temurin, runtime: F:\jenkins\tools\java\latest1.8\jre
Default locale: en_US, platform encoding: Cp1252
OS name: "windows server 2019", version: "10.0", arch: "amd64", family: "windows"
[INFO] Scanning for projects...
[INFO]
[INFO] ----------------< org.apache.commons:commons-compress >-----------------
[INFO] Building Apache Commons Compress 1.29.0-SNAPSHOT
[INFO] from pom.xml
[INFO] --------------------------------[ jar ]---------------------------------
[INFO]
[INFO] --- clean:3.5.0:clean (default-clean) @ commons-compress ---
[INFO]
[INFO] --- enforcer:3.6.3:enforce (enforce-maven-version) @ commons-compress ---
[INFO] Rule 0: org.apache.maven.enforcer.rules.version.RequireMavenVersion passed
[INFO]
[INFO] --- enforcer:3.6.3:enforce (enforce-java-version) @ commons-compress ---
[INFO] Rule 0: org.apache.maven.enforcer.rules.version.RequireJavaVersion passed
[INFO]
[INFO] --- apache-rat:0.17:check (rat-check) @ commons-compress ---
[WARNING] Basedir is : <https://ci-builds.apache.org/job/Commons/job/commons-compress-windows/OS=Windows,jdk=jdk_1.8_latest_windows/ws/>
[ERROR] Could not create report parent directory <https://ci-builds.apache.org/job/Commons/job/commons-compress-windows/OS=Windows,jdk=jdk_1.8_latest_windows/ws/f>:\jenkins\jenkins-home\712657a4\workspace\Commons\commons-compress-windows\OS\Windows\jdk\jdk_1.8_latest_windows\target\rat.txt
[WARNING] Unable to create directory: <https://ci-builds.apache.org/job/Commons/job/commons-compress-windows/OS=Windows,jdk=jdk_1.8_latest_windows/ws/f>:\jenkins\jenkins-home\712657a4\workspace\Commons\commons-compress-windows\OS\Windows\jdk\jdk_1.8_latest_windows\target
[INFO] Excluding patterns: src/test/resources/**, .pmd, .projectile, .mvn/**, .gitattributes, site-content/**, .checkstyle, .fbprefs, .pmd, .asf.yaml, .gitattributes, src/site/resources/download_*.cgi, maven-eclipse.xml, .externalToolBuilders/**, .vscode/**, .project, .classpath, .settings/**, **/*.svg, **/*.xcf
[INFO] Excluding MAVEN collection.
[INFO] Excluding ECLIPSE collection.
[INFO] Excluding IDEA collection.
[INFO] Processing exclude file from STANDARD_SCMS.
[INFO] Excluding STANDARD_SCMS collection.
[INFO] Excluding MISC collection.
[INFO] Excluding HIDDEN_DIR collection.
[INFO] ------------------------------------------------------------------------
[INFO] BUILD FAILURE
[INFO] ------------------------------------------------------------------------
[INFO] Total time: 39.710 s
[INFO] Finished at: 2026-10-10T12:16:15Z
[INFO] ------------------------------------------------------------------------
[ERROR] Failed to execute goal org.apache.rat:apache-rat-plugin:0.17:check (rat-check) on project commons-compress: java.io.FileNotFoundException: <https://ci-builds.apache.org/job/Commons/job/commons-compress-windows/OS=Windows,jdk=jdk_1.8_latest_windows/ws/f>:\jenkins\jenkins-home\712657a4\workspace\Commons\commons-compress-windows\OS\Windows\jdk\jdk_1.8_latest_windows\target\rat.txt (The filename, directory name, or volume label syntax is incorrect) -> [Help 1]
[ERROR]
[ERROR] To see the full stack trace of the errors, re-run Maven with the -e switch.
[ERROR] Re-run Maven using the -X switch to enable full debug logging.
[ERROR]
[ERROR] For more information about the errors and possible solutions, please read the following articles:
[ERROR] [Help 1] http://cwiki.apache.org/confluence/display/MAVEN/MojoExecutionException
Build step 'Invoke top-level Maven targets' marked build as failure
Build failed in Jenkins: Commons » commons-compress-windows » Windows,jdk_1.8_latest_windows #540
Posted by Apache Jenkins Server <je...@builds.apache.org>.
See <https://ci-builds.apache.org/job/Commons/job/commons-compress-windows/OS=Windows,jdk=jdk_1.8_latest_windows/540/display/redirect?page=changes>
Changes:
[garydgregory] Update GH CI from Java 26 to 27
------------------------------------------
Started by upstream project "Commons/commons-compress-windows" build number 540
originally caused by:
Started by an SCM change
Running as SYSTEM
[EnvInject] - Loading node environment variables.
Building remotely on jenkins-win-azr-6 (Windows-Docker Windows) in workspace <https://ci-builds.apache.org/job/Commons/job/commons-compress-windows/OS=Windows,jdk=jdk_1.8_latest_windows/ws/>
The recommended git tool is: NONE
No credentials specified
> git rev-parse --resolve-git-dir <https://ci-builds.apache.org/job/Commons/job/commons-compress-windows/OS=Windows,jdk=jdk_1.8_latest_windows/ws/.git> # timeout=10
Fetching changes from the remote Git repository
> git config remote.origin.url https://github.com/apache/commons-compress.git # timeout=10
Fetching upstream changes from https://github.com/apache/commons-compress.git
> git --version # timeout=10
> git --version # 'git version 2.14.3.windows.1'
> git fetch --tags --progress -- https://github.com/apache/commons-compress.git +refs/heads/*:refs/remotes/origin/* # timeout=10
Checking out Revision ddce121235c211358d95b43a601e82a39e399a0b (refs/remotes/origin/master)
> git config core.sparsecheckout # timeout=10
> git checkout -f ddce121235c211358d95b43a601e82a39e399a0b # timeout=10
Commit message: "Update GH CI from Java 26 to 27"
> git rev-list --no-walk f4eea9e5cf73e38cf352c0d5f85376e5bbb630b9 # timeout=10
[jdk_1.8_latest_windows] $ cmd.exe /C "f:\jenkins\tools\maven\latest\bin\mvn.cmd -V -B --no-transfer-progress -Dhttps.protocols=TLSv1.2 clean test && exit %%ERRORLEVEL%%"
Apache Maven 3.9.16 (2bdd9fddda4b155ebf8000e807eb73fd829a51d5)
Maven home: f:\jenkins\tools\maven\latest
Java version: 1.8.0_362, vendor: Temurin, runtime: F:\jenkins\tools\java\latest1.8\jre
Default locale: en_US, platform encoding: Cp1252
OS name: "windows server 2019", version: "10.0", arch: "amd64", family: "windows"
[INFO] Scanning for projects...
[INFO]
[INFO] ----------------< org.apache.commons:commons-compress >-----------------
[INFO] Building Apache Commons Compress 1.29.0-SNAPSHOT
[INFO] from pom.xml
[INFO] --------------------------------[ jar ]---------------------------------
[INFO]
[INFO] --- clean:3.5.0:clean (default-clean) @ commons-compress ---
[INFO]
[INFO] --- enforcer:3.6.3:enforce (enforce-maven-version) @ commons-compress ---
[INFO] Rule 0: org.apache.maven.enforcer.rules.version.RequireMavenVersion passed
[INFO]
[INFO] --- enforcer:3.6.3:enforce (enforce-java-version) @ commons-compress ---
[INFO] Rule 0: org.apache.maven.enforcer.rules.version.RequireJavaVersion passed
[INFO]
[INFO] --- apache-rat:0.17:check (rat-check) @ commons-compress ---
[WARNING] Basedir is : <https://ci-builds.apache.org/job/Commons/job/commons-compress-windows/OS=Windows,jdk=jdk_1.8_latest_windows/ws/>
[ERROR] Could not create report parent directory <https://ci-builds.apache.org/job/Commons/job/commons-compress-windows/OS=Windows,jdk=jdk_1.8_latest_windows/ws/f>:\jenkins\jenkins-home\712657a4\workspace\Commons\commons-compress-windows\OS\Windows\jdk\jdk_1.8_latest_windows\target\rat.txt
[WARNING] Unable to create directory: <https://ci-builds.apache.org/job/Commons/job/commons-compress-windows/OS=Windows,jdk=jdk_1.8_latest_windows/ws/f>:\jenkins\jenkins-home\712657a4\workspace\Commons\commons-compress-windows\OS\Windows\jdk\jdk_1.8_latest_windows\target
[INFO] Excluding patterns: src/test/resources/**, .pmd, .projectile, .mvn/**, .gitattributes, site-content/**, .checkstyle, .fbprefs, .pmd, .asf.yaml, .gitattributes, src/site/resources/download_*.cgi, maven-eclipse.xml, .externalToolBuilders/**, .vscode/**, .project, .classpath, .settings/**, **/*.svg, **/*.xcf
[INFO] Excluding MAVEN collection.
[INFO] Excluding ECLIPSE collection.
[INFO] Excluding IDEA collection.
[INFO] Processing exclude file from STANDARD_SCMS.
[INFO] Excluding STANDARD_SCMS collection.
[INFO] Excluding MISC collection.
[INFO] Excluding HIDDEN_DIR collection.
[INFO] ------------------------------------------------------------------------
[INFO] BUILD FAILURE
[INFO] ------------------------------------------------------------------------
[INFO] Total time: 43.366 s
[INFO] Finished at: 2026-10-03T14:15:10Z
[INFO] ------------------------------------------------------------------------
[ERROR] Failed to execute goal org.apache.rat:apache-rat-plugin:0.17:check (rat-check) on project commons-compress: java.io.FileNotFoundException: <https://ci-builds.apache.org/job/Commons/job/commons-compress-windows/OS=Windows,jdk=jdk_1.8_latest_windows/ws/f>:\jenkins\jenkins-home\712657a4\workspace\Commons\commons-compress-windows\OS\Windows\jdk\jdk_1.8_latest_windows\target\rat.txt (The filename, directory name, or volume label syntax is incorrect) -> [Help 1]
[ERROR]
[ERROR] To see the full stack trace of the errors, re-run Maven with the -e switch.
[ERROR] Re-run Maven using the -X switch to enable full debug logging.
[ERROR]
[ERROR] For more information about the errors and possible solutions, please read the following articles:
[ERROR] [Help 1] http://cwiki.apache.org/confluence/display/MAVEN/MojoExecutionException
Build step 'Invoke top-level Maven targets' marked build as failure
Build failed in Jenkins: Commons » commons-compress-windows » Windows,jdk_1.8_latest_windows #539
Posted by Apache Jenkins Server <je...@builds.apache.org>.
See <https://ci-builds.apache.org/job/Commons/job/commons-compress-windows/OS=Windows,jdk=jdk_1.8_latest_windows/539/display/redirect?page=changes>
Changes:
[github] Bump org.apache.commons:commons-lang3 from 3.20.0 to 3.21.0 (#819)
[garydgregory] [test] Bump org.apache.commons:commons-lang3 from 3.20.0 to 3.21.0
------------------------------------------
Started by upstream project "Commons/commons-compress-windows" build number 539
originally caused by:
Started by an SCM change
Running as SYSTEM
[EnvInject] - Loading node environment variables.
Building remotely on jenkins-win-azr-1 (Windows-Docker Windows) in workspace <https://ci-builds.apache.org/job/Commons/job/commons-compress-windows/OS=Windows,jdk=jdk_1.8_latest_windows/ws/>
The recommended git tool is: NONE
No credentials specified
> git rev-parse --resolve-git-dir <https://ci-builds.apache.org/job/Commons/job/commons-compress-windows/OS=Windows,jdk=jdk_1.8_latest_windows/ws/.git> # timeout=10
Fetching changes from the remote Git repository
> git config remote.origin.url https://github.com/apache/commons-compress.git # timeout=10
Fetching upstream changes from https://github.com/apache/commons-compress.git
> git --version # timeout=10
> git --version # 'git version 2.14.3.windows.1'
> git fetch --tags --progress -- https://github.com/apache/commons-compress.git +refs/heads/*:refs/remotes/origin/* # timeout=10
Checking out Revision f4eea9e5cf73e38cf352c0d5f85376e5bbb630b9 (refs/remotes/origin/master)
> git config core.sparsecheckout # timeout=10
> git checkout -f f4eea9e5cf73e38cf352c0d5f85376e5bbb630b9 # timeout=10
Commit message: "[test] Bump org.apache.commons:commons-lang3 from 3.20.0 to 3.21.0"
> git rev-list --no-walk 19278c4f776af4a11e071e34e3b3ceca1ef735ae # timeout=10
[jdk_1.8_latest_windows] $ cmd.exe /C "f:\jenkins\tools\maven\latest\bin\mvn.cmd -V -B --no-transfer-progress -Dhttps.protocols=TLSv1.2 clean test && exit %%ERRORLEVEL%%"
Apache Maven 3.9.16 (2bdd9fddda4b155ebf8000e807eb73fd829a51d5)
Maven home: f:\jenkins\tools\maven\latest
Java version: 1.8.0_362, vendor: Temurin, runtime: F:\jenkins\tools\java\latest1.8\jre
Default locale: en_US, platform encoding: Cp1252
OS name: "windows server 2019", version: "10.0", arch: "amd64", family: "windows"
[INFO] Scanning for projects...
[INFO]
[INFO] ----------------< org.apache.commons:commons-compress >-----------------
[INFO] Building Apache Commons Compress 1.29.0-SNAPSHOT
[INFO] from pom.xml
[INFO] --------------------------------[ jar ]---------------------------------
[INFO]
[INFO] --- clean:3.5.0:clean (default-clean) @ commons-compress ---
[INFO]
[INFO] --- enforcer:3.6.3:enforce (enforce-maven-version) @ commons-compress ---
[INFO] Rule 0: org.apache.maven.enforcer.rules.version.RequireMavenVersion passed
[INFO]
[INFO] --- enforcer:3.6.3:enforce (enforce-java-version) @ commons-compress ---
[INFO] Rule 0: org.apache.maven.enforcer.rules.version.RequireJavaVersion passed
[INFO]
[INFO] --- apache-rat:0.17:check (rat-check) @ commons-compress ---
[WARNING] Basedir is : <https://ci-builds.apache.org/job/Commons/job/commons-compress-windows/OS=Windows,jdk=jdk_1.8_latest_windows/ws/>
[ERROR] Could not create report parent directory <https://ci-builds.apache.org/job/Commons/job/commons-compress-windows/OS=Windows,jdk=jdk_1.8_latest_windows/ws/f>:\jenkins\jenkins-home\712657a4\workspace\Commons\commons-compress-windows\OS\Windows\jdk\jdk_1.8_latest_windows\target\rat.txt
[WARNING] Unable to create directory: <https://ci-builds.apache.org/job/Commons/job/commons-compress-windows/OS=Windows,jdk=jdk_1.8_latest_windows/ws/f>:\jenkins\jenkins-home\712657a4\workspace\Commons\commons-compress-windows\OS\Windows\jdk\jdk_1.8_latest_windows\target
[INFO] Excluding patterns: src/test/resources/**, .pmd, .projectile, .mvn/**, .gitattributes, site-content/**, .checkstyle, .fbprefs, .pmd, .asf.yaml, .gitattributes, src/site/resources/download_*.cgi, maven-eclipse.xml, .externalToolBuilders/**, .vscode/**, .project, .classpath, .settings/**, **/*.svg, **/*.xcf
[INFO] Excluding MAVEN collection.
[INFO] Excluding ECLIPSE collection.
[INFO] Excluding IDEA collection.
[INFO] Processing exclude file from STANDARD_SCMS.
[INFO] Excluding STANDARD_SCMS collection.
[INFO] Excluding MISC collection.
[INFO] Excluding HIDDEN_DIR collection.
[INFO] ------------------------------------------------------------------------
[INFO] BUILD FAILURE
[INFO] ------------------------------------------------------------------------
[INFO] Total time: 01:13 min
[INFO] Finished at: 2026-09-29T20:18:55Z
[INFO] ------------------------------------------------------------------------
[ERROR] Failed to execute goal org.apache.rat:apache-rat-plugin:0.17:check (rat-check) on project commons-compress: java.io.FileNotFoundException: <https://ci-builds.apache.org/job/Commons/job/commons-compress-windows/OS=Windows,jdk=jdk_1.8_latest_windows/ws/f>:\jenkins\jenkins-home\712657a4\workspace\Commons\commons-compress-windows\OS\Windows\jdk\jdk_1.8_latest_windows\target\rat.txt (The filename, directory name, or volume label syntax is incorrect) -> [Help 1]
[ERROR]
[ERROR] To see the full stack trace of the errors, re-run Maven with the -e switch.
[ERROR] Re-run Maven using the -X switch to enable full debug logging.
[ERROR]
[ERROR] For more information about the errors and possible solutions, please read the following articles:
[ERROR] [Help 1] http://cwiki.apache.org/confluence/display/MAVEN/MojoExecutionException
Build step 'Invoke top-level Maven targets' marked build as failure
Build failed in Jenkins: Commons » commons-compress-windows » Windows,jdk_1.8_latest_windows #538
Posted by Apache Jenkins Server <je...@builds.apache.org>.
See <https://ci-builds.apache.org/job/Commons/job/commons-compress-windows/OS=Windows,jdk=jdk_1.8_latest_windows/538/display/redirect?page=changes>
Changes:
[garydgregory] Bump github/codeql-action from 4.38.1 to 4.38.2
------------------------------------------
Started by upstream project "Commons/commons-compress-windows" build number 538
originally caused by:
Started by an SCM change
Running as SYSTEM
[EnvInject] - Loading node environment variables.
Building remotely on jenkins-win-azr-8 (Windows-Docker Windows) in workspace <https://ci-builds.apache.org/job/Commons/job/commons-compress-windows/OS=Windows,jdk=jdk_1.8_latest_windows/ws/>
The recommended git tool is: NONE
No credentials specified
> git rev-parse --resolve-git-dir <https://ci-builds.apache.org/job/Commons/job/commons-compress-windows/OS=Windows,jdk=jdk_1.8_latest_windows/ws/.git> # timeout=10
Fetching changes from the remote Git repository
> git config remote.origin.url https://github.com/apache/commons-compress.git # timeout=10
Fetching upstream changes from https://github.com/apache/commons-compress.git
> git --version # timeout=10
> git --version # 'git version 2.14.3.windows.1'
> git fetch --tags --progress -- https://github.com/apache/commons-compress.git +refs/heads/*:refs/remotes/origin/* # timeout=10
Checking out Revision 19278c4f776af4a11e071e34e3b3ceca1ef735ae (refs/remotes/origin/master)
> git config core.sparsecheckout # timeout=10
> git checkout -f 19278c4f776af4a11e071e34e3b3ceca1ef735ae # timeout=10
Commit message: "Bump github/codeql-action from 4.38.1 to 4.38.2"
> git rev-list --no-walk 63f1ac0a416c46fac9136aa9ac7b37ac537d115c # timeout=10
[jdk_1.8_latest_windows] $ cmd.exe /C "f:\jenkins\tools\maven\latest\bin\mvn.cmd -V -B --no-transfer-progress -Dhttps.protocols=TLSv1.2 clean test && exit %%ERRORLEVEL%%"
Apache Maven 3.9.16 (2bdd9fddda4b155ebf8000e807eb73fd829a51d5)
Maven home: f:\jenkins\tools\maven\latest
Java version: 1.8.0_362, vendor: Temurin, runtime: F:\jenkins\tools\java\latest1.8\jre
Default locale: en_US, platform encoding: Cp1252
OS name: "windows server 2019", version: "10.0", arch: "amd64", family: "windows"
[INFO] Scanning for projects...
[INFO]
[INFO] ----------------< org.apache.commons:commons-compress >-----------------
[INFO] Building Apache Commons Compress 1.29.0-SNAPSHOT
[INFO] from pom.xml
[INFO] --------------------------------[ jar ]---------------------------------
[INFO]
[INFO] --- clean:3.5.0:clean (default-clean) @ commons-compress ---
[INFO]
[INFO] --- enforcer:3.6.3:enforce (enforce-maven-version) @ commons-compress ---
[INFO] Rule 0: org.apache.maven.enforcer.rules.version.RequireMavenVersion passed
[INFO]
[INFO] --- enforcer:3.6.3:enforce (enforce-java-version) @ commons-compress ---
[INFO] Rule 0: org.apache.maven.enforcer.rules.version.RequireJavaVersion passed
[INFO]
[INFO] --- apache-rat:0.17:check (rat-check) @ commons-compress ---
[WARNING] Basedir is : <https://ci-builds.apache.org/job/Commons/job/commons-compress-windows/OS=Windows,jdk=jdk_1.8_latest_windows/ws/>
[ERROR] Could not create report parent directory <https://ci-builds.apache.org/job/Commons/job/commons-compress-windows/OS=Windows,jdk=jdk_1.8_latest_windows/ws/f>:\jenkins\jenkins-home\712657a4\workspace\Commons\commons-compress-windows\OS\Windows\jdk\jdk_1.8_latest_windows\target\rat.txt
[WARNING] Unable to create directory: <https://ci-builds.apache.org/job/Commons/job/commons-compress-windows/OS=Windows,jdk=jdk_1.8_latest_windows/ws/f>:\jenkins\jenkins-home\712657a4\workspace\Commons\commons-compress-windows\OS\Windows\jdk\jdk_1.8_latest_windows\target
[INFO] Excluding patterns: src/test/resources/**, .pmd, .projectile, .mvn/**, .gitattributes, site-content/**, .checkstyle, .fbprefs, .pmd, .asf.yaml, .gitattributes, src/site/resources/download_*.cgi, maven-eclipse.xml, .externalToolBuilders/**, .vscode/**, .project, .classpath, .settings/**, **/*.svg, **/*.xcf
[INFO] Excluding MAVEN collection.
[INFO] Excluding ECLIPSE collection.
[INFO] Excluding IDEA collection.
[INFO] Processing exclude file from STANDARD_SCMS.
[INFO] Excluding STANDARD_SCMS collection.
[INFO] Excluding MISC collection.
[INFO] Excluding HIDDEN_DIR collection.
[INFO] ------------------------------------------------------------------------
[INFO] BUILD FAILURE
[INFO] ------------------------------------------------------------------------
[INFO] Total time: 34.828 s
[INFO] Finished at: 2026-09-24T17:14:53Z
[INFO] ------------------------------------------------------------------------
[ERROR] Failed to execute goal org.apache.rat:apache-rat-plugin:0.17:check (rat-check) on project commons-compress: java.io.FileNotFoundException: <https://ci-builds.apache.org/job/Commons/job/commons-compress-windows/OS=Windows,jdk=jdk_1.8_latest_windows/ws/f>:\jenkins\jenkins-home\712657a4\workspace\Commons\commons-compress-windows\OS\Windows\jdk\jdk_1.8_latest_windows\target\rat.txt (The filename, directory name, or volume label syntax is incorrect) -> [Help 1]
[ERROR]
[ERROR] To see the full stack trace of the errors, re-run Maven with the -e switch.
[ERROR] Re-run Maven using the -X switch to enable full debug logging.
[ERROR]
[ERROR] For more information about the errors and possible solutions, please read the following articles:
[ERROR] [Help 1] http://cwiki.apache.org/confluence/display/MAVEN/MojoExecutionException
Build step 'Invoke top-level Maven targets' marked build as failure
Build failed in Jenkins: Commons » commons-compress-windows » Windows,jdk_1.8_latest_windows #537
Posted by Apache Jenkins Server <je...@builds.apache.org>.
See <https://ci-builds.apache.org/job/Commons/job/commons-compress-windows/OS=Windows,jdk=jdk_1.8_latest_windows/537/display/redirect?page=changes>
Changes:
[garydgregory] Protect main branches
------------------------------------------
Started by upstream project "Commons/commons-compress-windows" build number 537
originally caused by:
Started by an SCM change
Running as SYSTEM
[EnvInject] - Loading node environment variables.
Building remotely on jenkins-win-azr-7 (Windows-Docker Windows) in workspace <https://ci-builds.apache.org/job/Commons/job/commons-compress-windows/OS=Windows,jdk=jdk_1.8_latest_windows/ws/>
The recommended git tool is: NONE
No credentials specified
> git rev-parse --resolve-git-dir <https://ci-builds.apache.org/job/Commons/job/commons-compress-windows/OS=Windows,jdk=jdk_1.8_latest_windows/ws/.git> # timeout=10
Fetching changes from the remote Git repository
> git config remote.origin.url https://github.com/apache/commons-compress.git # timeout=10
Fetching upstream changes from https://github.com/apache/commons-compress.git
> git --version # timeout=10
> git --version # 'git version 2.14.3.windows.1'
> git fetch --tags --progress -- https://github.com/apache/commons-compress.git +refs/heads/*:refs/remotes/origin/* # timeout=10
Checking out Revision 63f1ac0a416c46fac9136aa9ac7b37ac537d115c (refs/remotes/origin/master)
> git config core.sparsecheckout # timeout=10
> git checkout -f 63f1ac0a416c46fac9136aa9ac7b37ac537d115c # timeout=10
Commit message: "Protect main branches"
> git rev-list --no-walk c15e1edf95b88363b0f60516d19896ad81187626 # timeout=10
[jdk_1.8_latest_windows] $ cmd.exe /C "f:\jenkins\tools\maven\latest\bin\mvn.cmd -V -B --no-transfer-progress -Dhttps.protocols=TLSv1.2 clean test && exit %%ERRORLEVEL%%"
Apache Maven 3.9.16 (2bdd9fddda4b155ebf8000e807eb73fd829a51d5)
Maven home: f:\jenkins\tools\maven\latest
Java version: 1.8.0_362, vendor: Temurin, runtime: F:\jenkins\tools\java\latest1.8\jre
Default locale: en_US, platform encoding: Cp1252
OS name: "windows server 2019", version: "10.0", arch: "amd64", family: "windows"
[INFO] Scanning for projects...
[INFO]
[INFO] ----------------< org.apache.commons:commons-compress >-----------------
[INFO] Building Apache Commons Compress 1.29.0-SNAPSHOT
[INFO] from pom.xml
[INFO] --------------------------------[ jar ]---------------------------------
[INFO]
[INFO] --- clean:3.5.0:clean (default-clean) @ commons-compress ---
[INFO]
[INFO] --- enforcer:3.6.3:enforce (enforce-maven-version) @ commons-compress ---
[INFO] Rule 0: org.apache.maven.enforcer.rules.version.RequireMavenVersion passed
[INFO]
[INFO] --- enforcer:3.6.3:enforce (enforce-java-version) @ commons-compress ---
[INFO] Rule 0: org.apache.maven.enforcer.rules.version.RequireJavaVersion passed
[INFO]
[INFO] --- apache-rat:0.17:check (rat-check) @ commons-compress ---
[WARNING] Basedir is : <https://ci-builds.apache.org/job/Commons/job/commons-compress-windows/OS=Windows,jdk=jdk_1.8_latest_windows/ws/>
[ERROR] Could not create report parent directory <https://ci-builds.apache.org/job/Commons/job/commons-compress-windows/OS=Windows,jdk=jdk_1.8_latest_windows/ws/f>:\jenkins\jenkins-home\712657a4\workspace\Commons\commons-compress-windows\OS\Windows\jdk\jdk_1.8_latest_windows\target\rat.txt
[WARNING] Unable to create directory: <https://ci-builds.apache.org/job/Commons/job/commons-compress-windows/OS=Windows,jdk=jdk_1.8_latest_windows/ws/f>:\jenkins\jenkins-home\712657a4\workspace\Commons\commons-compress-windows\OS\Windows\jdk\jdk_1.8_latest_windows\target
[INFO] Excluding patterns: src/test/resources/**, .pmd, .projectile, .mvn/**, .gitattributes, site-content/**, .checkstyle, .fbprefs, .pmd, .asf.yaml, .gitattributes, src/site/resources/download_*.cgi, maven-eclipse.xml, .externalToolBuilders/**, .vscode/**, .project, .classpath, .settings/**, **/*.svg, **/*.xcf
[INFO] Excluding MAVEN collection.
[INFO] Excluding ECLIPSE collection.
[INFO] Excluding IDEA collection.
[INFO] Processing exclude file from STANDARD_SCMS.
[INFO] Excluding STANDARD_SCMS collection.
[INFO] Excluding MISC collection.
[INFO] Excluding HIDDEN_DIR collection.
[INFO] ------------------------------------------------------------------------
[INFO] BUILD FAILURE
[INFO] ------------------------------------------------------------------------
[INFO] Total time: 33.017 s
[INFO] Finished at: 2026-09-22T12:16:02Z
[INFO] ------------------------------------------------------------------------
[ERROR] Failed to execute goal org.apache.rat:apache-rat-plugin:0.17:check (rat-check) on project commons-compress: java.io.FileNotFoundException: <https://ci-builds.apache.org/job/Commons/job/commons-compress-windows/OS=Windows,jdk=jdk_1.8_latest_windows/ws/f>:\jenkins\jenkins-home\712657a4\workspace\Commons\commons-compress-windows\OS\Windows\jdk\jdk_1.8_latest_windows\target\rat.txt (The filename, directory name, or volume label syntax is incorrect) -> [Help 1]
[ERROR]
[ERROR] To see the full stack trace of the errors, re-run Maven with the -e switch.
[ERROR] Re-run Maven using the -X switch to enable full debug logging.
[ERROR]
[ERROR] For more information about the errors and possible solutions, please read the following articles:
[ERROR] [Help 1] http://cwiki.apache.org/confluence/display/MAVEN/MojoExecutionException
Build step 'Invoke top-level Maven targets' marked build as failure
Build failed in Jenkins: Commons » commons-compress-windows » Windows,jdk_1.8_latest_windows #536
Posted by Apache Jenkins Server <je...@builds.apache.org>.
See <https://ci-builds.apache.org/job/Commons/job/commons-compress-windows/OS=Windows,jdk=jdk_1.8_latest_windows/536/display/redirect?page=changes>
Changes:
[garydgregory] Bump org.slf4j:slf4j-* from 2.0.16 to 2.0.19, use the BOM POM
------------------------------------------
Started by upstream project "Commons/commons-compress-windows" build number 536
originally caused by:
Started by an SCM change
Running as SYSTEM
[EnvInject] - Loading node environment variables.
Building remotely on jenkins-win-azr-10 (Windows-Docker Windows) in workspace <https://ci-builds.apache.org/job/Commons/job/commons-compress-windows/OS=Windows,jdk=jdk_1.8_latest_windows/ws/>
The recommended git tool is: NONE
No credentials specified
> git rev-parse --resolve-git-dir <https://ci-builds.apache.org/job/Commons/job/commons-compress-windows/OS=Windows,jdk=jdk_1.8_latest_windows/ws/.git> # timeout=10
Fetching changes from the remote Git repository
> git config remote.origin.url https://github.com/apache/commons-compress.git # timeout=10
Fetching upstream changes from https://github.com/apache/commons-compress.git
> git --version # timeout=10
> git --version # 'git version 2.14.3.windows.1'
> git fetch --tags --progress -- https://github.com/apache/commons-compress.git +refs/heads/*:refs/remotes/origin/* # timeout=10
Checking out Revision c15e1edf95b88363b0f60516d19896ad81187626 (refs/remotes/origin/master)
> git config core.sparsecheckout # timeout=10
> git checkout -f c15e1edf95b88363b0f60516d19896ad81187626 # timeout=10
Commit message: "Bump org.slf4j:slf4j-* from 2.0.16 to 2.0.19, use the BOM POM org.slf4j:slf4j-bom"
> git rev-list --no-walk 0fd3df60726577778f3cbb8a9b084c76477de88e # timeout=10
[jdk_1.8_latest_windows] $ cmd.exe /C "f:\jenkins\tools\maven\latest\bin\mvn.cmd -V -B --no-transfer-progress -Dhttps.protocols=TLSv1.2 clean test && exit %%ERRORLEVEL%%"
Apache Maven 3.9.16 (2bdd9fddda4b155ebf8000e807eb73fd829a51d5)
Maven home: f:\jenkins\tools\maven\latest
Java version: 1.8.0_362, vendor: Temurin, runtime: F:\jenkins\tools\java\latest1.8\jre
Default locale: en_US, platform encoding: Cp1252
OS name: "windows server 2019", version: "10.0", arch: "amd64", family: "windows"
[INFO] Scanning for projects...
[INFO]
[INFO] ----------------< org.apache.commons:commons-compress >-----------------
[INFO] Building Apache Commons Compress 1.29.0-SNAPSHOT
[INFO] from pom.xml
[INFO] --------------------------------[ jar ]---------------------------------
[INFO]
[INFO] --- clean:3.5.0:clean (default-clean) @ commons-compress ---
[INFO]
[INFO] --- enforcer:3.6.3:enforce (enforce-maven-version) @ commons-compress ---
[INFO] Rule 0: org.apache.maven.enforcer.rules.version.RequireMavenVersion passed
[INFO]
[INFO] --- enforcer:3.6.3:enforce (enforce-java-version) @ commons-compress ---
[INFO] Rule 0: org.apache.maven.enforcer.rules.version.RequireJavaVersion passed
[INFO]
[INFO] --- apache-rat:0.17:check (rat-check) @ commons-compress ---
[WARNING] Basedir is : <https://ci-builds.apache.org/job/Commons/job/commons-compress-windows/OS=Windows,jdk=jdk_1.8_latest_windows/ws/>
[ERROR] Could not create report parent directory <https://ci-builds.apache.org/job/Commons/job/commons-compress-windows/OS=Windows,jdk=jdk_1.8_latest_windows/ws/f>:\jenkins\jenkins-home\712657a4\workspace\Commons\commons-compress-windows\OS\Windows\jdk\jdk_1.8_latest_windows\target\rat.txt
[WARNING] Unable to create directory: <https://ci-builds.apache.org/job/Commons/job/commons-compress-windows/OS=Windows,jdk=jdk_1.8_latest_windows/ws/f>:\jenkins\jenkins-home\712657a4\workspace\Commons\commons-compress-windows\OS\Windows\jdk\jdk_1.8_latest_windows\target
[INFO] Excluding patterns: src/test/resources/**, .pmd, .projectile, .mvn/**, .gitattributes, site-content/**, .checkstyle, .fbprefs, .pmd, .asf.yaml, .gitattributes, src/site/resources/download_*.cgi, maven-eclipse.xml, .externalToolBuilders/**, .vscode/**, .project, .classpath, .settings/**, **/*.svg, **/*.xcf
[INFO] Excluding MAVEN collection.
[INFO] Excluding ECLIPSE collection.
[INFO] Excluding IDEA collection.
[INFO] Processing exclude file from STANDARD_SCMS.
[INFO] Excluding STANDARD_SCMS collection.
[INFO] Excluding MISC collection.
[INFO] Excluding HIDDEN_DIR collection.
[INFO] ------------------------------------------------------------------------
[INFO] BUILD FAILURE
[INFO] ------------------------------------------------------------------------
[INFO] Total time: 41.239 s
[INFO] Finished at: 2026-09-20T14:18:14Z
[INFO] ------------------------------------------------------------------------
[ERROR] Failed to execute goal org.apache.rat:apache-rat-plugin:0.17:check (rat-check) on project commons-compress: java.io.FileNotFoundException: <https://ci-builds.apache.org/job/Commons/job/commons-compress-windows/OS=Windows,jdk=jdk_1.8_latest_windows/ws/f>:\jenkins\jenkins-home\712657a4\workspace\Commons\commons-compress-windows\OS\Windows\jdk\jdk_1.8_latest_windows\target\rat.txt (The filename, directory name, or volume label syntax is incorrect) -> [Help 1]
[ERROR]
[ERROR] To see the full stack trace of the errors, re-run Maven with the -e switch.
[ERROR] Re-run Maven using the -X switch to enable full debug logging.
[ERROR]
[ERROR] For more information about the errors and possible solutions, please read the following articles:
[ERROR] [Help 1] http://cwiki.apache.org/confluence/display/MAVEN/MojoExecutionException
Build step 'Invoke top-level Maven targets' marked build as failure
Build failed in Jenkins: Commons » commons-compress-windows » Windows,jdk_1.8_latest_windows #535
Posted by Apache Jenkins Server <je...@builds.apache.org>.
See <https://ci-builds.apache.org/job/Commons/job/commons-compress-windows/OS=Windows,jdk=jdk_1.8_latest_windows/535/display/redirect?page=changes>
Changes:
[garydgregory] Bump github/codeql-action/* from 4.37.9 to 4.38.1
[garydgregory] Bump com.github.luben:zstd-jni from 1.5.7-16 to 1.5.7-17
------------------------------------------
Started by upstream project "Commons/commons-compress-windows" build number 535
originally caused by:
Started by an SCM change
Running as SYSTEM
[EnvInject] - Loading node environment variables.
Building remotely on jenkins-win-azr-4 (Windows-Docker Windows) in workspace <https://ci-builds.apache.org/job/Commons/job/commons-compress-windows/OS=Windows,jdk=jdk_1.8_latest_windows/ws/>
The recommended git tool is: NONE
No credentials specified
> git rev-parse --resolve-git-dir <https://ci-builds.apache.org/job/Commons/job/commons-compress-windows/OS=Windows,jdk=jdk_1.8_latest_windows/ws/.git> # timeout=10
Fetching changes from the remote Git repository
> git config remote.origin.url https://github.com/apache/commons-compress.git # timeout=10
Fetching upstream changes from https://github.com/apache/commons-compress.git
> git --version # timeout=10
> git --version # 'git version 2.14.3.windows.1'
> git fetch --tags --progress -- https://github.com/apache/commons-compress.git +refs/heads/*:refs/remotes/origin/* # timeout=10
Checking out Revision 0fd3df60726577778f3cbb8a9b084c76477de88e (refs/remotes/origin/master)
> git config core.sparsecheckout # timeout=10
> git checkout -f 0fd3df60726577778f3cbb8a9b084c76477de88e # timeout=10
Commit message: "Bump com.github.luben:zstd-jni from 1.5.7-16 to 1.5.7-17"
> git rev-list --no-walk c18879f54b15a5873a1d19f2ea395cdbb9af7c3a # timeout=10
[jdk_1.8_latest_windows] $ cmd.exe /C "f:\jenkins\tools\maven\latest\bin\mvn.cmd -V -B --no-transfer-progress -Dhttps.protocols=TLSv1.2 clean test && exit %%ERRORLEVEL%%"
Apache Maven 3.9.16 (2bdd9fddda4b155ebf8000e807eb73fd829a51d5)
Maven home: f:\jenkins\tools\maven\latest
Java version: 1.8.0_362, vendor: Temurin, runtime: F:\jenkins\tools\java\latest1.8\jre
Default locale: en_US, platform encoding: Cp1252
OS name: "windows server 2019", version: "10.0", arch: "amd64", family: "windows"
[INFO] Scanning for projects...
[INFO]
[INFO] ----------------< org.apache.commons:commons-compress >-----------------
[INFO] Building Apache Commons Compress 1.29.0-SNAPSHOT
[INFO] from pom.xml
[INFO] --------------------------------[ jar ]---------------------------------
[INFO]
[INFO] --- clean:3.5.0:clean (default-clean) @ commons-compress ---
[INFO]
[INFO] --- enforcer:3.6.3:enforce (enforce-maven-version) @ commons-compress ---
[INFO] Rule 0: org.apache.maven.enforcer.rules.version.RequireMavenVersion passed
[INFO]
[INFO] --- enforcer:3.6.3:enforce (enforce-java-version) @ commons-compress ---
[INFO] Rule 0: org.apache.maven.enforcer.rules.version.RequireJavaVersion passed
[INFO]
[INFO] --- apache-rat:0.17:check (rat-check) @ commons-compress ---
[WARNING] Basedir is : <https://ci-builds.apache.org/job/Commons/job/commons-compress-windows/OS=Windows,jdk=jdk_1.8_latest_windows/ws/>
[ERROR] Could not create report parent directory <https://ci-builds.apache.org/job/Commons/job/commons-compress-windows/OS=Windows,jdk=jdk_1.8_latest_windows/ws/f>:\jenkins\jenkins-home\712657a4\workspace\Commons\commons-compress-windows\OS\Windows\jdk\jdk_1.8_latest_windows\target\rat.txt
[WARNING] Unable to create directory: <https://ci-builds.apache.org/job/Commons/job/commons-compress-windows/OS=Windows,jdk=jdk_1.8_latest_windows/ws/f>:\jenkins\jenkins-home\712657a4\workspace\Commons\commons-compress-windows\OS\Windows\jdk\jdk_1.8_latest_windows\target
[INFO] Excluding patterns: src/test/resources/**, .pmd, .projectile, .mvn/**, .gitattributes, site-content/**, .checkstyle, .fbprefs, .pmd, .asf.yaml, .gitattributes, src/site/resources/download_*.cgi, maven-eclipse.xml, .externalToolBuilders/**, .vscode/**, .project, .classpath, .settings/**, **/*.svg, **/*.xcf
[INFO] Excluding MAVEN collection.
[INFO] Excluding ECLIPSE collection.
[INFO] Excluding IDEA collection.
[INFO] Processing exclude file from STANDARD_SCMS.
[INFO] Excluding STANDARD_SCMS collection.
[INFO] Excluding MISC collection.
[INFO] Excluding HIDDEN_DIR collection.
[INFO] ------------------------------------------------------------------------
[INFO] BUILD FAILURE
[INFO] ------------------------------------------------------------------------
[INFO] Total time: 01:22 min
[INFO] Finished at: 2026-09-19T16:17:11Z
[INFO] ------------------------------------------------------------------------
[ERROR] Failed to execute goal org.apache.rat:apache-rat-plugin:0.17:check (rat-check) on project commons-compress: java.io.FileNotFoundException: <https://ci-builds.apache.org/job/Commons/job/commons-compress-windows/OS=Windows,jdk=jdk_1.8_latest_windows/ws/f>:\jenkins\jenkins-home\712657a4\workspace\Commons\commons-compress-windows\OS\Windows\jdk\jdk_1.8_latest_windows\target\rat.txt (The filename, directory name, or volume label syntax is incorrect) -> [Help 1]
[ERROR]
[ERROR] To see the full stack trace of the errors, re-run Maven with the -e switch.
[ERROR] Re-run Maven using the -X switch to enable full debug logging.
[ERROR]
[ERROR] For more information about the errors and possible solutions, please read the following articles:
[ERROR] [Help 1] http://cwiki.apache.org/confluence/display/MAVEN/MojoExecutionException
Build step 'Invoke top-level Maven targets' marked build as failure
Build failed in Jenkins: Commons » commons-compress-windows » Windows,jdk_1.8_latest_windows #534
Posted by Apache Jenkins Server <je...@builds.apache.org>.
See <https://ci-builds.apache.org/job/Commons/job/commons-compress-windows/OS=Windows,jdk=jdk_1.8_latest_windows/534/display/redirect?page=changes>
Changes:
[garydgregory] Bump actions/setup-java from 6.0.0 to 6.0.1
------------------------------------------
Started by upstream project "Commons/commons-compress-windows" build number 534
originally caused by:
Started by an SCM change
Running as SYSTEM
[EnvInject] - Loading node environment variables.
Building remotely on jenkins-win-azr-1 (Windows-Docker Windows) in workspace <https://ci-builds.apache.org/job/Commons/job/commons-compress-windows/OS=Windows,jdk=jdk_1.8_latest_windows/ws/>
The recommended git tool is: NONE
No credentials specified
> git rev-parse --resolve-git-dir <https://ci-builds.apache.org/job/Commons/job/commons-compress-windows/OS=Windows,jdk=jdk_1.8_latest_windows/ws/.git> # timeout=10
Fetching changes from the remote Git repository
> git config remote.origin.url https://github.com/apache/commons-compress.git # timeout=10
Fetching upstream changes from https://github.com/apache/commons-compress.git
> git --version # timeout=10
> git --version # 'git version 2.14.3.windows.1'
> git fetch --tags --progress -- https://github.com/apache/commons-compress.git +refs/heads/*:refs/remotes/origin/* # timeout=10
Checking out Revision c18879f54b15a5873a1d19f2ea395cdbb9af7c3a (refs/remotes/origin/master)
> git config core.sparsecheckout # timeout=10
> git checkout -f c18879f54b15a5873a1d19f2ea395cdbb9af7c3a # timeout=10
Commit message: "Bump actions/setup-java from 6.0.0 to 6.0.1"
> git rev-list --no-walk 62f794ce81f80dc2bec2c26efdc5e62a2b94f617 # timeout=10
[jdk_1.8_latest_windows] $ cmd.exe /C "f:\jenkins\tools\maven\latest\bin\mvn.cmd -V -B --no-transfer-progress -Dhttps.protocols=TLSv1.2 clean test && exit %%ERRORLEVEL%%"
Apache Maven 3.9.16 (2bdd9fddda4b155ebf8000e807eb73fd829a51d5)
Maven home: f:\jenkins\tools\maven\latest
Java version: 1.8.0_362, vendor: Temurin, runtime: F:\jenkins\tools\java\latest1.8\jre
Default locale: en_US, platform encoding: Cp1252
OS name: "windows server 2019", version: "10.0", arch: "amd64", family: "windows"
[INFO] Scanning for projects...
[INFO]
[INFO] ----------------< org.apache.commons:commons-compress >-----------------
[INFO] Building Apache Commons Compress 1.29.0-SNAPSHOT
[INFO] from pom.xml
[INFO] --------------------------------[ jar ]---------------------------------
[INFO]
[INFO] --- clean:3.5.0:clean (default-clean) @ commons-compress ---
[INFO]
[INFO] --- enforcer:3.6.3:enforce (enforce-maven-version) @ commons-compress ---
[INFO] Rule 0: org.apache.maven.enforcer.rules.version.RequireMavenVersion passed
[INFO]
[INFO] --- enforcer:3.6.3:enforce (enforce-java-version) @ commons-compress ---
[INFO] Rule 0: org.apache.maven.enforcer.rules.version.RequireJavaVersion passed
[INFO]
[INFO] --- apache-rat:0.17:check (rat-check) @ commons-compress ---
[WARNING] Basedir is : <https://ci-builds.apache.org/job/Commons/job/commons-compress-windows/OS=Windows,jdk=jdk_1.8_latest_windows/ws/>
[ERROR] Could not create report parent directory <https://ci-builds.apache.org/job/Commons/job/commons-compress-windows/OS=Windows,jdk=jdk_1.8_latest_windows/ws/f>:\jenkins\jenkins-home\712657a4\workspace\Commons\commons-compress-windows\OS\Windows\jdk\jdk_1.8_latest_windows\target\rat.txt
[WARNING] Unable to create directory: <https://ci-builds.apache.org/job/Commons/job/commons-compress-windows/OS=Windows,jdk=jdk_1.8_latest_windows/ws/f>:\jenkins\jenkins-home\712657a4\workspace\Commons\commons-compress-windows\OS\Windows\jdk\jdk_1.8_latest_windows\target
[INFO] Excluding patterns: src/test/resources/**, .pmd, .projectile, .mvn/**, .gitattributes, site-content/**, .checkstyle, .fbprefs, .pmd, .asf.yaml, .gitattributes, src/site/resources/download_*.cgi, maven-eclipse.xml, .externalToolBuilders/**, .vscode/**, .project, .classpath, .settings/**, **/*.svg, **/*.xcf
[INFO] Excluding MAVEN collection.
[INFO] Excluding ECLIPSE collection.
[INFO] Excluding IDEA collection.
[INFO] Processing exclude file from STANDARD_SCMS.
[INFO] Excluding STANDARD_SCMS collection.
[INFO] Excluding MISC collection.
[INFO] Excluding HIDDEN_DIR collection.
[INFO] ------------------------------------------------------------------------
[INFO] BUILD FAILURE
[INFO] ------------------------------------------------------------------------
[INFO] Total time: 01:11 min
[INFO] Finished at: 2026-09-19T15:16:55Z
[INFO] ------------------------------------------------------------------------
[ERROR] Failed to execute goal org.apache.rat:apache-rat-plugin:0.17:check (rat-check) on project commons-compress: java.io.FileNotFoundException: <https://ci-builds.apache.org/job/Commons/job/commons-compress-windows/OS=Windows,jdk=jdk_1.8_latest_windows/ws/f>:\jenkins\jenkins-home\712657a4\workspace\Commons\commons-compress-windows\OS\Windows\jdk\jdk_1.8_latest_windows\target\rat.txt (The filename, directory name, or volume label syntax is incorrect) -> [Help 1]
[ERROR]
[ERROR] To see the full stack trace of the errors, re-run Maven with the -e switch.
[ERROR] Re-run Maven using the -X switch to enable full debug logging.
[ERROR]
[ERROR] For more information about the errors and possible solutions, please read the following articles:
[ERROR] [Help 1] http://cwiki.apache.org/confluence/display/MAVEN/MojoExecutionException
Build step 'Invoke top-level Maven targets' marked build as failure
Build failed in Jenkins: Commons » commons-compress-windows » Windows,jdk_1.8_latest_windows #533
Posted by Apache Jenkins Server <je...@builds.apache.org>.
See <https://ci-builds.apache.org/job/Commons/job/commons-compress-windows/OS=Windows,jdk=jdk_1.8_latest_windows/533/display/redirect?page=changes>
Changes:
[garydgregory] Bump org.apache.commons:commons-parent from 104 to 105.
------------------------------------------
Started by upstream project "Commons/commons-compress-windows" build number 533
originally caused by:
Started by an SCM change
Running as SYSTEM
[EnvInject] - Loading node environment variables.
Building remotely on jenkins-win-azr-4 (Windows-Docker Windows) in workspace <https://ci-builds.apache.org/job/Commons/job/commons-compress-windows/OS=Windows,jdk=jdk_1.8_latest_windows/ws/>
The recommended git tool is: NONE
No credentials specified
> git rev-parse --resolve-git-dir <https://ci-builds.apache.org/job/Commons/job/commons-compress-windows/OS=Windows,jdk=jdk_1.8_latest_windows/ws/.git> # timeout=10
Fetching changes from the remote Git repository
> git config remote.origin.url https://github.com/apache/commons-compress.git # timeout=10
Fetching upstream changes from https://github.com/apache/commons-compress.git
> git --version # timeout=10
> git --version # 'git version 2.14.3.windows.1'
> git fetch --tags --progress -- https://github.com/apache/commons-compress.git +refs/heads/*:refs/remotes/origin/* # timeout=10
Checking out Revision 62f794ce81f80dc2bec2c26efdc5e62a2b94f617 (refs/remotes/origin/master)
> git config core.sparsecheckout # timeout=10
> git checkout -f 62f794ce81f80dc2bec2c26efdc5e62a2b94f617 # timeout=10
Commit message: "Bump org.apache.commons:commons-parent from 104 to 105."
> git rev-list --no-walk 6aaf8d1606d9e5645a99ec48e245415af4f3e806 # timeout=10
[jdk_1.8_latest_windows] $ cmd.exe /C "f:\jenkins\tools\maven\latest\bin\mvn.cmd -V -B --no-transfer-progress -Dhttps.protocols=TLSv1.2 clean test && exit %%ERRORLEVEL%%"
Apache Maven 3.9.11 (3e54c93a704957b63ee3494413a2b544fd3d825b)
Maven home: f:\jenkins\tools\maven\latest
Java version: 1.8.0_362, vendor: Temurin, runtime: F:\jenkins\tools\java\latest1.8\jre
Default locale: en_US, platform encoding: Cp1252
OS name: "windows server 2019", version: "10.0", arch: "amd64", family: "windows"
[INFO] Scanning for projects...
[INFO]
[INFO] ----------------< org.apache.commons:commons-compress >-----------------
[INFO] Building Apache Commons Compress 1.29.0-SNAPSHOT
[INFO] from pom.xml
[INFO] --------------------------------[ jar ]---------------------------------
[INFO]
[INFO] --- clean:3.5.0:clean (default-clean) @ commons-compress ---
[INFO]
[INFO] --- enforcer:3.6.3:enforce (enforce-maven-version) @ commons-compress ---
[INFO] Rule 0: org.apache.maven.enforcer.rules.version.RequireMavenVersion passed
[INFO]
[INFO] --- enforcer:3.6.3:enforce (enforce-java-version) @ commons-compress ---
[INFO] Rule 0: org.apache.maven.enforcer.rules.version.RequireJavaVersion passed
[INFO]
[INFO] --- apache-rat:0.17:check (rat-check) @ commons-compress ---
[WARNING] Basedir is : <https://ci-builds.apache.org/job/Commons/job/commons-compress-windows/OS=Windows,jdk=jdk_1.8_latest_windows/ws/>
[ERROR] Could not create report parent directory <https://ci-builds.apache.org/job/Commons/job/commons-compress-windows/OS=Windows,jdk=jdk_1.8_latest_windows/ws/f>:\jenkins\jenkins-home\712657a4\workspace\Commons\commons-compress-windows\OS\Windows\jdk\jdk_1.8_latest_windows\target\rat.txt
[WARNING] Unable to create directory: <https://ci-builds.apache.org/job/Commons/job/commons-compress-windows/OS=Windows,jdk=jdk_1.8_latest_windows/ws/f>:\jenkins\jenkins-home\712657a4\workspace\Commons\commons-compress-windows\OS\Windows\jdk\jdk_1.8_latest_windows\target
[INFO] Excluding patterns: src/test/resources/**, .pmd, .projectile, .mvn/**, .gitattributes, site-content/**, .checkstyle, .fbprefs, .pmd, .asf.yaml, .gitattributes, src/site/resources/download_*.cgi, maven-eclipse.xml, .externalToolBuilders/**, .vscode/**, .project, .classpath, .settings/**, **/*.svg, **/*.xcf
[INFO] Excluding MAVEN collection.
[INFO] Excluding ECLIPSE collection.
[INFO] Excluding IDEA collection.
[INFO] Processing exclude file from STANDARD_SCMS.
[INFO] Excluding STANDARD_SCMS collection.
[INFO] Excluding MISC collection.
[INFO] Excluding HIDDEN_DIR collection.
[INFO] ------------------------------------------------------------------------
[INFO] BUILD FAILURE
[INFO] ------------------------------------------------------------------------
[INFO] Total time: 01:22 min
[INFO] Finished at: 2026-09-07T14:19:59Z
[INFO] ------------------------------------------------------------------------
[ERROR] Failed to execute goal org.apache.rat:apache-rat-plugin:0.17:check (rat-check) on project commons-compress: java.io.FileNotFoundException: <https://ci-builds.apache.org/job/Commons/job/commons-compress-windows/OS=Windows,jdk=jdk_1.8_latest_windows/ws/f>:\jenkins\jenkins-home\712657a4\workspace\Commons\commons-compress-windows\OS\Windows\jdk\jdk_1.8_latest_windows\target\rat.txt (The filename, directory name, or volume label syntax is incorrect) -> [Help 1]
[ERROR]
[ERROR] To see the full stack trace of the errors, re-run Maven with the -e switch.
[ERROR] Re-run Maven using the -X switch to enable full debug logging.
[ERROR]
[ERROR] For more information about the errors and possible solutions, please read the following articles:
[ERROR] [Help 1] http://cwiki.apache.org/confluence/display/MAVEN/MojoExecutionException
Build step 'Invoke top-level Maven targets' marked build as failure
Build failed in Jenkins: Commons » commons-compress-windows » Windows,jdk_1.8_latest_windows #532
Posted by Apache Jenkins Server <je...@builds.apache.org>.
See <https://ci-builds.apache.org/job/Commons/job/commons-compress-windows/OS=Windows,jdk=jdk_1.8_latest_windows/532/display/redirect?page=changes>
Changes:
[garydgregory] Bump om.github.luben:zstd-jni from 1.5.7-15 to 1.5.7-16.
------------------------------------------
Started by upstream project "Commons/commons-compress-windows" build number 532
originally caused by:
Started by an SCM change
Running as SYSTEM
[EnvInject] - Loading node environment variables.
Building remotely on jenkins-win-azr-3 (Windows-Docker Windows) in workspace <https://ci-builds.apache.org/job/Commons/job/commons-compress-windows/OS=Windows,jdk=jdk_1.8_latest_windows/ws/>
The recommended git tool is: NONE
No credentials specified
> git rev-parse --resolve-git-dir <https://ci-builds.apache.org/job/Commons/job/commons-compress-windows/OS=Windows,jdk=jdk_1.8_latest_windows/ws/.git> # timeout=10
Fetching changes from the remote Git repository
> git config remote.origin.url https://github.com/apache/commons-compress.git # timeout=10
Fetching upstream changes from https://github.com/apache/commons-compress.git
> git --version # timeout=10
> git --version # 'git version 2.14.3.windows.1'
> git fetch --tags --progress -- https://github.com/apache/commons-compress.git +refs/heads/*:refs/remotes/origin/* # timeout=10
Checking out Revision 6aaf8d1606d9e5645a99ec48e245415af4f3e806 (refs/remotes/origin/master)
> git config core.sparsecheckout # timeout=10
> git checkout -f 6aaf8d1606d9e5645a99ec48e245415af4f3e806 # timeout=10
Commit message: "Bump om.github.luben:zstd-jni from 1.5.7-15 to 1.5.7-16."
> git rev-list --no-walk 8125ed65e25104e1c4a63ef971f8b6345f6d4fa3 # timeout=10
[jdk_1.8_latest_windows] $ cmd.exe /C "f:\jenkins\tools\maven\latest\bin\mvn.cmd -V -B --no-transfer-progress -Dhttps.protocols=TLSv1.2 clean test && exit %%ERRORLEVEL%%"
Apache Maven 3.9.11 (3e54c93a704957b63ee3494413a2b544fd3d825b)
Maven home: f:\jenkins\tools\maven\latest
Java version: 1.8.0_362, vendor: Temurin, runtime: F:\jenkins\tools\java\latest1.8\jre
Default locale: en_US, platform encoding: Cp1252
OS name: "windows server 2019", version: "10.0", arch: "amd64", family: "windows"
[INFO] Scanning for projects...
[INFO]
[INFO] ----------------< org.apache.commons:commons-compress >-----------------
[INFO] Building Apache Commons Compress 1.29.0-SNAPSHOT
[INFO] from pom.xml
[INFO] --------------------------------[ jar ]---------------------------------
[INFO]
[INFO] --- clean:3.5.0:clean (default-clean) @ commons-compress ---
[INFO]
[INFO] --- enforcer:3.6.3:enforce (enforce-maven-version) @ commons-compress ---
[INFO] Rule 0: org.apache.maven.enforcer.rules.version.RequireMavenVersion passed
[INFO]
[INFO] --- enforcer:3.6.3:enforce (enforce-java-version) @ commons-compress ---
[INFO] Rule 0: org.apache.maven.enforcer.rules.version.RequireJavaVersion passed
[INFO]
[INFO] --- apache-rat:0.17:check (rat-check) @ commons-compress ---
[WARNING] Basedir is : <https://ci-builds.apache.org/job/Commons/job/commons-compress-windows/OS=Windows,jdk=jdk_1.8_latest_windows/ws/>
[ERROR] Could not create report parent directory <https://ci-builds.apache.org/job/Commons/job/commons-compress-windows/OS=Windows,jdk=jdk_1.8_latest_windows/ws/f>:\jenkins\jenkins-home\712657a4\workspace\Commons\commons-compress-windows\OS\Windows\jdk\jdk_1.8_latest_windows\target\rat.txt
[WARNING] Unable to create directory: <https://ci-builds.apache.org/job/Commons/job/commons-compress-windows/OS=Windows,jdk=jdk_1.8_latest_windows/ws/f>:\jenkins\jenkins-home\712657a4\workspace\Commons\commons-compress-windows\OS\Windows\jdk\jdk_1.8_latest_windows\target
[INFO] Excluding patterns: src/test/resources/**, .pmd, .projectile, .mvn/**, .gitattributes, site-content/**, .checkstyle, .fbprefs, .pmd, .asf.yaml, .gitattributes, src/site/resources/download_*.cgi, maven-eclipse.xml, .externalToolBuilders/**, .vscode/**, .project, .classpath, .settings/**, **/*.svg, **/*.xcf
[INFO] Excluding MAVEN collection.
[INFO] Excluding ECLIPSE collection.
[INFO] Excluding IDEA collection.
[INFO] Processing exclude file from STANDARD_SCMS.
[INFO] Excluding STANDARD_SCMS collection.
[INFO] Excluding MISC collection.
[INFO] Excluding HIDDEN_DIR collection.
[INFO] ------------------------------------------------------------------------
[INFO] BUILD FAILURE
[INFO] ------------------------------------------------------------------------
[INFO] Total time: 01:32 min
[INFO] Finished at: 2026-09-03T20:20:00Z
[INFO] ------------------------------------------------------------------------
[ERROR] Failed to execute goal org.apache.rat:apache-rat-plugin:0.17:check (rat-check) on project commons-compress: java.io.FileNotFoundException: <https://ci-builds.apache.org/job/Commons/job/commons-compress-windows/OS=Windows,jdk=jdk_1.8_latest_windows/ws/f>:\jenkins\jenkins-home\712657a4\workspace\Commons\commons-compress-windows\OS\Windows\jdk\jdk_1.8_latest_windows\target\rat.txt (The filename, directory name, or volume label syntax is incorrect) -> [Help 1]
[ERROR]
[ERROR] To see the full stack trace of the errors, re-run Maven with the -e switch.
[ERROR] Re-run Maven using the -X switch to enable full debug logging.
[ERROR]
[ERROR] For more information about the errors and possible solutions, please read the following articles:
[ERROR] [Help 1] http://cwiki.apache.org/confluence/display/MAVEN/MojoExecutionException
Build step 'Invoke top-level Maven targets' marked build as failure
Build failed in Jenkins: Commons » commons-compress-windows » Windows,jdk_1.8_latest_windows #531
Posted by Apache Jenkins Server <je...@builds.apache.org>.
See <https://ci-builds.apache.org/job/Commons/job/commons-compress-windows/OS=Windows,jdk=jdk_1.8_latest_windows/531/display/redirect?page=changes>
Changes:
[garydgregory] Bump github/codeql-action/analyze from 4.37.8 to 4.37.9.
------------------------------------------
Started by upstream project "Commons/commons-compress-windows" build number 531
originally caused by:
Started by an SCM change
Running as SYSTEM
[EnvInject] - Loading node environment variables.
Building remotely on jenkins-win-azr-1 (Windows-Docker Windows) in workspace <https://ci-builds.apache.org/job/Commons/job/commons-compress-windows/OS=Windows,jdk=jdk_1.8_latest_windows/ws/>
The recommended git tool is: NONE
No credentials specified
> git rev-parse --resolve-git-dir <https://ci-builds.apache.org/job/Commons/job/commons-compress-windows/OS=Windows,jdk=jdk_1.8_latest_windows/ws/.git> # timeout=10
Fetching changes from the remote Git repository
> git config remote.origin.url https://github.com/apache/commons-compress.git # timeout=10
Fetching upstream changes from https://github.com/apache/commons-compress.git
> git --version # timeout=10
> git --version # 'git version 2.14.3.windows.1'
> git fetch --tags --progress -- https://github.com/apache/commons-compress.git +refs/heads/*:refs/remotes/origin/* # timeout=10
Checking out Revision 8125ed65e25104e1c4a63ef971f8b6345f6d4fa3 (refs/remotes/origin/master)
> git config core.sparsecheckout # timeout=10
> git checkout -f 8125ed65e25104e1c4a63ef971f8b6345f6d4fa3 # timeout=10
Commit message: "Bump github/codeql-action/analyze from 4.37.8 to 4.37.9."
> git rev-list --no-walk f8106cd28e8787c4c1e1efc90f5316b969681d8a # timeout=10
[jdk_1.8_latest_windows] $ cmd.exe /C "f:\jenkins\tools\maven\latest\bin\mvn.cmd -V -B --no-transfer-progress -Dhttps.protocols=TLSv1.2 clean test && exit %%ERRORLEVEL%%"
Apache Maven 3.9.11 (3e54c93a704957b63ee3494413a2b544fd3d825b)
Maven home: f:\jenkins\tools\maven\latest
Java version: 1.8.0_362, vendor: Temurin, runtime: F:\jenkins\tools\java\latest1.8\jre
Default locale: en_US, platform encoding: Cp1252
OS name: "windows server 2019", version: "10.0", arch: "amd64", family: "windows"
[INFO] Scanning for projects...
[INFO]
[INFO] ----------------< org.apache.commons:commons-compress >-----------------
[INFO] Building Apache Commons Compress 1.29.0-SNAPSHOT
[INFO] from pom.xml
[INFO] --------------------------------[ jar ]---------------------------------
[INFO]
[INFO] --- clean:3.5.0:clean (default-clean) @ commons-compress ---
[INFO]
[INFO] --- enforcer:3.6.3:enforce (enforce-maven-version) @ commons-compress ---
[INFO] Rule 0: org.apache.maven.enforcer.rules.version.RequireMavenVersion passed
[INFO]
[INFO] --- enforcer:3.6.3:enforce (enforce-java-version) @ commons-compress ---
[INFO] Rule 0: org.apache.maven.enforcer.rules.version.RequireJavaVersion passed
[INFO]
[INFO] --- apache-rat:0.17:check (rat-check) @ commons-compress ---
[WARNING] Basedir is : <https://ci-builds.apache.org/job/Commons/job/commons-compress-windows/OS=Windows,jdk=jdk_1.8_latest_windows/ws/>
[ERROR] Could not create report parent directory <https://ci-builds.apache.org/job/Commons/job/commons-compress-windows/OS=Windows,jdk=jdk_1.8_latest_windows/ws/f>:\jenkins\jenkins-home\712657a4\workspace\Commons\commons-compress-windows\OS\Windows\jdk\jdk_1.8_latest_windows\target\rat.txt
[WARNING] Unable to create directory: <https://ci-builds.apache.org/job/Commons/job/commons-compress-windows/OS=Windows,jdk=jdk_1.8_latest_windows/ws/f>:\jenkins\jenkins-home\712657a4\workspace\Commons\commons-compress-windows\OS\Windows\jdk\jdk_1.8_latest_windows\target
[INFO] Excluding patterns: src/test/resources/**, .pmd, .projectile, .mvn/**, .gitattributes, site-content/**, .checkstyle, .fbprefs, .pmd, .asf.yaml, .gitattributes, src/site/resources/download_*.cgi, maven-eclipse.xml, .externalToolBuilders/**, .vscode/**, .project, .classpath, .settings/**, **/*.svg, **/*.xcf
[INFO] Excluding MAVEN collection.
[INFO] Excluding ECLIPSE collection.
[INFO] Excluding IDEA collection.
[INFO] Processing exclude file from STANDARD_SCMS.
[INFO] Excluding STANDARD_SCMS collection.
[INFO] Excluding MISC collection.
[INFO] Excluding HIDDEN_DIR collection.
[INFO] ------------------------------------------------------------------------
[INFO] BUILD FAILURE
[INFO] ------------------------------------------------------------------------
[INFO] Total time: 01:29 min
[INFO] Finished at: 2026-08-31T12:19:54Z
[INFO] ------------------------------------------------------------------------
[ERROR] Failed to execute goal org.apache.rat:apache-rat-plugin:0.17:check (rat-check) on project commons-compress: java.io.FileNotFoundException: <https://ci-builds.apache.org/job/Commons/job/commons-compress-windows/OS=Windows,jdk=jdk_1.8_latest_windows/ws/f>:\jenkins\jenkins-home\712657a4\workspace\Commons\commons-compress-windows\OS\Windows\jdk\jdk_1.8_latest_windows\target\rat.txt (The filename, directory name, or volume label syntax is incorrect) -> [Help 1]
[ERROR]
[ERROR] To see the full stack trace of the errors, re-run Maven with the -e switch.
[ERROR] Re-run Maven using the -X switch to enable full debug logging.
[ERROR]
[ERROR] For more information about the errors and possible solutions, please read the following articles:
[ERROR] [Help 1] http://cwiki.apache.org/confluence/display/MAVEN/MojoExecutionException
Build step 'Invoke top-level Maven targets' marked build as failure
Build failed in Jenkins: Commons » commons-compress-windows » Windows,jdk_1.8_latest_windows #530
Posted by Apache Jenkins Server <je...@builds.apache.org>.
See <https://ci-builds.apache.org/job/Commons/job/commons-compress-windows/OS=Windows,jdk=jdk_1.8_latest_windows/530/display/redirect?page=changes>
Changes:
[garydgregory] Bump actions/setup-java from 5.7.0 to 6.0.0.
------------------------------------------
Started by upstream project "Commons/commons-compress-windows" build number 530
originally caused by:
Started by an SCM change
Running as SYSTEM
[EnvInject] - Loading node environment variables.
Building remotely on jenkins-win-azr-7 (Windows-Docker Windows) in workspace <https://ci-builds.apache.org/job/Commons/job/commons-compress-windows/OS=Windows,jdk=jdk_1.8_latest_windows/ws/>
The recommended git tool is: NONE
No credentials specified
> git rev-parse --resolve-git-dir <https://ci-builds.apache.org/job/Commons/job/commons-compress-windows/OS=Windows,jdk=jdk_1.8_latest_windows/ws/.git> # timeout=10
Fetching changes from the remote Git repository
> git config remote.origin.url https://github.com/apache/commons-compress.git # timeout=10
Fetching upstream changes from https://github.com/apache/commons-compress.git
> git --version # timeout=10
> git --version # 'git version 2.14.3.windows.1'
> git fetch --tags --progress -- https://github.com/apache/commons-compress.git +refs/heads/*:refs/remotes/origin/* # timeout=10
Checking out Revision f8106cd28e8787c4c1e1efc90f5316b969681d8a (refs/remotes/origin/master)
> git config core.sparsecheckout # timeout=10
> git checkout -f f8106cd28e8787c4c1e1efc90f5316b969681d8a # timeout=10
Commit message: "Bump actions/setup-java from 5.7.0 to 6.0.0."
> git rev-list --no-walk cce8cde07c6e0405e9a08f978836f6b45a6f8d93 # timeout=10
[jdk_1.8_latest_windows] $ cmd.exe /C "f:\jenkins\tools\maven\latest\bin\mvn.cmd -V -B --no-transfer-progress -Dhttps.protocols=TLSv1.2 clean test && exit %%ERRORLEVEL%%"
Apache Maven 3.9.11 (3e54c93a704957b63ee3494413a2b544fd3d825b)
Maven home: f:\jenkins\tools\maven\latest
Java version: 1.8.0_362, vendor: Temurin, runtime: F:\jenkins\tools\java\latest1.8\jre
Default locale: en_US, platform encoding: Cp1252
OS name: "windows server 2019", version: "10.0", arch: "amd64", family: "windows"
[INFO] Scanning for projects...
[INFO]
[INFO] ----------------< org.apache.commons:commons-compress >-----------------
[INFO] Building Apache Commons Compress 1.29.0-SNAPSHOT
[INFO] from pom.xml
[INFO] --------------------------------[ jar ]---------------------------------
[INFO]
[INFO] --- clean:3.5.0:clean (default-clean) @ commons-compress ---
[INFO]
[INFO] --- enforcer:3.6.3:enforce (enforce-maven-version) @ commons-compress ---
[INFO] Rule 0: org.apache.maven.enforcer.rules.version.RequireMavenVersion passed
[INFO]
[INFO] --- enforcer:3.6.3:enforce (enforce-java-version) @ commons-compress ---
[INFO] Rule 0: org.apache.maven.enforcer.rules.version.RequireJavaVersion passed
[INFO]
[INFO] --- apache-rat:0.17:check (rat-check) @ commons-compress ---
[WARNING] Basedir is : <https://ci-builds.apache.org/job/Commons/job/commons-compress-windows/OS=Windows,jdk=jdk_1.8_latest_windows/ws/>
[ERROR] Could not create report parent directory <https://ci-builds.apache.org/job/Commons/job/commons-compress-windows/OS=Windows,jdk=jdk_1.8_latest_windows/ws/f>:\jenkins\jenkins-home\712657a4\workspace\Commons\commons-compress-windows\OS\Windows\jdk\jdk_1.8_latest_windows\target\rat.txt
[WARNING] Unable to create directory: <https://ci-builds.apache.org/job/Commons/job/commons-compress-windows/OS=Windows,jdk=jdk_1.8_latest_windows/ws/f>:\jenkins\jenkins-home\712657a4\workspace\Commons\commons-compress-windows\OS\Windows\jdk\jdk_1.8_latest_windows\target
[INFO] Excluding patterns: src/test/resources/**, .pmd, .projectile, .mvn/**, .gitattributes, site-content/**, .checkstyle, .fbprefs, .pmd, .asf.yaml, .gitattributes, src/site/resources/download_*.cgi, maven-eclipse.xml, .externalToolBuilders/**, .vscode/**, .project, .classpath, .settings/**, **/*.svg, **/*.xcf
[INFO] Excluding MAVEN collection.
[INFO] Excluding ECLIPSE collection.
[INFO] Excluding IDEA collection.
[INFO] Processing exclude file from STANDARD_SCMS.
[INFO] Excluding STANDARD_SCMS collection.
[INFO] Excluding MISC collection.
[INFO] Excluding HIDDEN_DIR collection.
[INFO] ------------------------------------------------------------------------
[INFO] BUILD FAILURE
[INFO] ------------------------------------------------------------------------
[INFO] Total time: 31.231 s
[INFO] Finished at: 2026-08-27T18:17:58Z
[INFO] ------------------------------------------------------------------------
[ERROR] Failed to execute goal org.apache.rat:apache-rat-plugin:0.17:check (rat-check) on project commons-compress: java.io.FileNotFoundException: <https://ci-builds.apache.org/job/Commons/job/commons-compress-windows/OS=Windows,jdk=jdk_1.8_latest_windows/ws/f>:\jenkins\jenkins-home\712657a4\workspace\Commons\commons-compress-windows\OS\Windows\jdk\jdk_1.8_latest_windows\target\rat.txt (The filename, directory name, or volume label syntax is incorrect) -> [Help 1]
[ERROR]
[ERROR] To see the full stack trace of the errors, re-run Maven with the -e switch.
[ERROR] Re-run Maven using the -X switch to enable full debug logging.
[ERROR]
[ERROR] For more information about the errors and possible solutions, please read the following articles:
[ERROR] [Help 1] http://cwiki.apache.org/confluence/display/MAVEN/MojoExecutionException
Build step 'Invoke top-level Maven targets' marked build as failure