You are viewing a plain text version of this content. The canonical link for it is here.
Posted to dev@lucene.apache.org by Policeman Jenkins Server <je...@thetaphi.de> on 2014/05/12 15:56:37 UTC

[JENKINS] Lucene-Solr-4.8-Linux (32bit/jdk1.7.0_55) - Build # 153 - Failure!

Build: http://jenkins.thetaphi.de/job/Lucene-Solr-4.8-Linux/153/
Java: 32bit/jdk1.7.0_55 -client -XX:+UseConcMarkSweepGC

1 tests failed.
REGRESSION:  org.apache.lucene.index.TestIndexWriterExceptions.testNoLostDeletesOrUpdates

Error Message:
doc=5104 expected:<2> but was:<26>

Stack Trace:
java.lang.AssertionError: doc=5104 expected:<2> but was:<26>
	at __randomizedtesting.SeedInfo.seed([52D7D03ED479C0BC:3BACD2B522D70AFC]:0)
	at org.junit.Assert.fail(Assert.java:93)
	at org.junit.Assert.failNotEquals(Assert.java:647)
	at org.junit.Assert.assertEquals(Assert.java:128)
	at org.junit.Assert.assertEquals(Assert.java:472)
	at org.apache.lucene.index.TestIndexWriterExceptions.testNoLostDeletesOrUpdates(TestIndexWriterExceptions.java:1919)
	at sun.reflect.NativeMethodAccessorImpl.invoke0(Native Method)
	at sun.reflect.NativeMethodAccessorImpl.invoke(NativeMethodAccessorImpl.java:57)
	at sun.reflect.DelegatingMethodAccessorImpl.invoke(DelegatingMethodAccessorImpl.java:43)
	at java.lang.reflect.Method.invoke(Method.java:606)
	at com.carrotsearch.randomizedtesting.RandomizedRunner.invoke(RandomizedRunner.java:1618)
	at com.carrotsearch.randomizedtesting.RandomizedRunner$6.evaluate(RandomizedRunner.java:827)
	at com.carrotsearch.randomizedtesting.RandomizedRunner$7.evaluate(RandomizedRunner.java:863)
	at com.carrotsearch.randomizedtesting.RandomizedRunner$8.evaluate(RandomizedRunner.java:877)
	at org.apache.lucene.util.TestRuleSetupTeardownChained$1.evaluate(TestRuleSetupTeardownChained.java:50)
	at org.apache.lucene.util.TestRuleFieldCacheSanity$1.evaluate(TestRuleFieldCacheSanity.java:51)
	at org.apache.lucene.util.AbstractBeforeAfterRule$1.evaluate(AbstractBeforeAfterRule.java:46)
	at com.carrotsearch.randomizedtesting.rules.SystemPropertiesInvariantRule$1.evaluate(SystemPropertiesInvariantRule.java:55)
	at org.apache.lucene.util.TestRuleThreadAndTestName$1.evaluate(TestRuleThreadAndTestName.java:49)
	at org.apache.lucene.util.TestRuleIgnoreAfterMaxFailures$1.evaluate(TestRuleIgnoreAfterMaxFailures.java:65)
	at org.apache.lucene.util.TestRuleMarkFailure$1.evaluate(TestRuleMarkFailure.java:48)
	at com.carrotsearch.randomizedtesting.rules.StatementAdapter.evaluate(StatementAdapter.java:36)
	at com.carrotsearch.randomizedtesting.ThreadLeakControl$StatementRunner.run(ThreadLeakControl.java:360)
	at com.carrotsearch.randomizedtesting.ThreadLeakControl.forkTimeoutingTask(ThreadLeakControl.java:793)
	at com.carrotsearch.randomizedtesting.ThreadLeakControl$3.evaluate(ThreadLeakControl.java:453)
	at com.carrotsearch.randomizedtesting.RandomizedRunner.runSingleTest(RandomizedRunner.java:836)
	at com.carrotsearch.randomizedtesting.RandomizedRunner$3.evaluate(RandomizedRunner.java:738)
	at com.carrotsearch.randomizedtesting.RandomizedRunner$4.evaluate(RandomizedRunner.java:772)
	at com.carrotsearch.randomizedtesting.RandomizedRunner$5.evaluate(RandomizedRunner.java:783)
	at org.apache.lucene.util.AbstractBeforeAfterRule$1.evaluate(AbstractBeforeAfterRule.java:46)
	at org.apache.lucene.util.TestRuleStoreClassName$1.evaluate(TestRuleStoreClassName.java:42)
	at com.carrotsearch.randomizedtesting.rules.SystemPropertiesInvariantRule$1.evaluate(SystemPropertiesInvariantRule.java:55)
	at com.carrotsearch.randomizedtesting.rules.NoShadowingOrOverridesOnMethodsRule$1.evaluate(NoShadowingOrOverridesOnMethodsRule.java:39)
	at com.carrotsearch.randomizedtesting.rules.NoShadowingOrOverridesOnMethodsRule$1.evaluate(NoShadowingOrOverridesOnMethodsRule.java:39)
	at com.carrotsearch.randomizedtesting.rules.StatementAdapter.evaluate(StatementAdapter.java:36)
	at com.carrotsearch.randomizedtesting.rules.StatementAdapter.evaluate(StatementAdapter.java:36)
	at org.apache.lucene.util.TestRuleAssertionsRequired$1.evaluate(TestRuleAssertionsRequired.java:43)
	at org.apache.lucene.util.TestRuleMarkFailure$1.evaluate(TestRuleMarkFailure.java:48)
	at org.apache.lucene.util.TestRuleIgnoreAfterMaxFailures$1.evaluate(TestRuleIgnoreAfterMaxFailures.java:65)
	at org.apache.lucene.util.TestRuleIgnoreTestSuites$1.evaluate(TestRuleIgnoreTestSuites.java:55)
	at com.carrotsearch.randomizedtesting.rules.StatementAdapter.evaluate(StatementAdapter.java:36)
	at com.carrotsearch.randomizedtesting.ThreadLeakControl$StatementRunner.run(ThreadLeakControl.java:360)
	at java.lang.Thread.run(Thread.java:745)




Build Log:
[...truncated 546 lines...]
   [junit4] Suite: org.apache.lucene.index.TestIndexWriterExceptions
   [junit4]   2> NOTE: reproduce with: ant test  -Dtestcase=TestIndexWriterExceptions -Dtests.method=testNoLostDeletesOrUpdates -Dtests.seed=52D7D03ED479C0BC -Dtests.multiplier=3 -Dtests.slow=true -Dtests.locale=es -Dtests.timezone=NZ -Dtests.file.encoding=UTF-8
   [junit4] FAILURE 12.4s J1 | TestIndexWriterExceptions.testNoLostDeletesOrUpdates <<<
   [junit4]    > Throwable #1: java.lang.AssertionError: doc=5104 expected:<2> but was:<26>
   [junit4]    > 	at __randomizedtesting.SeedInfo.seed([52D7D03ED479C0BC:3BACD2B522D70AFC]:0)
   [junit4]    > 	at org.apache.lucene.index.TestIndexWriterExceptions.testNoLostDeletesOrUpdates(TestIndexWriterExceptions.java:1919)
   [junit4]    > 	at java.lang.Thread.run(Thread.java:745)
   [junit4]   2> NOTE: leaving temporary files on disk at: /mnt/ssd/jenkins/workspace/Lucene-Solr-4.8-Linux/lucene/build/core/test/J1/./lucene.index.TestIndexWriterExceptions-52D7D03ED479C0BC-001
   [junit4]   2> NOTE: test params are: codec=Asserting, sim=DefaultSimilarity, locale=es, timezone=NZ
   [junit4]   2> NOTE: Linux 3.8.0-39-generic i386/Oracle Corporation 1.7.0_55 (32-bit)/cpus=8,threads=1,free=70162456,total=140910592
   [junit4]   2> NOTE: All tests run in this JVM: [TestHighCompressionMode, TestAssertions, TestBufferedIndexInput, TestConsistentFieldNumbers, TestNumericUtils, TestSpans, TestBitVector, TestOmitPositions, TestLongPostings, TestDocValuesIndexing, TestTermVectorsFormat, TestLucene40TermVectorsFormat, TestBagOfPostings, TestAutomatonQuery, Before3, Before3, TestWeakIdentityMap, TestFieldValueFilter, TestBinaryDocument, TestSimpleExplanationsOfNonMatches, TestPayloadSpans, TestBoolean2, TestSpansAdvanced, TestPerFieldPostingsFormat, TestVersionComparator, TestAttributeSource, TestNeverDelete, TestIntsRef, TestSpanExplanations, TestTieredMergePolicy, TestFieldMaskingSpanQuery, TestCachingWrapperFilter, TestNearSpansOrdered, TestIndexWriterExceptions]
   [junit4] Completed on J1 in 48.85s, 29 tests, 1 failure <<< FAILURES!

[...truncated 1255 lines...]
BUILD FAILED
/mnt/ssd/jenkins/workspace/Lucene-Solr-4.8-Linux/build.xml:467: The following error occurred while executing this line:
/mnt/ssd/jenkins/workspace/Lucene-Solr-4.8-Linux/build.xml:447: The following error occurred while executing this line:
/mnt/ssd/jenkins/workspace/Lucene-Solr-4.8-Linux/build.xml:45: The following error occurred while executing this line:
/mnt/ssd/jenkins/workspace/Lucene-Solr-4.8-Linux/extra-targets.xml:37: The following error occurred while executing this line:
/mnt/ssd/jenkins/workspace/Lucene-Solr-4.8-Linux/lucene/build.xml:49: The following error occurred while executing this line:
/mnt/ssd/jenkins/workspace/Lucene-Solr-4.8-Linux/lucene/common-build.xml:1293: The following error occurred while executing this line:
/mnt/ssd/jenkins/workspace/Lucene-Solr-4.8-Linux/lucene/common-build.xml:919: There were test failures: 398 suites, 2909 tests, 1 failure, 112 ignored (99 assumptions)

Total time: 20 minutes 45 seconds
Build step 'Invoke Ant' marked build as failure
Description set: Java: 32bit/jdk1.7.0_55 -client -XX:+UseConcMarkSweepGC
Archiving artifacts
Recording test results
Email was triggered for: Failure
Sending email for trigger: Failure