You are viewing a plain text version of this content. The canonical link for it is here.
Posted to dev@kafka.apache.org by Apache Jenkins Server <je...@builds.apache.org> on 2016/10/06 20:35:35 UTC
Build failed in Jenkins: kafka-0.10.1-jdk7 #50
See <https://builds.apache.org/job/kafka-0.10.1-jdk7/50/changes>
Changes:
[jason] KAFKA-4252; Fix purgatory metric name in documentation
------------------------------------------
[...truncated 3797 lines...]
kafka.admin.ReassignPartitionsCommandArgsTest > shouldCorrectlyParseValidMinimumVerifyOptions STARTED
kafka.admin.ReassignPartitionsCommandArgsTest > shouldCorrectlyParseValidMinimumVerifyOptions PASSED
kafka.admin.ReassignPartitionsCommandArgsTest > shouldNotAllowGenerateWithoutTopicsOption STARTED
kafka.admin.ReassignPartitionsCommandArgsTest > shouldNotAllowGenerateWithoutTopicsOption PASSED
kafka.admin.DeleteTopicTest > testDeleteTopicWithCleaner STARTED
kafka.admin.DeleteTopicTest > testDeleteTopicWithCleaner PASSED
kafka.admin.DeleteTopicTest > testResumeDeleteTopicOnControllerFailover STARTED
kafka.admin.DeleteTopicTest > testResumeDeleteTopicOnControllerFailover PASSED
kafka.admin.DeleteTopicTest > testResumeDeleteTopicWithRecoveredFollower STARTED
kafka.admin.DeleteTopicTest > testResumeDeleteTopicWithRecoveredFollower PASSED
kafka.admin.DeleteTopicTest > testDeleteTopicAlreadyMarkedAsDeleted STARTED
kafka.admin.DeleteTopicTest > testDeleteTopicAlreadyMarkedAsDeleted PASSED
kafka.admin.DeleteTopicTest > testPartitionReassignmentDuringDeleteTopic STARTED
kafka.admin.DeleteTopicTest > testPartitionReassignmentDuringDeleteTopic PASSED
kafka.admin.DeleteTopicTest > testDeleteNonExistingTopic STARTED
kafka.admin.DeleteTopicTest > testDeleteNonExistingTopic PASSED
kafka.admin.DeleteTopicTest > testRecreateTopicAfterDeletion STARTED
kafka.admin.DeleteTopicTest > testRecreateTopicAfterDeletion PASSED
kafka.admin.DeleteTopicTest > testAddPartitionDuringDeleteTopic STARTED
kafka.admin.DeleteTopicTest > testAddPartitionDuringDeleteTopic PASSED
kafka.admin.DeleteTopicTest > testDeleteTopicWithAllAliveReplicas STARTED
kafka.admin.DeleteTopicTest > testDeleteTopicWithAllAliveReplicas PASSED
kafka.admin.DeleteTopicTest > testDeleteTopicDuringAddPartition STARTED
kafka.admin.DeleteTopicTest > testDeleteTopicDuringAddPartition PASSED
kafka.admin.AdminRackAwareTest > testAssignmentWithRackAwareWithUnevenRacks STARTED
kafka.admin.AdminRackAwareTest > testAssignmentWithRackAwareWithUnevenRacks PASSED
kafka.admin.AdminRackAwareTest > testAssignmentWith2ReplicasRackAware STARTED
kafka.admin.AdminRackAwareTest > testAssignmentWith2ReplicasRackAware PASSED
kafka.admin.AdminRackAwareTest > testAssignmentWithRackAwareWithUnevenReplicas STARTED
kafka.admin.AdminRackAwareTest > testAssignmentWithRackAwareWithUnevenReplicas PASSED
kafka.admin.AdminRackAwareTest > testSkipBrokerWithReplicaAlreadyAssigned STARTED
kafka.admin.AdminRackAwareTest > testSkipBrokerWithReplicaAlreadyAssigned PASSED
kafka.admin.AdminRackAwareTest > testAssignmentWithRackAware STARTED
kafka.admin.AdminRackAwareTest > testAssignmentWithRackAware PASSED
kafka.admin.AdminRackAwareTest > testRackAwareExpansion STARTED
kafka.admin.AdminRackAwareTest > testRackAwareExpansion PASSED
kafka.admin.AdminRackAwareTest > testAssignmentWith2ReplicasRackAwareWith6Partitions STARTED
kafka.admin.AdminRackAwareTest > testAssignmentWith2ReplicasRackAwareWith6Partitions PASSED
kafka.admin.AdminRackAwareTest > testAssignmentWith2ReplicasRackAwareWith6PartitionsAnd3Brokers STARTED
kafka.admin.AdminRackAwareTest > testAssignmentWith2ReplicasRackAwareWith6PartitionsAnd3Brokers PASSED
kafka.admin.AdminRackAwareTest > testGetRackAlternatedBrokerListAndAssignReplicasToBrokers STARTED
kafka.admin.AdminRackAwareTest > testGetRackAlternatedBrokerListAndAssignReplicasToBrokers PASSED
kafka.admin.AdminRackAwareTest > testMoreReplicasThanRacks STARTED
kafka.admin.AdminRackAwareTest > testMoreReplicasThanRacks PASSED
kafka.admin.AdminRackAwareTest > testSingleRack STARTED
kafka.admin.AdminRackAwareTest > testSingleRack PASSED
kafka.admin.AdminRackAwareTest > testAssignmentWithRackAwareWithRandomStartIndex STARTED
kafka.admin.AdminRackAwareTest > testAssignmentWithRackAwareWithRandomStartIndex PASSED
kafka.admin.AdminRackAwareTest > testLargeNumberPartitionsAssignment STARTED
kafka.admin.AdminRackAwareTest > testLargeNumberPartitionsAssignment PASSED
kafka.admin.AdminRackAwareTest > testLessReplicasThanRacks STARTED
kafka.admin.AdminRackAwareTest > testLessReplicasThanRacks PASSED
kafka.admin.DeleteConsumerGroupTest > testGroupWideDeleteInZKDoesNothingForActiveConsumerGroup STARTED
kafka.admin.DeleteConsumerGroupTest > testGroupWideDeleteInZKDoesNothingForActiveConsumerGroup PASSED
kafka.admin.DeleteConsumerGroupTest > testGroupTopicWideDeleteInZKDoesNothingForActiveGroupConsumingMultipleTopics STARTED
kafka.admin.DeleteConsumerGroupTest > testGroupTopicWideDeleteInZKDoesNothingForActiveGroupConsumingMultipleTopics PASSED
kafka.admin.DeleteConsumerGroupTest > testConsumptionOnRecreatedTopicAfterTopicWideDeleteInZK STARTED
kafka.admin.DeleteConsumerGroupTest > testConsumptionOnRecreatedTopicAfterTopicWideDeleteInZK PASSED
kafka.admin.DeleteConsumerGroupTest > testTopicWideDeleteInZK STARTED
kafka.admin.DeleteConsumerGroupTest > testTopicWideDeleteInZK PASSED
kafka.admin.DeleteConsumerGroupTest > testGroupTopicWideDeleteInZKForGroupConsumingOneTopic STARTED
kafka.admin.DeleteConsumerGroupTest > testGroupTopicWideDeleteInZKForGroupConsumingOneTopic PASSED
kafka.admin.DeleteConsumerGroupTest > testGroupTopicWideDeleteInZKForGroupConsumingMultipleTopics STARTED
kafka.admin.DeleteConsumerGroupTest > testGroupTopicWideDeleteInZKForGroupConsumingMultipleTopics PASSED
kafka.admin.DeleteConsumerGroupTest > testGroupWideDeleteInZK STARTED
kafka.admin.DeleteConsumerGroupTest > testGroupWideDeleteInZK PASSED
kafka.admin.AddPartitionsTest > testReplicaPlacementAllServers STARTED
kafka.admin.AddPartitionsTest > testReplicaPlacementAllServers PASSED
kafka.admin.AddPartitionsTest > testWrongReplicaCount STARTED
kafka.admin.AddPartitionsTest > testWrongReplicaCount PASSED
kafka.admin.AddPartitionsTest > testReplicaPlacementPartialServers STARTED
kafka.admin.AddPartitionsTest > testReplicaPlacementPartialServers PASSED
kafka.admin.AddPartitionsTest > testTopicDoesNotExist STARTED
kafka.admin.AddPartitionsTest > testTopicDoesNotExist PASSED
kafka.admin.AddPartitionsTest > testIncrementPartitions STARTED
kafka.admin.AddPartitionsTest > testIncrementPartitions PASSED
kafka.admin.AddPartitionsTest > testManualAssignmentOfReplicas STARTED
kafka.admin.AddPartitionsTest > testManualAssignmentOfReplicas PASSED
kafka.admin.ConfigCommandTest > shouldParseArgumentsForTopicsEntityType STARTED
kafka.admin.ConfigCommandTest > shouldParseArgumentsForTopicsEntityType PASSED
kafka.admin.ConfigCommandTest > testUserClientQuotaOpts STARTED
kafka.admin.ConfigCommandTest > testUserClientQuotaOpts PASSED
kafka.admin.ConfigCommandTest > shouldAddTopicConfig STARTED
kafka.admin.ConfigCommandTest > shouldAddTopicConfig PASSED
kafka.admin.ConfigCommandTest > shouldAddClientConfig STARTED
kafka.admin.ConfigCommandTest > shouldAddClientConfig PASSED
kafka.admin.ConfigCommandTest > shouldDeleteBrokerConfig STARTED
kafka.admin.ConfigCommandTest > shouldDeleteBrokerConfig PASSED
kafka.admin.ConfigCommandTest > testQuotaConfigEntity STARTED
kafka.admin.ConfigCommandTest > testQuotaConfigEntity PASSED
kafka.admin.ConfigCommandTest > shouldNotUpdateBrokerConfigIfMalformedBracketConfig STARTED
kafka.admin.ConfigCommandTest > shouldNotUpdateBrokerConfigIfMalformedBracketConfig PASSED
kafka.admin.ConfigCommandTest > shouldFailIfUnrecognisedEntityType STARTED
kafka.admin.ConfigCommandTest > shouldFailIfUnrecognisedEntityType PASSED
kafka.admin.ConfigCommandTest > shouldNotUpdateBrokerConfigIfMalformedEntityName STARTED
kafka.admin.ConfigCommandTest > shouldNotUpdateBrokerConfigIfMalformedEntityName PASSED
kafka.admin.ConfigCommandTest > shouldSupportCommaSeparatedValues STARTED
kafka.admin.ConfigCommandTest > shouldSupportCommaSeparatedValues PASSED
kafka.admin.ConfigCommandTest > shouldNotUpdateBrokerConfigIfMalformedConfig STARTED
kafka.admin.ConfigCommandTest > shouldNotUpdateBrokerConfigIfMalformedConfig PASSED
kafka.admin.ConfigCommandTest > shouldParseArgumentsForBrokersEntityType STARTED
kafka.admin.ConfigCommandTest > shouldParseArgumentsForBrokersEntityType PASSED
kafka.admin.ConfigCommandTest > shouldAddBrokerConfig STARTED
kafka.admin.ConfigCommandTest > shouldAddBrokerConfig PASSED
kafka.admin.ConfigCommandTest > testQuotaDescribeEntities STARTED
kafka.admin.ConfigCommandTest > testQuotaDescribeEntities PASSED
kafka.admin.ConfigCommandTest > shouldParseArgumentsForClientsEntityType STARTED
kafka.admin.ConfigCommandTest > shouldParseArgumentsForClientsEntityType PASSED
kafka.admin.AclCommandTest > testInvalidAuthorizerProperty STARTED
kafka.admin.AclCommandTest > testInvalidAuthorizerProperty PASSED
kafka.admin.AclCommandTest > testAclCli STARTED
kafka.admin.AclCommandTest > testAclCli PASSED
kafka.admin.AclCommandTest > testProducerConsumerCli STARTED
kafka.admin.AclCommandTest > testProducerConsumerCli PASSED
964 tests completed, 2 failed
:kafka-0.10.1-jdk7:core:test FAILED
:test_core_2_10 FAILED
FAILURE: Build failed with an exception.
* What went wrong:
Execution failed for task ':core:test'.
> There were failing tests. See the report at: file://<https://builds.apache.org/job/kafka-0.10.1-jdk7/ws/core/build/reports/tests/test/index.html>
* Try:
Run with --stacktrace option to get the stack trace. Run with --info or --debug option to get more log output.
BUILD FAILED
Total time: 40 mins 27.329 secs
Build step 'Execute shell' marked build as failure
Recording test results
Setting GRADLE_2_4_RC_2_HOME=/home/jenkins/jenkins-slave/tools/hudson.plugins.gradle.GradleInstallation/Gradle_2.4-rc-2
Setting GRADLE_2_4_RC_2_HOME=/home/jenkins/jenkins-slave/tools/hudson.plugins.gradle.GradleInstallation/Gradle_2.4-rc-2
Jenkins build is back to normal : kafka-0.10.1-jdk7 #51
Posted by Apache Jenkins Server <je...@builds.apache.org>.
See <https://builds.apache.org/job/kafka-0.10.1-jdk7/51/changes>