You are viewing a plain text version of this content. The canonical link for it is here.
Posted to builds@beam.apache.org by Apache Jenkins Server <je...@builds.apache.org> on 2020/02/12 12:11:33 UTC
Build failed in Jenkins:
beam_PreCommit_Java_Examples_Dataflow_Java11_Cron #2
See <https://builds.apache.org/job/beam_PreCommit_Java_Examples_Dataflow_Java11_Cron/2/display/redirect?page=changes>
Changes:
[dpcollins] Move external PubsubIO hooks outside of PubsubIO.
[heejong] [BEAM-9230] Enable CrossLanguageValidateRunner test for Spark runner
[ehudm] [BEAM-8095] Remove no_xdist for test
[robinyqiu] Support all ZetaSQL TIMESTAMP functions
[daniel.o.programmer] [BEAM-3301] Small cleanup to FullValue code.
[amyrvold] [BEAM-9261] Add LICENSE and NOTICE to Docker images
[github] [BEAM-8951] Stop using nose in load tests (#10435)
[robertwb] [BEAM-7746] Cleanup historical DnFnRunner-as-Receiver cruft.
[robertwb] [BEAM-8976] Initalize logging configuration at a couple of other entry
[chadrik] [BEAM-7746] Add typing for try_split
[zyichi] Fix race exception in python worker status thread dump
[iemejia] [BEAM-9264] Upgrade Spark to version 2.4.5
[hsuryawirawan] Update Beam Katas Java to use Beam version 2.19.0
[hsuryawirawan] Update Beam Katas Python to use Beam version 2.19.0
[hsuryawirawan] Update Beam Katas Python on Stepik
[hsuryawirawan] Update Built-in IOs task type to theory
[hsuryawirawan] Update Beam Katas Java on Stepik
[kamil.wasilewski] Fix method name in Combine and coGBK tests
[github] [BEAM-3453] Use project specified in pipeline_options when creating
[robertwb] [BEAM-9266] Remove unused fields from provisioning API.
[github] [BEAM-9262] Clean-up endpoints.proto to a stable state (#10789)
[lcwik] [BEAM-3595] Migrate to "v1" URNs for standard window fns.
[daniel.o.programmer] [BEAM-3301] (Go SDK) Adding restriction plumbing to graph construction.
[robertwb] Remove one more reference to provision resources.
[github] Merge pull request #10766: [BEAM-4461] Add Selected.flattenedSchema
[robertwb] Reject unsupported WindowFns and Window types.
[github] Merge pull request #10804: [BEAM-2535] Fix timer map
[github] Merge pull request #10627:[BEAM-2535] Support outputTimestamp and
[iemejia] [BEAM-7092] Fix invalid import of Guava coming from transitive Spark dep
[alex] [BEAM-9241] Fix inconsistent proto nullability
[kamil.wasilewski] Move imports and variables out of global namespace
[iemejia] [website] Update Java 11 and Spark roadmap
[apilloud] [BEAM-8630] Validate prepared expression on expand
[github] [BEAM-9268] SpannerIO: Add more documentation and warnings for unknown
[iemejia] [BEAM-9231] Add Experimental(Kind.PORTABILITY) and tag related classes
[iemejia] [BEAM-9231] Tag SplittableDoFn related classes/methods as Experimental
[iemejia] [BEAM-9231] Make Experimental annotations homogeneous in
[iemejia] [BEAM-9231] Untag Experimental/Internal classes not needed to write
[iemejia] [BEAM-9231] Tag beam-sdks-java-core internal classes as Internal
[iemejia] [BEAM-9231] Tag DoFn.OnTimerContext as Experimental(Kind.TIMERS)
[iemejia] [BEAM-9231] Tag Experimental/Internal packages in beam-sdks-java-core
[iemejia] [BEAM-9231] Tag Experimental/Internal packages in IOs and extensions
[iemejia] [BEAM-9231] Tag public but internal IOs and extensions classes as
[iemejia] [BEAM-9160] Update AWS SDK to support Pod Level Identity
[boyuanz] Move ThreadsafeRestrictionTracker and RestrictionTrackerView out from
[github] Remove tables and refer to dependency locations in code (#10745)
[ehudm] fix lint
[valentyn] Cleanup MappingProxy reducer since dill supports it natively now.
[iemejia] Enable probot autolabeler action to label github pull requests
[iemejia] Remove prefixes in autolabeler configuration to improve readability
[iemejia] [BEAM-9160] Removed WebIdentityTokenCredentialsProvider explicit json
------------------------------------------
Started by timer
Running as SYSTEM
[EnvInject] - Loading node environment variables.
Building remotely on apache-beam-jenkins-9 (beam) in workspace <https://builds.apache.org/job/beam_PreCommit_Java_Examples_Dataflow_Java11_Cron/ws/>
No credentials specified
Wiping out workspace first.
Cloning the remote Git repository
Cloning repository https://github.com/apache/beam.git
> git init <https://builds.apache.org/job/beam_PreCommit_Java_Examples_Dataflow_Java11_Cron/ws/src> # timeout=10
Fetching upstream changes from https://github.com/apache/beam.git
> git --version # timeout=10
> git fetch --tags --progress https://github.com/apache/beam.git +refs/heads/*:refs/remotes/origin/*
> git config remote.origin.url https://github.com/apache/beam.git # timeout=10
> git config --add remote.origin.fetch +refs/heads/*:refs/remotes/origin/* # timeout=10
> git config remote.origin.url https://github.com/apache/beam.git # timeout=10
Fetching upstream changes from https://github.com/apache/beam.git
> git fetch --tags --progress https://github.com/apache/beam.git +refs/heads/*:refs/remotes/origin/* +refs/pull/${ghprbPullId}/*:refs/remotes/origin/pr/${ghprbPullId}/*
> git rev-parse origin/master^{commit} # timeout=10
Checking out Revision ffeea60f3cb766722a101ded1ea97c0be79bf13a (origin/master)
> git config core.sparsecheckout # timeout=10
> git checkout -f ffeea60f3cb766722a101ded1ea97c0be79bf13a
Commit message: "Merge pull request #10800 from kamilwu/load-tests-fix"
> git rev-list --no-walk 2473792306879e3fa6c5ab1f95523c7b44b4e288 # timeout=10
No emails were triggered.
[EnvInject] - Executing scripts and injecting environment variables after the SCM step.
[EnvInject] - Injecting as environment variables the properties content
SPARK_LOCAL_IP=127.0.0.1
[EnvInject] - Variables injected successfully.
[Gradle] - Launching build.
[src] $ <https://builds.apache.org/job/beam_PreCommit_Java_Examples_Dataflow_Java11_Cron/ws/src/gradlew> -PdisableSpotlessCheck=true --continue --max-workers=12 -Dorg.gradle.jvmargs=-Xms2g -Dorg.gradle.jvmargs=-Xmx4g :clean
Starting a Gradle Daemon, 1 busy and 1 stopped Daemons could not be reused, use --status for details
> Task :buildSrc:compileJava NO-SOURCE
> Task :buildSrc:compileGroovy FROM-CACHE
> Task :buildSrc:pluginDescriptors
> Task :buildSrc:processResources
> Task :buildSrc:classes
> Task :buildSrc:jar
> Task :buildSrc:assemble
> Task :buildSrc:pluginUnderTestMetadata
> Task :buildSrc:compileTestJava NO-SOURCE
> Task :buildSrc:compileTestGroovy NO-SOURCE
> Task :buildSrc:processTestResources NO-SOURCE
> Task :buildSrc:testClasses UP-TO-DATE
> Task :buildSrc:test NO-SOURCE
> Task :buildSrc:validateTaskProperties FROM-CACHE
> Task :buildSrc:check UP-TO-DATE
> Task :buildSrc:build
Configuration on demand is an incubating feature.
> Task :clean UP-TO-DATE
Deprecated Gradle features were used in this build, making it incompatible with Gradle 6.0.
Use '--warning-mode all' to show the individual deprecation warnings.
See https://docs.gradle.org/5.2.1/userguide/command_line_interface.html#sec:command_line_warnings
BUILD SUCCESSFUL in 6s
1 actionable task: 1 up-to-date
Publishing build scan...
https://gradle.com/s/jgzhdggmoxf7a
Build step 'Invoke Gradle script' changed build result to SUCCESS
[Gradle] - Launching build.
[src] $ <https://builds.apache.org/job/beam_PreCommit_Java_Examples_Dataflow_Java11_Cron/ws/src/gradlew> -Dorg.gradle.java.home=/usr/lib/jvm/java-8-openjdk-amd64 -PdisableSpotlessCheck=true -x runLegacyWorkerPreCommitTest -x runApplianceTest -x runWindmillTest --continue --max-workers=12 -Dorg.gradle.jvmargs=-Xms2g -Dorg.gradle.jvmargs=-Xmx4g javaExamplesDataflowPrecommit
> Task :buildSrc:compileJava NO-SOURCE
> Task :buildSrc:compileGroovy UP-TO-DATE
> Task :buildSrc:pluginDescriptors UP-TO-DATE
> Task :buildSrc:processResources UP-TO-DATE
> Task :buildSrc:classes UP-TO-DATE
> Task :buildSrc:jar UP-TO-DATE
> Task :buildSrc:assemble UP-TO-DATE
> Task :buildSrc:pluginUnderTestMetadata UP-TO-DATE
> Task :buildSrc:compileTestJava NO-SOURCE
> Task :buildSrc:compileTestGroovy NO-SOURCE
> Task :buildSrc:processTestResources NO-SOURCE
> Task :buildSrc:testClasses UP-TO-DATE
> Task :buildSrc:test NO-SOURCE
> Task :buildSrc:validateTaskProperties UP-TO-DATE
> Task :buildSrc:check UP-TO-DATE
> Task :buildSrc:build UP-TO-DATE
Configuration on demand is an incubating feature.
> Configure project :sdks:java:container
Found go 1.12 in /usr/bin/go, use it.
> Configure project :sdks:go
Found go 1.12 in /usr/bin/go, use it.
> Configure project :sdks:go:container
Found go 1.12 in /usr/bin/go, use it.
> Configure project :sdks:go:examples
Found go 1.12 in /usr/bin/go, use it.
> Configure project :sdks:go:test
Found go 1.12 in /usr/bin/go, use it.
> Configure project :sdks:python:container
Found go 1.12 in /usr/bin/go, use it.
FAILURE: Build failed with an exception.
* What went wrong:
Task 'runLegacyWorkerPreCommitTest' not found in root project 'beam'.
* Try:
Run gradlew tasks to get a list of available tasks. Run with --stacktrace option to get the stack trace. Run with --info or --debug option to get more log output. Run with --scan to get full insights.
* Get more help at https://help.gradle.org
Deprecated Gradle features were used in this build, making it incompatible with Gradle 6.0.
Use '--warning-mode all' to show the individual deprecation warnings.
See https://docs.gradle.org/5.2.1/userguide/command_line_interface.html#sec:command_line_warnings
BUILD FAILED in 14s
Publishing build scan...
https://gradle.com/s/j7wchiwx6swac
Build step 'Invoke Gradle script' changed build result to FAILURE
Build step 'Invoke Gradle script' marked build as failure
---------------------------------------------------------------------
To unsubscribe, e-mail: builds-unsubscribe@beam.apache.org
For additional commands, e-mail: builds-help@beam.apache.org