You are viewing a plain text version of this content. The canonical link for it is here.
Posted to dev@zookeeper.apache.org by Apache Jenkins Server <je...@builds.apache.org> on 2017/02/22 13:58:37 UTC

ZooKeeper_branch34_solaris - Build # 1482 - Still Failing

See https://builds.apache.org/job/ZooKeeper_branch34_solaris/1482/

###################################################################################
########################## LAST 60 LINES OF THE CONSOLE ###########################
[...truncated 26.02 MB...]
    [junit] 2017-02-22 13:59:53,994 [myid:] - INFO  [ProcessThread(sid:0 cport:11221)::PrepRequestProcessor@143] - PrepRequestProcessor exited loop!
    [junit] 2017-02-22 13:59:53,994 [myid:] - INFO  [SyncThread:0:SyncRequestProcessor@186] - SyncRequestProcessor exited!
    [junit] 2017-02-22 13:59:53,994 [myid:] - INFO  [main:FinalRequestProcessor@402] - shutdown of request processor complete
    [junit] 2017-02-22 13:59:53,994 [myid:] - INFO  [main:FourLetterWordMain@62] - connecting to 127.0.0.1 11221
    [junit] 2017-02-22 13:59:53,995 [myid:] - INFO  [main:JMXEnv@147] - ensureOnly:[]
    [junit] 2017-02-22 13:59:53,995 [myid:] - INFO  [main:ClientBase@445] - STARTING server
    [junit] 2017-02-22 13:59:53,996 [myid:] - INFO  [main:ClientBase@366] - CREATING server instance 127.0.0.1:11221
    [junit] 2017-02-22 13:59:53,996 [myid:] - INFO  [main:NIOServerCnxnFactory@89] - binding to port 0.0.0.0/0.0.0.0:11221
    [junit] 2017-02-22 13:59:53,996 [myid:] - INFO  [main:ClientBase@341] - STARTING server instance 127.0.0.1:11221
    [junit] 2017-02-22 13:59:53,997 [myid:] - INFO  [main:ZooKeeperServer@173] - Created server with tickTime 3000 minSessionTimeout 6000 maxSessionTimeout 60000 datadir /zonestorage/hudson_solaris/home/hudson/hudson-slave/workspace/ZooKeeper_branch34_solaris/build/test/tmp/test4598309053564768091.junit.dir/version-2 snapdir /zonestorage/hudson_solaris/home/hudson/hudson-slave/workspace/ZooKeeper_branch34_solaris/build/test/tmp/test4598309053564768091.junit.dir/version-2
    [junit] 2017-02-22 13:59:53,999 [myid:] - ERROR [main:ZooKeeperServer@472] - ZKShutdownHandler is not registered, so ZooKeeper server won't take any action on ERROR or SHUTDOWN server state changes
    [junit] 2017-02-22 13:59:53,999 [myid:] - INFO  [main:FourLetterWordMain@62] - connecting to 127.0.0.1 11221
    [junit] 2017-02-22 13:59:54,000 [myid:] - INFO  [NIOServerCxn.Factory:0.0.0.0/0.0.0.0:11221:NIOServerCnxnFactory@192] - Accepted socket connection from /127.0.0.1:39560
    [junit] 2017-02-22 13:59:54,000 [myid:] - INFO  [NIOServerCxn.Factory:0.0.0.0/0.0.0.0:11221:NIOServerCnxn@838] - Processing stat command from /127.0.0.1:39560
    [junit] 2017-02-22 13:59:54,000 [myid:] - INFO  [Thread-5:NIOServerCnxn$StatCommand@674] - Stat command output
    [junit] 2017-02-22 13:59:54,000 [myid:] - INFO  [Thread-5:NIOServerCnxn@1019] - Closed socket connection for client /127.0.0.1:39560 (no session established for client)
    [junit] 2017-02-22 13:59:54,001 [myid:] - INFO  [main:JMXEnv@230] - ensureParent:[InMemoryDataTree, StandaloneServer_port]
    [junit] 2017-02-22 13:59:54,001 [myid:] - INFO  [SessionTracker:SessionTrackerImpl@162] - SessionTrackerImpl exited loop!
    [junit] 2017-02-22 13:59:54,001 [myid:] - INFO  [SessionTracker:SessionTrackerImpl@162] - SessionTrackerImpl exited loop!
    [junit] 2017-02-22 13:59:54,002 [myid:] - INFO  [main:JMXEnv@247] - expect:InMemoryDataTree
    [junit] 2017-02-22 13:59:54,002 [myid:] - INFO  [main:JMXEnv@251] - found:InMemoryDataTree org.apache.ZooKeeperService:name0=StandaloneServer_port11221,name1=InMemoryDataTree
    [junit] 2017-02-22 13:59:54,002 [myid:] - INFO  [main:JMXEnv@247] - expect:StandaloneServer_port
    [junit] 2017-02-22 13:59:54,002 [myid:] - INFO  [main:JMXEnv@251] - found:StandaloneServer_port org.apache.ZooKeeperService:name0=StandaloneServer_port11221
    [junit] 2017-02-22 13:59:54,003 [myid:] - INFO  [main:JUnit4ZKTestRunner$LoggedInvokeMethod@58] - Memory used 11642
    [junit] 2017-02-22 13:59:54,003 [myid:] - INFO  [main:JUnit4ZKTestRunner$LoggedInvokeMethod@63] - Number of threads 18
    [junit] 2017-02-22 13:59:54,003 [myid:] - INFO  [main:JUnit4ZKTestRunner$LoggedInvokeMethod@78] - FINISHED TEST METHOD testQuota
    [junit] 2017-02-22 13:59:54,003 [myid:] - INFO  [main:ClientBase@522] - tearDown starting
    [junit] 2017-02-22 13:59:54,082 [myid:] - INFO  [main:ZooKeeper@684] - Session: 0x15a661f06d00000 closed
    [junit] 2017-02-22 13:59:54,082 [myid:] - INFO  [main-EventThread:ClientCnxn$EventThread@519] - EventThread shut down for session: 0x15a661f06d00000
    [junit] 2017-02-22 13:59:54,082 [myid:] - INFO  [main:ClientBase@492] - STOPPING server
    [junit] 2017-02-22 13:59:54,084 [myid:] - INFO  [main:ZooKeeperServer@505] - shutting down
    [junit] 2017-02-22 13:59:54,084 [myid:] - ERROR [main:ZooKeeperServer@472] - ZKShutdownHandler is not registered, so ZooKeeper server won't take any action on ERROR or SHUTDOWN server state changes
    [junit] 2017-02-22 13:59:54,084 [myid:] - INFO  [main:SessionTrackerImpl@225] - Shutting down
    [junit] 2017-02-22 13:59:54,084 [myid:] - INFO  [main:PrepRequestProcessor@764] - Shutting down
    [junit] 2017-02-22 13:59:54,085 [myid:] - INFO  [main:SyncRequestProcessor@208] - Shutting down
    [junit] 2017-02-22 13:59:54,085 [myid:] - INFO  [ProcessThread(sid:0 cport:11221)::PrepRequestProcessor@143] - PrepRequestProcessor exited loop!
    [junit] 2017-02-22 13:59:54,085 [myid:] - INFO  [SyncThread:0:SyncRequestProcessor@186] - SyncRequestProcessor exited!
    [junit] 2017-02-22 13:59:54,085 [myid:] - INFO  [main:FinalRequestProcessor@402] - shutdown of request processor complete
    [junit] 2017-02-22 13:59:54,086 [myid:] - INFO  [main:FourLetterWordMain@62] - connecting to 127.0.0.1 11221
    [junit] 2017-02-22 13:59:54,087 [myid:] - INFO  [main:JMXEnv@147] - ensureOnly:[]
    [junit] 2017-02-22 13:59:54,093 [myid:] - INFO  [main:ClientBase@547] - fdcount after test is: 95 at start it was 81
    [junit] 2017-02-22 13:59:54,093 [myid:] - INFO  [main:ClientBase@549] - sleeping for 20 secs
    [junit] 2017-02-22 13:59:54,094 [myid:] - INFO  [main:ZKTestCase$1@65] - SUCCEEDED testQuota
    [junit] 2017-02-22 13:59:54,094 [myid:] - INFO  [main:ZKTestCase$1@60] - FINISHED testQuota
    [junit] Tests run: 1, Failures: 0, Errors: 0, Time elapsed: 1.118 sec

fail.build.on.test.failure:

BUILD FAILED
/zonestorage/hudson_solaris/home/hudson/hudson-slave/workspace/ZooKeeper_branch34_solaris/build.xml:1328: The following error occurred while executing this line:
/zonestorage/hudson_solaris/home/hudson/hudson-slave/workspace/ZooKeeper_branch34_solaris/build.xml:1331: Tests failed!

Total time: 33 minutes 33 seconds
Build step 'Invoke Ant' marked build as failure
[locks-and-latches] Releasing all the locks
[locks-and-latches] All the locks released
Recording test results
Email was triggered for: Failure - Any
Sending email for trigger: Failure - Any



###################################################################################
############################## FAILED TESTS (if any) ##############################
1 tests failed.
FAILED:  org.apache.zookeeper.test.ReadOnlyModeTest.testSessionEstablishment

Error Message:
KeeperErrorCode = ConnectionLoss for /test

Stack Trace:
org.apache.zookeeper.KeeperException$ConnectionLossException: KeeperErrorCode = ConnectionLoss for /test
	at org.apache.zookeeper.KeeperException.create(KeeperException.java:99)
	at org.apache.zookeeper.KeeperException.create(KeeperException.java:51)
	at org.apache.zookeeper.ZooKeeper.create(ZooKeeper.java:783)
	at org.apache.zookeeper.test.ReadOnlyModeTest.testSessionEstablishment(ReadOnlyModeTest.java:216)
	at org.apache.zookeeper.JUnit4ZKTestRunner$LoggedInvokeMethod.evaluate(JUnit4ZKTestRunner.java:55)



ZooKeeper_branch34_solaris - Build # 1488 - Still Failing

Posted by Apache Jenkins Server <je...@builds.apache.org>.
See https://builds.apache.org/job/ZooKeeper_branch34_solaris/1488/

###################################################################################
########################## LAST 60 LINES OF THE CONSOLE ###########################
[...truncated 25.25 MB...]
    [junit] 2017-02-27 13:57:26,376 [myid:] - INFO  [main:PrepRequestProcessor@764] - Shutting down
    [junit] 2017-02-27 13:57:26,376 [myid:] - INFO  [main:SyncRequestProcessor@208] - Shutting down
    [junit] 2017-02-27 13:57:26,376 [myid:] - INFO  [ProcessThread(sid:0 cport:11221)::PrepRequestProcessor@143] - PrepRequestProcessor exited loop!
    [junit] 2017-02-27 13:57:26,376 [myid:] - INFO  [SyncThread:0:SyncRequestProcessor@186] - SyncRequestProcessor exited!
    [junit] 2017-02-27 13:57:26,376 [myid:] - INFO  [main:FinalRequestProcessor@402] - shutdown of request processor complete
    [junit] 2017-02-27 13:57:26,377 [myid:] - INFO  [main:FourLetterWordMain@62] - connecting to 127.0.0.1 11221
    [junit] 2017-02-27 13:57:26,377 [myid:] - INFO  [main:JMXEnv@147] - ensureOnly:[]
    [junit] 2017-02-27 13:57:26,378 [myid:] - INFO  [main:ClientBase@445] - STARTING server
    [junit] 2017-02-27 13:57:26,378 [myid:] - INFO  [main:ClientBase@366] - CREATING server instance 127.0.0.1:11221
    [junit] 2017-02-27 13:57:26,378 [myid:] - INFO  [main:NIOServerCnxnFactory@89] - binding to port 0.0.0.0/0.0.0.0:11221
    [junit] 2017-02-27 13:57:26,379 [myid:] - INFO  [main:ClientBase@341] - STARTING server instance 127.0.0.1:11221
    [junit] 2017-02-27 13:57:26,379 [myid:] - INFO  [main:ZooKeeperServer@173] - Created server with tickTime 3000 minSessionTimeout 6000 maxSessionTimeout 60000 datadir /zonestorage/hudson_solaris/home/hudson/hudson-slave/workspace/ZooKeeper_branch34_solaris/build/test/tmp/test7937223335647959738.junit.dir/version-2 snapdir /zonestorage/hudson_solaris/home/hudson/hudson-slave/workspace/ZooKeeper_branch34_solaris/build/test/tmp/test7937223335647959738.junit.dir/version-2
    [junit] 2017-02-27 13:57:26,381 [myid:] - ERROR [main:ZooKeeperServer@472] - ZKShutdownHandler is not registered, so ZooKeeper server won't take any action on ERROR or SHUTDOWN server state changes
    [junit] 2017-02-27 13:57:26,381 [myid:] - INFO  [main:FourLetterWordMain@62] - connecting to 127.0.0.1 11221
    [junit] 2017-02-27 13:57:26,382 [myid:] - INFO  [NIOServerCxn.Factory:0.0.0.0/0.0.0.0:11221:NIOServerCnxnFactory@192] - Accepted socket connection from /127.0.0.1:63314
    [junit] 2017-02-27 13:57:26,382 [myid:] - INFO  [NIOServerCxn.Factory:0.0.0.0/0.0.0.0:11221:NIOServerCnxn@838] - Processing stat command from /127.0.0.1:63314
    [junit] 2017-02-27 13:57:26,382 [myid:] - INFO  [Thread-5:NIOServerCnxn$StatCommand@674] - Stat command output
    [junit] 2017-02-27 13:57:26,383 [myid:] - INFO  [Thread-5:NIOServerCnxn@1019] - Closed socket connection for client /127.0.0.1:63314 (no session established for client)
    [junit] 2017-02-27 13:57:26,383 [myid:] - INFO  [main:JMXEnv@230] - ensureParent:[InMemoryDataTree, StandaloneServer_port]
    [junit] 2017-02-27 13:57:26,384 [myid:] - INFO  [main:JMXEnv@247] - expect:InMemoryDataTree
    [junit] 2017-02-27 13:57:26,384 [myid:] - INFO  [main:JMXEnv@251] - found:InMemoryDataTree org.apache.ZooKeeperService:name0=StandaloneServer_port11221,name1=InMemoryDataTree
    [junit] 2017-02-27 13:57:26,384 [myid:] - INFO  [main:JMXEnv@247] - expect:StandaloneServer_port
    [junit] 2017-02-27 13:57:26,384 [myid:] - INFO  [main:JMXEnv@251] - found:StandaloneServer_port org.apache.ZooKeeperService:name0=StandaloneServer_port11221
    [junit] 2017-02-27 13:57:26,385 [myid:] - INFO  [main:JUnit4ZKTestRunner$LoggedInvokeMethod@58] - Memory used 9193
    [junit] 2017-02-27 13:57:26,385 [myid:] - INFO  [main:JUnit4ZKTestRunner$LoggedInvokeMethod@63] - Number of threads 20
    [junit] 2017-02-27 13:57:26,385 [myid:] - INFO  [main:JUnit4ZKTestRunner$LoggedInvokeMethod@78] - FINISHED TEST METHOD testQuota
    [junit] 2017-02-27 13:57:26,385 [myid:] - INFO  [main:ClientBase@522] - tearDown starting
    [junit] 2017-02-27 13:57:26,462 [myid:] - INFO  [main:ZooKeeper@684] - Session: 0x15a7fdc917e0000 closed
    [junit] 2017-02-27 13:57:26,462 [myid:] - INFO  [main-EventThread:ClientCnxn$EventThread@519] - EventThread shut down for session: 0x15a7fdc917e0000
    [junit] 2017-02-27 13:57:26,462 [myid:] - INFO  [main:ClientBase@492] - STOPPING server
    [junit] 2017-02-27 13:57:26,463 [myid:] - INFO  [main:ZooKeeperServer@505] - shutting down
    [junit] 2017-02-27 13:57:26,463 [myid:] - ERROR [main:ZooKeeperServer@472] - ZKShutdownHandler is not registered, so ZooKeeper server won't take any action on ERROR or SHUTDOWN server state changes
    [junit] 2017-02-27 13:57:26,463 [myid:] - INFO  [main:SessionTrackerImpl@225] - Shutting down
    [junit] 2017-02-27 13:57:26,463 [myid:] - INFO  [main:PrepRequestProcessor@764] - Shutting down
    [junit] 2017-02-27 13:57:26,463 [myid:] - INFO  [main:SyncRequestProcessor@208] - Shutting down
    [junit] 2017-02-27 13:57:26,464 [myid:] - INFO  [ProcessThread(sid:0 cport:11221)::PrepRequestProcessor@143] - PrepRequestProcessor exited loop!
    [junit] 2017-02-27 13:57:26,464 [myid:] - INFO  [SyncThread:0:SyncRequestProcessor@186] - SyncRequestProcessor exited!
    [junit] 2017-02-27 13:57:26,464 [myid:] - INFO  [main:FinalRequestProcessor@402] - shutdown of request processor complete
    [junit] 2017-02-27 13:57:26,464 [myid:] - INFO  [main:FourLetterWordMain@62] - connecting to 127.0.0.1 11221
    [junit] 2017-02-27 13:57:26,465 [myid:] - INFO  [main:JMXEnv@147] - ensureOnly:[]
    [junit] 2017-02-27 13:57:26,467 [myid:] - INFO  [main:ClientBase@547] - fdcount after test is: 95 at start it was 81
    [junit] 2017-02-27 13:57:26,467 [myid:] - INFO  [main:ClientBase@549] - sleeping for 20 secs
    [junit] 2017-02-27 13:57:26,468 [myid:] - INFO  [main:ZKTestCase$1@65] - SUCCEEDED testQuota
    [junit] 2017-02-27 13:57:26,468 [myid:] - INFO  [main:ZKTestCase$1@60] - FINISHED testQuota
    [junit] Tests run: 1, Failures: 0, Errors: 0, Time elapsed: 0.829 sec

fail.build.on.test.failure:

BUILD FAILED
/zonestorage/hudson_solaris/home/hudson/hudson-slave/workspace/ZooKeeper_branch34_solaris/build.xml:1328: The following error occurred while executing this line:
/zonestorage/hudson_solaris/home/hudson/hudson-slave/workspace/ZooKeeper_branch34_solaris/build.xml:1331: Tests failed!

Total time: 31 minutes 3 seconds
Build step 'Invoke Ant' marked build as failure
[locks-and-latches] Releasing all the locks
[locks-and-latches] All the locks released
Recording test results
Email was triggered for: Failure - Any
Sending email for trigger: Failure - Any



###################################################################################
############################## FAILED TESTS (if any) ##############################
2 tests failed.
FAILED:  org.apache.zookeeper.server.quorum.auth.QuorumKerberosHostBasedAuthTest.testValidCredentials

Error Message:
waiting for server 0 being up

Stack Trace:
junit.framework.AssertionFailedError: waiting for server 0 being up
	at org.apache.zookeeper.server.quorum.auth.QuorumAuthTestBase.startQuorum(QuorumAuthTestBase.java:74)
	at org.apache.zookeeper.server.quorum.auth.QuorumKerberosHostBasedAuthTest.testValidCredentials(QuorumKerberosHostBasedAuthTest.java:125)
	at org.apache.zookeeper.JUnit4ZKTestRunner$LoggedInvokeMethod.evaluate(JUnit4ZKTestRunner.java:55)


FAILED:  org.apache.zookeeper.server.quorum.auth.QuorumKerberosAuthTest.testValidCredentials

Error Message:
waiting for server 1 being up

Stack Trace:
junit.framework.AssertionFailedError: waiting for server 1 being up
	at org.apache.zookeeper.server.quorum.auth.QuorumAuthTestBase.startQuorum(QuorumAuthTestBase.java:74)
	at org.apache.zookeeper.server.quorum.auth.QuorumKerberosAuthTest.testValidCredentials(QuorumKerberosAuthTest.java:101)
	at org.apache.zookeeper.JUnit4ZKTestRunner$LoggedInvokeMethod.evaluate(JUnit4ZKTestRunner.java:55)



ZooKeeper_branch34_solaris - Build # 1487 - Still Failing

Posted by Apache Jenkins Server <je...@builds.apache.org>.
See https://builds.apache.org/job/ZooKeeper_branch34_solaris/1487/

###################################################################################
########################## LAST 60 LINES OF THE CONSOLE ###########################
[...truncated 25.39 MB...]
    [junit] 2017-02-27 06:58:10,938 [myid:] - INFO  [main:PrepRequestProcessor@764] - Shutting down
    [junit] 2017-02-27 06:58:10,938 [myid:] - INFO  [main:SyncRequestProcessor@208] - Shutting down
    [junit] 2017-02-27 06:58:10,938 [myid:] - INFO  [ProcessThread(sid:0 cport:11221)::PrepRequestProcessor@143] - PrepRequestProcessor exited loop!
    [junit] 2017-02-27 06:58:10,939 [myid:] - INFO  [SyncThread:0:SyncRequestProcessor@186] - SyncRequestProcessor exited!
    [junit] 2017-02-27 06:58:10,939 [myid:] - INFO  [main:FinalRequestProcessor@402] - shutdown of request processor complete
    [junit] 2017-02-27 06:58:10,939 [myid:] - INFO  [main:FourLetterWordMain@62] - connecting to 127.0.0.1 11221
    [junit] 2017-02-27 06:58:10,939 [myid:] - INFO  [main:JMXEnv@147] - ensureOnly:[]
    [junit] 2017-02-27 06:58:10,940 [myid:] - INFO  [main:ClientBase@445] - STARTING server
    [junit] 2017-02-27 06:58:10,940 [myid:] - INFO  [main:ClientBase@366] - CREATING server instance 127.0.0.1:11221
    [junit] 2017-02-27 06:58:10,941 [myid:] - INFO  [main:NIOServerCnxnFactory@89] - binding to port 0.0.0.0/0.0.0.0:11221
    [junit] 2017-02-27 06:58:10,941 [myid:] - INFO  [main:ClientBase@341] - STARTING server instance 127.0.0.1:11221
    [junit] 2017-02-27 06:58:10,941 [myid:] - INFO  [main:ZooKeeperServer@173] - Created server with tickTime 3000 minSessionTimeout 6000 maxSessionTimeout 60000 datadir /zonestorage/hudson_solaris/home/hudson/hudson-slave/workspace/ZooKeeper_branch34_solaris/build/test/tmp/test1142776102585266325.junit.dir/version-2 snapdir /zonestorage/hudson_solaris/home/hudson/hudson-slave/workspace/ZooKeeper_branch34_solaris/build/test/tmp/test1142776102585266325.junit.dir/version-2
    [junit] 2017-02-27 06:58:10,944 [myid:] - ERROR [main:ZooKeeperServer@472] - ZKShutdownHandler is not registered, so ZooKeeper server won't take any action on ERROR or SHUTDOWN server state changes
    [junit] 2017-02-27 06:58:10,944 [myid:] - INFO  [main:FourLetterWordMain@62] - connecting to 127.0.0.1 11221
    [junit] 2017-02-27 06:58:10,945 [myid:] - INFO  [NIOServerCxn.Factory:0.0.0.0/0.0.0.0:11221:NIOServerCnxnFactory@192] - Accepted socket connection from /127.0.0.1:63042
    [junit] 2017-02-27 06:58:10,945 [myid:] - INFO  [NIOServerCxn.Factory:0.0.0.0/0.0.0.0:11221:NIOServerCnxn@838] - Processing stat command from /127.0.0.1:63042
    [junit] 2017-02-27 06:58:10,945 [myid:] - INFO  [Thread-5:NIOServerCnxn$StatCommand@674] - Stat command output
    [junit] 2017-02-27 06:58:10,946 [myid:] - INFO  [Thread-5:NIOServerCnxn@1019] - Closed socket connection for client /127.0.0.1:63042 (no session established for client)
    [junit] 2017-02-27 06:58:10,946 [myid:] - INFO  [main:JMXEnv@230] - ensureParent:[InMemoryDataTree, StandaloneServer_port]
    [junit] 2017-02-27 06:58:10,947 [myid:] - INFO  [main:JMXEnv@247] - expect:InMemoryDataTree
    [junit] 2017-02-27 06:58:10,947 [myid:] - INFO  [main:JMXEnv@251] - found:InMemoryDataTree org.apache.ZooKeeperService:name0=StandaloneServer_port11221,name1=InMemoryDataTree
    [junit] 2017-02-27 06:58:10,947 [myid:] - INFO  [main:JMXEnv@247] - expect:StandaloneServer_port
    [junit] 2017-02-27 06:58:10,948 [myid:] - INFO  [main:JMXEnv@251] - found:StandaloneServer_port org.apache.ZooKeeperService:name0=StandaloneServer_port11221
    [junit] 2017-02-27 06:58:10,948 [myid:] - INFO  [main:JUnit4ZKTestRunner$LoggedInvokeMethod@58] - Memory used 8862
    [junit] 2017-02-27 06:58:10,948 [myid:] - INFO  [main:JUnit4ZKTestRunner$LoggedInvokeMethod@63] - Number of threads 20
    [junit] 2017-02-27 06:58:10,948 [myid:] - INFO  [main:JUnit4ZKTestRunner$LoggedInvokeMethod@78] - FINISHED TEST METHOD testQuota
    [junit] 2017-02-27 06:58:10,948 [myid:] - INFO  [main:ClientBase@522] - tearDown starting
    [junit] 2017-02-27 06:58:11,032 [myid:] - INFO  [main:ZooKeeper@684] - Session: 0x15a7e5cbae60000 closed
    [junit] 2017-02-27 06:58:11,032 [myid:] - INFO  [main-EventThread:ClientCnxn$EventThread@519] - EventThread shut down for session: 0x15a7e5cbae60000
    [junit] 2017-02-27 06:58:11,032 [myid:] - INFO  [main:ClientBase@492] - STOPPING server
    [junit] 2017-02-27 06:58:11,033 [myid:] - INFO  [main:ZooKeeperServer@505] - shutting down
    [junit] 2017-02-27 06:58:11,033 [myid:] - ERROR [main:ZooKeeperServer@472] - ZKShutdownHandler is not registered, so ZooKeeper server won't take any action on ERROR or SHUTDOWN server state changes
    [junit] 2017-02-27 06:58:11,033 [myid:] - INFO  [main:SessionTrackerImpl@225] - Shutting down
    [junit] 2017-02-27 06:58:11,033 [myid:] - INFO  [main:PrepRequestProcessor@764] - Shutting down
    [junit] 2017-02-27 06:58:11,033 [myid:] - INFO  [main:SyncRequestProcessor@208] - Shutting down
    [junit] 2017-02-27 06:58:11,033 [myid:] - INFO  [ProcessThread(sid:0 cport:11221)::PrepRequestProcessor@143] - PrepRequestProcessor exited loop!
    [junit] 2017-02-27 06:58:11,034 [myid:] - INFO  [SyncThread:0:SyncRequestProcessor@186] - SyncRequestProcessor exited!
    [junit] 2017-02-27 06:58:11,034 [myid:] - INFO  [main:FinalRequestProcessor@402] - shutdown of request processor complete
    [junit] 2017-02-27 06:58:11,034 [myid:] - INFO  [main:FourLetterWordMain@62] - connecting to 127.0.0.1 11221
    [junit] 2017-02-27 06:58:11,035 [myid:] - INFO  [main:JMXEnv@147] - ensureOnly:[]
    [junit] 2017-02-27 06:58:11,038 [myid:] - INFO  [main:ClientBase@547] - fdcount after test is: 95 at start it was 81
    [junit] 2017-02-27 06:58:11,038 [myid:] - INFO  [main:ClientBase@549] - sleeping for 20 secs
    [junit] 2017-02-27 06:58:11,039 [myid:] - INFO  [main:ZKTestCase$1@65] - SUCCEEDED testQuota
    [junit] 2017-02-27 06:58:11,039 [myid:] - INFO  [main:ZKTestCase$1@60] - FINISHED testQuota
    [junit] Tests run: 1, Failures: 0, Errors: 0, Time elapsed: 1.151 sec

fail.build.on.test.failure:

BUILD FAILED
/zonestorage/hudson_solaris/home/hudson/hudson-slave/workspace/ZooKeeper_branch34_solaris/build.xml:1328: The following error occurred while executing this line:
/zonestorage/hudson_solaris/home/hudson/hudson-slave/workspace/ZooKeeper_branch34_solaris/build.xml:1331: Tests failed!

Total time: 31 minutes 50 seconds
Build step 'Invoke Ant' marked build as failure
[locks-and-latches] Releasing all the locks
[locks-and-latches] All the locks released
Recording test results
Email was triggered for: Failure - Any
Sending email for trigger: Failure - Any



###################################################################################
############################## FAILED TESTS (if any) ##############################
1 tests failed.
FAILED:  org.apache.zookeeper.server.quorum.auth.QuorumKerberosAuthTest.testValidCredentials

Error Message:
waiting for server 0 being up

Stack Trace:
junit.framework.AssertionFailedError: waiting for server 0 being up
	at org.apache.zookeeper.server.quorum.auth.QuorumAuthTestBase.startQuorum(QuorumAuthTestBase.java:74)
	at org.apache.zookeeper.server.quorum.auth.QuorumKerberosAuthTest.testValidCredentials(QuorumKerberosAuthTest.java:101)
	at org.apache.zookeeper.JUnit4ZKTestRunner$LoggedInvokeMethod.evaluate(JUnit4ZKTestRunner.java:55)



ZooKeeper_branch34_solaris - Build # 1486 - Still Failing

Posted by Apache Jenkins Server <je...@builds.apache.org>.
See https://builds.apache.org/job/ZooKeeper_branch34_solaris/1486/

###################################################################################
########################## LAST 60 LINES OF THE CONSOLE ###########################
[...truncated 25.32 MB...]
    [junit] 2017-02-26 13:58:39,347 [myid:] - INFO  [main:PrepRequestProcessor@764] - Shutting down
    [junit] 2017-02-26 13:58:39,347 [myid:] - INFO  [main:SyncRequestProcessor@208] - Shutting down
    [junit] 2017-02-26 13:58:39,347 [myid:] - INFO  [ProcessThread(sid:0 cport:11221)::PrepRequestProcessor@143] - PrepRequestProcessor exited loop!
    [junit] 2017-02-26 13:58:39,347 [myid:] - INFO  [SyncThread:0:SyncRequestProcessor@186] - SyncRequestProcessor exited!
    [junit] 2017-02-26 13:58:39,347 [myid:] - INFO  [main:FinalRequestProcessor@402] - shutdown of request processor complete
    [junit] 2017-02-26 13:58:39,348 [myid:] - INFO  [main:FourLetterWordMain@62] - connecting to 127.0.0.1 11221
    [junit] 2017-02-26 13:58:39,348 [myid:] - INFO  [main:JMXEnv@147] - ensureOnly:[]
    [junit] 2017-02-26 13:58:39,349 [myid:] - INFO  [main:ClientBase@445] - STARTING server
    [junit] 2017-02-26 13:58:39,349 [myid:] - INFO  [main:ClientBase@366] - CREATING server instance 127.0.0.1:11221
    [junit] 2017-02-26 13:58:39,349 [myid:] - INFO  [main:NIOServerCnxnFactory@89] - binding to port 0.0.0.0/0.0.0.0:11221
    [junit] 2017-02-26 13:58:39,349 [myid:] - INFO  [main:ClientBase@341] - STARTING server instance 127.0.0.1:11221
    [junit] 2017-02-26 13:58:39,350 [myid:] - INFO  [main:ZooKeeperServer@173] - Created server with tickTime 3000 minSessionTimeout 6000 maxSessionTimeout 60000 datadir /zonestorage/hudson_solaris/home/hudson/hudson-slave/workspace/ZooKeeper_branch34_solaris/build/test/tmp/test8170079688655117722.junit.dir/version-2 snapdir /zonestorage/hudson_solaris/home/hudson/hudson-slave/workspace/ZooKeeper_branch34_solaris/build/test/tmp/test8170079688655117722.junit.dir/version-2
    [junit] 2017-02-26 13:58:39,352 [myid:] - ERROR [main:ZooKeeperServer@472] - ZKShutdownHandler is not registered, so ZooKeeper server won't take any action on ERROR or SHUTDOWN server state changes
    [junit] 2017-02-26 13:58:39,352 [myid:] - INFO  [main:FourLetterWordMain@62] - connecting to 127.0.0.1 11221
    [junit] 2017-02-26 13:58:39,353 [myid:] - INFO  [NIOServerCxn.Factory:0.0.0.0/0.0.0.0:11221:NIOServerCnxnFactory@192] - Accepted socket connection from /127.0.0.1:35204
    [junit] 2017-02-26 13:58:39,353 [myid:] - INFO  [NIOServerCxn.Factory:0.0.0.0/0.0.0.0:11221:NIOServerCnxn@838] - Processing stat command from /127.0.0.1:35204
    [junit] 2017-02-26 13:58:39,353 [myid:] - INFO  [Thread-5:NIOServerCnxn$StatCommand@674] - Stat command output
    [junit] 2017-02-26 13:58:39,354 [myid:] - INFO  [Thread-5:NIOServerCnxn@1019] - Closed socket connection for client /127.0.0.1:35204 (no session established for client)
    [junit] 2017-02-26 13:58:39,354 [myid:] - INFO  [main:JMXEnv@230] - ensureParent:[InMemoryDataTree, StandaloneServer_port]
    [junit] 2017-02-26 13:58:39,355 [myid:] - INFO  [main:JMXEnv@247] - expect:InMemoryDataTree
    [junit] 2017-02-26 13:58:39,355 [myid:] - INFO  [main:JMXEnv@251] - found:InMemoryDataTree org.apache.ZooKeeperService:name0=StandaloneServer_port11221,name1=InMemoryDataTree
    [junit] 2017-02-26 13:58:39,355 [myid:] - INFO  [main:JMXEnv@247] - expect:StandaloneServer_port
    [junit] 2017-02-26 13:58:39,355 [myid:] - INFO  [main:JMXEnv@251] - found:StandaloneServer_port org.apache.ZooKeeperService:name0=StandaloneServer_port11221
    [junit] 2017-02-26 13:58:39,355 [myid:] - INFO  [main:JUnit4ZKTestRunner$LoggedInvokeMethod@58] - Memory used 9052
    [junit] 2017-02-26 13:58:39,356 [myid:] - INFO  [main:JUnit4ZKTestRunner$LoggedInvokeMethod@63] - Number of threads 20
    [junit] 2017-02-26 13:58:39,356 [myid:] - INFO  [main:JUnit4ZKTestRunner$LoggedInvokeMethod@78] - FINISHED TEST METHOD testQuota
    [junit] 2017-02-26 13:58:39,356 [myid:] - INFO  [main:ClientBase@522] - tearDown starting
    [junit] 2017-02-26 13:58:39,442 [myid:] - INFO  [main:ZooKeeper@684] - Session: 0x15a7ab753580000 closed
    [junit] 2017-02-26 13:58:39,442 [myid:] - INFO  [main-EventThread:ClientCnxn$EventThread@519] - EventThread shut down for session: 0x15a7ab753580000
    [junit] 2017-02-26 13:58:39,442 [myid:] - INFO  [main:ClientBase@492] - STOPPING server
    [junit] 2017-02-26 13:58:39,442 [myid:] - INFO  [main:ZooKeeperServer@505] - shutting down
    [junit] 2017-02-26 13:58:39,443 [myid:] - ERROR [main:ZooKeeperServer@472] - ZKShutdownHandler is not registered, so ZooKeeper server won't take any action on ERROR or SHUTDOWN server state changes
    [junit] 2017-02-26 13:58:39,443 [myid:] - INFO  [main:SessionTrackerImpl@225] - Shutting down
    [junit] 2017-02-26 13:58:39,443 [myid:] - INFO  [main:PrepRequestProcessor@764] - Shutting down
    [junit] 2017-02-26 13:58:39,443 [myid:] - INFO  [main:SyncRequestProcessor@208] - Shutting down
    [junit] 2017-02-26 13:58:39,443 [myid:] - INFO  [ProcessThread(sid:0 cport:11221)::PrepRequestProcessor@143] - PrepRequestProcessor exited loop!
    [junit] 2017-02-26 13:58:39,443 [myid:] - INFO  [SyncThread:0:SyncRequestProcessor@186] - SyncRequestProcessor exited!
    [junit] 2017-02-26 13:58:39,444 [myid:] - INFO  [main:FinalRequestProcessor@402] - shutdown of request processor complete
    [junit] 2017-02-26 13:58:39,444 [myid:] - INFO  [main:FourLetterWordMain@62] - connecting to 127.0.0.1 11221
    [junit] 2017-02-26 13:58:39,444 [myid:] - INFO  [main:JMXEnv@147] - ensureOnly:[]
    [junit] 2017-02-26 13:58:39,454 [myid:] - INFO  [main:ClientBase@547] - fdcount after test is: 95 at start it was 81
    [junit] 2017-02-26 13:58:39,454 [myid:] - INFO  [main:ClientBase@549] - sleeping for 20 secs
    [junit] 2017-02-26 13:58:39,454 [myid:] - INFO  [main:ZKTestCase$1@65] - SUCCEEDED testQuota
    [junit] 2017-02-26 13:58:39,454 [myid:] - INFO  [main:ZKTestCase$1@60] - FINISHED testQuota
    [junit] Tests run: 1, Failures: 0, Errors: 0, Time elapsed: 0.637 sec

fail.build.on.test.failure:

BUILD FAILED
/zonestorage/hudson_solaris/home/hudson/hudson-slave/workspace/ZooKeeper_branch34_solaris/build.xml:1328: The following error occurred while executing this line:
/zonestorage/hudson_solaris/home/hudson/hudson-slave/workspace/ZooKeeper_branch34_solaris/build.xml:1331: Tests failed!

Total time: 33 minutes 37 seconds
Build step 'Invoke Ant' marked build as failure
[locks-and-latches] Releasing all the locks
[locks-and-latches] All the locks released
Recording test results
Email was triggered for: Failure - Any
Sending email for trigger: Failure - Any



###################################################################################
############################## FAILED TESTS (if any) ##############################
1 tests failed.
FAILED:  org.apache.zookeeper.server.quorum.auth.QuorumKerberosHostBasedAuthTest.testValidCredentials

Error Message:
waiting for server 2 being up

Stack Trace:
junit.framework.AssertionFailedError: waiting for server 2 being up
	at org.apache.zookeeper.server.quorum.auth.QuorumAuthTestBase.startQuorum(QuorumAuthTestBase.java:74)
	at org.apache.zookeeper.server.quorum.auth.QuorumKerberosHostBasedAuthTest.testValidCredentials(QuorumKerberosHostBasedAuthTest.java:125)
	at org.apache.zookeeper.JUnit4ZKTestRunner$LoggedInvokeMethod.evaluate(JUnit4ZKTestRunner.java:55)



ZooKeeper_branch34_solaris - Build # 1485 - Still Failing

Posted by Apache Jenkins Server <je...@builds.apache.org>.
See https://builds.apache.org/job/ZooKeeper_branch34_solaris/1485/

###################################################################################
########################## LAST 60 LINES OF THE CONSOLE ###########################
[...truncated 25.25 MB...]
    [junit] 2017-02-25 13:58:09,454 [myid:] - INFO  [main:PrepRequestProcessor@764] - Shutting down
    [junit] 2017-02-25 13:58:09,454 [myid:] - INFO  [main:SyncRequestProcessor@208] - Shutting down
    [junit] 2017-02-25 13:58:09,454 [myid:] - INFO  [ProcessThread(sid:0 cport:11221)::PrepRequestProcessor@143] - PrepRequestProcessor exited loop!
    [junit] 2017-02-25 13:58:09,454 [myid:] - INFO  [SyncThread:0:SyncRequestProcessor@186] - SyncRequestProcessor exited!
    [junit] 2017-02-25 13:58:09,454 [myid:] - INFO  [main:FinalRequestProcessor@402] - shutdown of request processor complete
    [junit] 2017-02-25 13:58:09,455 [myid:] - INFO  [main:FourLetterWordMain@62] - connecting to 127.0.0.1 11221
    [junit] 2017-02-25 13:58:09,455 [myid:] - INFO  [main:JMXEnv@147] - ensureOnly:[]
    [junit] 2017-02-25 13:58:09,456 [myid:] - INFO  [main:ClientBase@445] - STARTING server
    [junit] 2017-02-25 13:58:09,456 [myid:] - INFO  [main:ClientBase@366] - CREATING server instance 127.0.0.1:11221
    [junit] 2017-02-25 13:58:09,457 [myid:] - INFO  [main:NIOServerCnxnFactory@89] - binding to port 0.0.0.0/0.0.0.0:11221
    [junit] 2017-02-25 13:58:09,457 [myid:] - INFO  [main:ClientBase@341] - STARTING server instance 127.0.0.1:11221
    [junit] 2017-02-25 13:58:09,458 [myid:] - INFO  [main:ZooKeeperServer@173] - Created server with tickTime 3000 minSessionTimeout 6000 maxSessionTimeout 60000 datadir /zonestorage/hudson_solaris/home/hudson/hudson-slave/workspace/ZooKeeper_branch34_solaris/build/test/tmp/test5610133150878147916.junit.dir/version-2 snapdir /zonestorage/hudson_solaris/home/hudson/hudson-slave/workspace/ZooKeeper_branch34_solaris/build/test/tmp/test5610133150878147916.junit.dir/version-2
    [junit] 2017-02-25 13:58:09,461 [myid:] - ERROR [main:ZooKeeperServer@472] - ZKShutdownHandler is not registered, so ZooKeeper server won't take any action on ERROR or SHUTDOWN server state changes
    [junit] 2017-02-25 13:58:09,462 [myid:] - INFO  [main:FourLetterWordMain@62] - connecting to 127.0.0.1 11221
    [junit] 2017-02-25 13:58:09,462 [myid:] - INFO  [NIOServerCxn.Factory:0.0.0.0/0.0.0.0:11221:NIOServerCnxnFactory@192] - Accepted socket connection from /127.0.0.1:50850
    [junit] 2017-02-25 13:58:09,463 [myid:] - INFO  [NIOServerCxn.Factory:0.0.0.0/0.0.0.0:11221:NIOServerCnxn@838] - Processing stat command from /127.0.0.1:50850
    [junit] 2017-02-25 13:58:09,463 [myid:] - INFO  [Thread-5:NIOServerCnxn$StatCommand@674] - Stat command output
    [junit] 2017-02-25 13:58:09,464 [myid:] - INFO  [Thread-5:NIOServerCnxn@1019] - Closed socket connection for client /127.0.0.1:50850 (no session established for client)
    [junit] 2017-02-25 13:58:09,464 [myid:] - INFO  [main:JMXEnv@230] - ensureParent:[InMemoryDataTree, StandaloneServer_port]
    [junit] 2017-02-25 13:58:09,465 [myid:] - INFO  [main:JMXEnv@247] - expect:InMemoryDataTree
    [junit] 2017-02-25 13:58:09,466 [myid:] - INFO  [main:JMXEnv@251] - found:InMemoryDataTree org.apache.ZooKeeperService:name0=StandaloneServer_port11221,name1=InMemoryDataTree
    [junit] 2017-02-25 13:58:09,466 [myid:] - INFO  [main:JMXEnv@247] - expect:StandaloneServer_port
    [junit] 2017-02-25 13:58:09,466 [myid:] - INFO  [main:JMXEnv@251] - found:StandaloneServer_port org.apache.ZooKeeperService:name0=StandaloneServer_port11221
    [junit] 2017-02-25 13:58:09,467 [myid:] - INFO  [main:JUnit4ZKTestRunner$LoggedInvokeMethod@58] - Memory used 9184
    [junit] 2017-02-25 13:58:09,467 [myid:] - INFO  [main:JUnit4ZKTestRunner$LoggedInvokeMethod@63] - Number of threads 20
    [junit] 2017-02-25 13:58:09,467 [myid:] - INFO  [main:JUnit4ZKTestRunner$LoggedInvokeMethod@78] - FINISHED TEST METHOD testQuota
    [junit] 2017-02-25 13:58:09,468 [myid:] - INFO  [main:ClientBase@522] - tearDown starting
    [junit] 2017-02-25 13:58:09,545 [myid:] - INFO  [main:ZooKeeper@684] - Session: 0x15a7590807f0000 closed
    [junit] 2017-02-25 13:58:09,545 [myid:] - INFO  [main-EventThread:ClientCnxn$EventThread@519] - EventThread shut down for session: 0x15a7590807f0000
    [junit] 2017-02-25 13:58:09,546 [myid:] - INFO  [main:ClientBase@492] - STOPPING server
    [junit] 2017-02-25 13:58:09,547 [myid:] - INFO  [main:ZooKeeperServer@505] - shutting down
    [junit] 2017-02-25 13:58:09,548 [myid:] - ERROR [main:ZooKeeperServer@472] - ZKShutdownHandler is not registered, so ZooKeeper server won't take any action on ERROR or SHUTDOWN server state changes
    [junit] 2017-02-25 13:58:09,548 [myid:] - INFO  [main:SessionTrackerImpl@225] - Shutting down
    [junit] 2017-02-25 13:58:09,548 [myid:] - INFO  [main:PrepRequestProcessor@764] - Shutting down
    [junit] 2017-02-25 13:58:09,548 [myid:] - INFO  [main:SyncRequestProcessor@208] - Shutting down
    [junit] 2017-02-25 13:58:09,548 [myid:] - INFO  [ProcessThread(sid:0 cport:11221)::PrepRequestProcessor@143] - PrepRequestProcessor exited loop!
    [junit] 2017-02-25 13:58:09,548 [myid:] - INFO  [SyncThread:0:SyncRequestProcessor@186] - SyncRequestProcessor exited!
    [junit] 2017-02-25 13:58:09,548 [myid:] - INFO  [main:FinalRequestProcessor@402] - shutdown of request processor complete
    [junit] 2017-02-25 13:58:09,549 [myid:] - INFO  [main:FourLetterWordMain@62] - connecting to 127.0.0.1 11221
    [junit] 2017-02-25 13:58:09,550 [myid:] - INFO  [main:JMXEnv@147] - ensureOnly:[]
    [junit] 2017-02-25 13:58:09,579 [myid:] - INFO  [main:ClientBase@547] - fdcount after test is: 95 at start it was 81
    [junit] 2017-02-25 13:58:09,580 [myid:] - INFO  [main:ClientBase@549] - sleeping for 20 secs
    [junit] 2017-02-25 13:58:09,581 [myid:] - INFO  [main:ZKTestCase$1@65] - SUCCEEDED testQuota
    [junit] 2017-02-25 13:58:09,581 [myid:] - INFO  [main:ZKTestCase$1@60] - FINISHED testQuota
    [junit] Tests run: 1, Failures: 0, Errors: 0, Time elapsed: 2.548 sec

fail.build.on.test.failure:

BUILD FAILED
/zonestorage/hudson_solaris/home/hudson/hudson-slave/workspace/ZooKeeper_branch34_solaris/build.xml:1328: The following error occurred while executing this line:
/zonestorage/hudson_solaris/home/hudson/hudson-slave/workspace/ZooKeeper_branch34_solaris/build.xml:1331: Tests failed!

Total time: 31 minutes 39 seconds
Build step 'Invoke Ant' marked build as failure
[locks-and-latches] Releasing all the locks
[locks-and-latches] All the locks released
Recording test results
Email was triggered for: Failure - Any
Sending email for trigger: Failure - Any



###################################################################################
############################## FAILED TESTS (if any) ##############################
2 tests failed.
FAILED:  org.apache.zookeeper.server.quorum.auth.QuorumKerberosHostBasedAuthTest.testValidCredentials

Error Message:
waiting for server 1 being up

Stack Trace:
junit.framework.AssertionFailedError: waiting for server 1 being up
	at org.apache.zookeeper.server.quorum.auth.QuorumAuthTestBase.startQuorum(QuorumAuthTestBase.java:74)
	at org.apache.zookeeper.server.quorum.auth.QuorumKerberosHostBasedAuthTest.testValidCredentials(QuorumKerberosHostBasedAuthTest.java:125)
	at org.apache.zookeeper.JUnit4ZKTestRunner$LoggedInvokeMethod.evaluate(JUnit4ZKTestRunner.java:55)


FAILED:  org.apache.zookeeper.server.quorum.auth.QuorumKerberosAuthTest.testValidCredentials

Error Message:
waiting for server 0 being up

Stack Trace:
junit.framework.AssertionFailedError: waiting for server 0 being up
	at org.apache.zookeeper.server.quorum.auth.QuorumAuthTestBase.startQuorum(QuorumAuthTestBase.java:74)
	at org.apache.zookeeper.server.quorum.auth.QuorumKerberosAuthTest.testValidCredentials(QuorumKerberosAuthTest.java:101)
	at org.apache.zookeeper.JUnit4ZKTestRunner$LoggedInvokeMethod.evaluate(JUnit4ZKTestRunner.java:55)



ZooKeeper_branch34_solaris - Build # 1484 - Still Failing

Posted by Apache Jenkins Server <je...@builds.apache.org>.
See https://builds.apache.org/job/ZooKeeper_branch34_solaris/1484/

###################################################################################
########################## LAST 60 LINES OF THE CONSOLE ###########################
[...truncated 25.57 MB...]
    [junit] 2017-02-24 13:59:31,614 [myid:] - INFO  [main:PrepRequestProcessor@764] - Shutting down
    [junit] 2017-02-24 13:59:31,615 [myid:] - INFO  [main:SyncRequestProcessor@208] - Shutting down
    [junit] 2017-02-24 13:59:31,615 [myid:] - INFO  [ProcessThread(sid:0 cport:11221)::PrepRequestProcessor@143] - PrepRequestProcessor exited loop!
    [junit] 2017-02-24 13:59:31,615 [myid:] - INFO  [SyncThread:0:SyncRequestProcessor@186] - SyncRequestProcessor exited!
    [junit] 2017-02-24 13:59:31,615 [myid:] - INFO  [main:FinalRequestProcessor@402] - shutdown of request processor complete
    [junit] 2017-02-24 13:59:31,615 [myid:] - INFO  [main:FourLetterWordMain@62] - connecting to 127.0.0.1 11221
    [junit] 2017-02-24 13:59:31,616 [myid:] - INFO  [main:JMXEnv@147] - ensureOnly:[]
    [junit] 2017-02-24 13:59:31,616 [myid:] - INFO  [main:ClientBase@445] - STARTING server
    [junit] 2017-02-24 13:59:31,617 [myid:] - INFO  [main:ClientBase@366] - CREATING server instance 127.0.0.1:11221
    [junit] 2017-02-24 13:59:31,617 [myid:] - INFO  [main:NIOServerCnxnFactory@89] - binding to port 0.0.0.0/0.0.0.0:11221
    [junit] 2017-02-24 13:59:31,617 [myid:] - INFO  [main:ClientBase@341] - STARTING server instance 127.0.0.1:11221
    [junit] 2017-02-24 13:59:31,618 [myid:] - INFO  [main:ZooKeeperServer@173] - Created server with tickTime 3000 minSessionTimeout 6000 maxSessionTimeout 60000 datadir /zonestorage/hudson_solaris/home/hudson/hudson-slave/workspace/ZooKeeper_branch34_solaris/build/test/tmp/test6612566389044951071.junit.dir/version-2 snapdir /zonestorage/hudson_solaris/home/hudson/hudson-slave/workspace/ZooKeeper_branch34_solaris/build/test/tmp/test6612566389044951071.junit.dir/version-2
    [junit] 2017-02-24 13:59:31,620 [myid:] - ERROR [main:ZooKeeperServer@472] - ZKShutdownHandler is not registered, so ZooKeeper server won't take any action on ERROR or SHUTDOWN server state changes
    [junit] 2017-02-24 13:59:31,620 [myid:] - INFO  [main:FourLetterWordMain@62] - connecting to 127.0.0.1 11221
    [junit] 2017-02-24 13:59:31,620 [myid:] - INFO  [NIOServerCxn.Factory:0.0.0.0/0.0.0.0:11221:NIOServerCnxnFactory@192] - Accepted socket connection from /127.0.0.1:36608
    [junit] 2017-02-24 13:59:31,621 [myid:] - INFO  [NIOServerCxn.Factory:0.0.0.0/0.0.0.0:11221:NIOServerCnxn@838] - Processing stat command from /127.0.0.1:36608
    [junit] 2017-02-24 13:59:31,621 [myid:] - INFO  [Thread-5:NIOServerCnxn$StatCommand@674] - Stat command output
    [junit] 2017-02-24 13:59:31,621 [myid:] - INFO  [Thread-5:NIOServerCnxn@1019] - Closed socket connection for client /127.0.0.1:36608 (no session established for client)
    [junit] 2017-02-24 13:59:31,621 [myid:] - INFO  [main:JMXEnv@230] - ensureParent:[InMemoryDataTree, StandaloneServer_port]
    [junit] 2017-02-24 13:59:31,622 [myid:] - INFO  [main:JMXEnv@247] - expect:InMemoryDataTree
    [junit] 2017-02-24 13:59:31,622 [myid:] - INFO  [main:JMXEnv@251] - found:InMemoryDataTree org.apache.ZooKeeperService:name0=StandaloneServer_port11221,name1=InMemoryDataTree
    [junit] 2017-02-24 13:59:31,623 [myid:] - INFO  [main:JMXEnv@247] - expect:StandaloneServer_port
    [junit] 2017-02-24 13:59:31,623 [myid:] - INFO  [main:JMXEnv@251] - found:StandaloneServer_port org.apache.ZooKeeperService:name0=StandaloneServer_port11221
    [junit] 2017-02-24 13:59:31,623 [myid:] - INFO  [main:JUnit4ZKTestRunner$LoggedInvokeMethod@58] - Memory used 9051
    [junit] 2017-02-24 13:59:31,623 [myid:] - INFO  [main:JUnit4ZKTestRunner$LoggedInvokeMethod@63] - Number of threads 20
    [junit] 2017-02-24 13:59:31,623 [myid:] - INFO  [main:JUnit4ZKTestRunner$LoggedInvokeMethod@78] - FINISHED TEST METHOD testQuota
    [junit] 2017-02-24 13:59:31,623 [myid:] - INFO  [main:ClientBase@522] - tearDown starting
    [junit] 2017-02-24 13:59:31,701 [myid:] - INFO  [main:ZooKeeper@684] - Session: 0x15a706b67000000 closed
    [junit] 2017-02-24 13:59:31,701 [myid:] - INFO  [main:ClientBase@492] - STOPPING server
    [junit] 2017-02-24 13:59:31,701 [myid:] - INFO  [main-EventThread:ClientCnxn$EventThread@519] - EventThread shut down for session: 0x15a706b67000000
    [junit] 2017-02-24 13:59:31,702 [myid:] - INFO  [main:ZooKeeperServer@505] - shutting down
    [junit] 2017-02-24 13:59:31,702 [myid:] - ERROR [main:ZooKeeperServer@472] - ZKShutdownHandler is not registered, so ZooKeeper server won't take any action on ERROR or SHUTDOWN server state changes
    [junit] 2017-02-24 13:59:31,703 [myid:] - INFO  [main:SessionTrackerImpl@225] - Shutting down
    [junit] 2017-02-24 13:59:31,703 [myid:] - INFO  [main:PrepRequestProcessor@764] - Shutting down
    [junit] 2017-02-24 13:59:31,703 [myid:] - INFO  [main:SyncRequestProcessor@208] - Shutting down
    [junit] 2017-02-24 13:59:31,703 [myid:] - INFO  [ProcessThread(sid:0 cport:11221)::PrepRequestProcessor@143] - PrepRequestProcessor exited loop!
    [junit] 2017-02-24 13:59:31,703 [myid:] - INFO  [SyncThread:0:SyncRequestProcessor@186] - SyncRequestProcessor exited!
    [junit] 2017-02-24 13:59:31,703 [myid:] - INFO  [main:FinalRequestProcessor@402] - shutdown of request processor complete
    [junit] 2017-02-24 13:59:31,704 [myid:] - INFO  [main:FourLetterWordMain@62] - connecting to 127.0.0.1 11221
    [junit] 2017-02-24 13:59:31,704 [myid:] - INFO  [main:JMXEnv@147] - ensureOnly:[]
    [junit] 2017-02-24 13:59:31,707 [myid:] - INFO  [main:ClientBase@547] - fdcount after test is: 95 at start it was 81
    [junit] 2017-02-24 13:59:31,707 [myid:] - INFO  [main:ClientBase@549] - sleeping for 20 secs
    [junit] 2017-02-24 13:59:31,707 [myid:] - INFO  [main:ZKTestCase$1@65] - SUCCEEDED testQuota
    [junit] 2017-02-24 13:59:31,707 [myid:] - INFO  [main:ZKTestCase$1@60] - FINISHED testQuota
    [junit] Tests run: 1, Failures: 0, Errors: 0, Time elapsed: 1.777 sec

fail.build.on.test.failure:

BUILD FAILED
/zonestorage/hudson_solaris/home/hudson/hudson-slave/workspace/ZooKeeper_branch34_solaris/build.xml:1328: The following error occurred while executing this line:
/zonestorage/hudson_solaris/home/hudson/hudson-slave/workspace/ZooKeeper_branch34_solaris/build.xml:1331: Tests failed!

Total time: 34 minutes 32 seconds
Build step 'Invoke Ant' marked build as failure
[locks-and-latches] Releasing all the locks
[locks-and-latches] All the locks released
Recording test results
Email was triggered for: Failure - Any
Sending email for trigger: Failure - Any



###################################################################################
############################## FAILED TESTS (if any) ##############################
1 tests failed.
FAILED:  org.apache.zookeeper.server.quorum.auth.QuorumKerberosAuthTest.testValidCredentials

Error Message:
waiting for server 2 being up

Stack Trace:
junit.framework.AssertionFailedError: waiting for server 2 being up
	at org.apache.zookeeper.server.quorum.auth.QuorumAuthTestBase.startQuorum(QuorumAuthTestBase.java:74)
	at org.apache.zookeeper.server.quorum.auth.QuorumKerberosAuthTest.testValidCredentials(QuorumKerberosAuthTest.java:101)
	at org.apache.zookeeper.JUnit4ZKTestRunner$LoggedInvokeMethod.evaluate(JUnit4ZKTestRunner.java:55)



ZooKeeper_branch34_solaris - Build # 1483 - Still Failing

Posted by Apache Jenkins Server <je...@builds.apache.org>.
See https://builds.apache.org/job/ZooKeeper_branch34_solaris/1483/

###################################################################################
########################## LAST 60 LINES OF THE CONSOLE ###########################
[...truncated 25.08 MB...]
    [junit] 2017-02-23 13:58:22,413 [myid:] - INFO  [main:PrepRequestProcessor@764] - Shutting down
    [junit] 2017-02-23 13:58:22,413 [myid:] - INFO  [main:SyncRequestProcessor@208] - Shutting down
    [junit] 2017-02-23 13:58:22,414 [myid:] - INFO  [ProcessThread(sid:0 cport:11221)::PrepRequestProcessor@143] - PrepRequestProcessor exited loop!
    [junit] 2017-02-23 13:58:22,414 [myid:] - INFO  [SyncThread:0:SyncRequestProcessor@186] - SyncRequestProcessor exited!
    [junit] 2017-02-23 13:58:22,414 [myid:] - INFO  [main:FinalRequestProcessor@402] - shutdown of request processor complete
    [junit] 2017-02-23 13:58:22,414 [myid:] - INFO  [main:FourLetterWordMain@62] - connecting to 127.0.0.1 11221
    [junit] 2017-02-23 13:58:22,415 [myid:] - INFO  [main:JMXEnv@147] - ensureOnly:[]
    [junit] 2017-02-23 13:58:22,415 [myid:] - INFO  [main:ClientBase@445] - STARTING server
    [junit] 2017-02-23 13:58:22,416 [myid:] - INFO  [main:ClientBase@366] - CREATING server instance 127.0.0.1:11221
    [junit] 2017-02-23 13:58:22,416 [myid:] - INFO  [main:NIOServerCnxnFactory@89] - binding to port 0.0.0.0/0.0.0.0:11221
    [junit] 2017-02-23 13:58:22,416 [myid:] - INFO  [main:ClientBase@341] - STARTING server instance 127.0.0.1:11221
    [junit] 2017-02-23 13:58:22,417 [myid:] - INFO  [main:ZooKeeperServer@173] - Created server with tickTime 3000 minSessionTimeout 6000 maxSessionTimeout 60000 datadir /zonestorage/hudson_solaris/home/hudson/hudson-slave/workspace/ZooKeeper_branch34_solaris/build/test/tmp/test1524573733394292484.junit.dir/version-2 snapdir /zonestorage/hudson_solaris/home/hudson/hudson-slave/workspace/ZooKeeper_branch34_solaris/build/test/tmp/test1524573733394292484.junit.dir/version-2
    [junit] 2017-02-23 13:58:22,419 [myid:] - ERROR [main:ZooKeeperServer@472] - ZKShutdownHandler is not registered, so ZooKeeper server won't take any action on ERROR or SHUTDOWN server state changes
    [junit] 2017-02-23 13:58:22,419 [myid:] - INFO  [main:FourLetterWordMain@62] - connecting to 127.0.0.1 11221
    [junit] 2017-02-23 13:58:22,419 [myid:] - INFO  [NIOServerCxn.Factory:0.0.0.0/0.0.0.0:11221:NIOServerCnxnFactory@192] - Accepted socket connection from /127.0.0.1:53533
    [junit] 2017-02-23 13:58:22,420 [myid:] - INFO  [NIOServerCxn.Factory:0.0.0.0/0.0.0.0:11221:NIOServerCnxn@838] - Processing stat command from /127.0.0.1:53533
    [junit] 2017-02-23 13:58:22,420 [myid:] - INFO  [Thread-5:NIOServerCnxn$StatCommand@674] - Stat command output
    [junit] 2017-02-23 13:58:22,420 [myid:] - INFO  [Thread-5:NIOServerCnxn@1019] - Closed socket connection for client /127.0.0.1:53533 (no session established for client)
    [junit] 2017-02-23 13:58:22,420 [myid:] - INFO  [main:JMXEnv@230] - ensureParent:[InMemoryDataTree, StandaloneServer_port]
    [junit] 2017-02-23 13:58:22,426 [myid:] - INFO  [main:JMXEnv@247] - expect:InMemoryDataTree
    [junit] 2017-02-23 13:58:22,426 [myid:] - INFO  [main:JMXEnv@251] - found:InMemoryDataTree org.apache.ZooKeeperService:name0=StandaloneServer_port11221,name1=InMemoryDataTree
    [junit] 2017-02-23 13:58:22,426 [myid:] - INFO  [main:JMXEnv@247] - expect:StandaloneServer_port
    [junit] 2017-02-23 13:58:22,426 [myid:] - INFO  [main:JMXEnv@251] - found:StandaloneServer_port org.apache.ZooKeeperService:name0=StandaloneServer_port11221
    [junit] 2017-02-23 13:58:22,426 [myid:] - INFO  [main:JUnit4ZKTestRunner$LoggedInvokeMethod@58] - Memory used 9183
    [junit] 2017-02-23 13:58:22,426 [myid:] - INFO  [main:JUnit4ZKTestRunner$LoggedInvokeMethod@63] - Number of threads 20
    [junit] 2017-02-23 13:58:22,427 [myid:] - INFO  [main:JUnit4ZKTestRunner$LoggedInvokeMethod@78] - FINISHED TEST METHOD testQuota
    [junit] 2017-02-23 13:58:22,427 [myid:] - INFO  [main:ClientBase@522] - tearDown starting
    [junit] 2017-02-23 13:58:22,510 [myid:] - INFO  [main:ZooKeeper@684] - Session: 0x15a6b43fb1b0000 closed
    [junit] 2017-02-23 13:58:22,510 [myid:] - INFO  [main-EventThread:ClientCnxn$EventThread@519] - EventThread shut down for session: 0x15a6b43fb1b0000
    [junit] 2017-02-23 13:58:22,510 [myid:] - INFO  [main:ClientBase@492] - STOPPING server
    [junit] 2017-02-23 13:58:22,510 [myid:] - INFO  [main:ZooKeeperServer@505] - shutting down
    [junit] 2017-02-23 13:58:22,511 [myid:] - ERROR [main:ZooKeeperServer@472] - ZKShutdownHandler is not registered, so ZooKeeper server won't take any action on ERROR or SHUTDOWN server state changes
    [junit] 2017-02-23 13:58:22,511 [myid:] - INFO  [main:SessionTrackerImpl@225] - Shutting down
    [junit] 2017-02-23 13:58:22,511 [myid:] - INFO  [main:PrepRequestProcessor@764] - Shutting down
    [junit] 2017-02-23 13:58:22,511 [myid:] - INFO  [main:SyncRequestProcessor@208] - Shutting down
    [junit] 2017-02-23 13:58:22,511 [myid:] - INFO  [ProcessThread(sid:0 cport:11221)::PrepRequestProcessor@143] - PrepRequestProcessor exited loop!
    [junit] 2017-02-23 13:58:22,511 [myid:] - INFO  [SyncThread:0:SyncRequestProcessor@186] - SyncRequestProcessor exited!
    [junit] 2017-02-23 13:58:22,511 [myid:] - INFO  [main:FinalRequestProcessor@402] - shutdown of request processor complete
    [junit] 2017-02-23 13:58:22,512 [myid:] - INFO  [main:FourLetterWordMain@62] - connecting to 127.0.0.1 11221
    [junit] 2017-02-23 13:58:22,512 [myid:] - INFO  [main:JMXEnv@147] - ensureOnly:[]
    [junit] 2017-02-23 13:58:22,515 [myid:] - INFO  [main:ClientBase@547] - fdcount after test is: 95 at start it was 81
    [junit] 2017-02-23 13:58:22,515 [myid:] - INFO  [main:ClientBase@549] - sleeping for 20 secs
    [junit] 2017-02-23 13:58:22,516 [myid:] - INFO  [main:ZKTestCase$1@65] - SUCCEEDED testQuota
    [junit] 2017-02-23 13:58:22,516 [myid:] - INFO  [main:ZKTestCase$1@60] - FINISHED testQuota
    [junit] Tests run: 1, Failures: 0, Errors: 0, Time elapsed: 1.283 sec

fail.build.on.test.failure:

BUILD FAILED
/zonestorage/hudson_solaris/home/hudson/hudson-slave/workspace/ZooKeeper_branch34_solaris/build.xml:1328: The following error occurred while executing this line:
/zonestorage/hudson_solaris/home/hudson/hudson-slave/workspace/ZooKeeper_branch34_solaris/build.xml:1331: Tests failed!

Total time: 33 minutes 20 seconds
Build step 'Invoke Ant' marked build as failure
[locks-and-latches] Releasing all the locks
[locks-and-latches] All the locks released
Recording test results
Email was triggered for: Failure - Any
Sending email for trigger: Failure - Any



###################################################################################
############################## FAILED TESTS (if any) ##############################
2 tests failed.
FAILED:  org.apache.zookeeper.server.quorum.auth.QuorumKerberosAuthTest.testValidCredentials

Error Message:
waiting for server 1 being up

Stack Trace:
junit.framework.AssertionFailedError: waiting for server 1 being up
	at org.apache.zookeeper.server.quorum.auth.QuorumAuthTestBase.startQuorum(QuorumAuthTestBase.java:74)
	at org.apache.zookeeper.server.quorum.auth.QuorumKerberosAuthTest.testValidCredentials(QuorumKerberosAuthTest.java:101)
	at org.apache.zookeeper.JUnit4ZKTestRunner$LoggedInvokeMethod.evaluate(JUnit4ZKTestRunner.java:55)


FAILED:  org.apache.zookeeper.test.ReadOnlyModeTest.testSessionEstablishment

Error Message:
KeeperErrorCode = ConnectionLoss for /test

Stack Trace:
org.apache.zookeeper.KeeperException$ConnectionLossException: KeeperErrorCode = ConnectionLoss for /test
	at org.apache.zookeeper.KeeperException.create(KeeperException.java:99)
	at org.apache.zookeeper.KeeperException.create(KeeperException.java:51)
	at org.apache.zookeeper.ZooKeeper.create(ZooKeeper.java:783)
	at org.apache.zookeeper.test.ReadOnlyModeTest.testSessionEstablishment(ReadOnlyModeTest.java:216)
	at org.apache.zookeeper.JUnit4ZKTestRunner$LoggedInvokeMethod.evaluate(JUnit4ZKTestRunner.java:55)